opencv配置不成功问题 3C

我按照网上和csdn一些博客上的教程配置opencv 3.2+vs2015,总是不成功,后来换成3.1也不成功,include都会出错,不知道什么原因,求大神解答。
网上的全是告诉我先配置环境变量、配置VC++的库目录还有包含目录,还有链接器的附加依赖项神马的,可还是配置不成功,头文件总是include不进去。。。![![图片说明](https://img-ask.csdn.net/upload/201702/11/1486783510_475176.png)图片说明](https://img-ask.csdn.net/upload/201702/11/1486783279_389459.png)图片说明

3个回答

OPENCV3.2只支持VS2015 X64环境,其实配置起来各个版本都差不多,进入环境变量里面找到Path项在后面添加opencv的bin目录路径,在OPENCV属性页做相应配置,注意包含目录需要有include,以及里面的opencv,opencv2三个文件夹的路径,lib路径只有一个,还有就是在链接器-输入目录下添加opencv_world320.lib(对应release模式)或opencv_world320d.lib(对应debug模式),这样就没问题了。
注意要选择x64编译环境

3.2的没用过,环境变量和包含路径选X86试试,老版本的不管系统是32位还是64位,路径目录都是选择X86,因为编译都是使用32位编译;如果选用X64,则程序运行时候会出错。

Csdn user default icon
上传中...
上传图片
插入图片
抄袭、复制答案,以达到刷声望分或其他目的的行为,在CSDN问答是严格禁止的,一经发现立刻封号。是时候展现真正的技术了!
其他相关推荐
大神们帮帮忙,opencv配置编译不成功(要哭了)
win7在vs2010上配置opencv3.0 按网上教程配置好了环境变量以及vs2010 输入opencv的一个小程序: #include <opencv2\opencv.hpp> #include<iostream> using namespace cv; void main() { IplImage *src; src = cvLoadImage("lena.jpg"); //这里将lena.jpg和lena.cpp文件放在同一个文件夹下 cvNamedWindow("lena",CV_WINDOW_AUTOSIZE); cvShowImage("lena",src); cvWaitKey(0); cvDestroyWindow("lena"); cvReleaseImage(&src); } 编译结果: 1>------ Build started: Project: lena, Configuration: Debug Win32 ------ 1>Build started 2015/3/9 9:06:02. 1>InitializeBuildStatus: 1> Touching "Debug\lena.unsuccessfulbuild". 1>ClCompile: 1> lena.cpp 1>d:\opencv\build\include\opencv2\core\mat.hpp(1413): warning C4819: The file contains a character that cannot be represented in the current code page (936). Save the file in Unicode format to prevent data loss 1>d:\opencv\build\include\opencv2\core\mat.hpp(1413): warning C4819: The file contains a character that cannot be represented in the current code page (936). Save the file in Unicode format to prevent data loss 1>c:\users\apple\desktop\documents\visual studio 2010\projects\lena\lena\lena.cpp(6): error C2065: 'IplImage' : undeclared identifier 1>c:\users\apple\desktop\documents\visual studio 2010\projects\lena\lena\lena.cpp(6): error C2065: 'src' : undeclared identifier 1>c:\users\apple\desktop\documents\visual studio 2010\projects\lena\lena\lena.cpp(7): error C2065: 'src' : undeclared identifier 1>c:\users\apple\desktop\documents\visual studio 2010\projects\lena\lena\lena.cpp(7): error C3861: 'cvLoadImage': identifier not found 1>c:\users\apple\desktop\documents\visual studio 2010\projects\lena\lena\lena.cpp(8): error C2065: 'CV_WINDOW_AUTOSIZE' : undeclared identifier 1>c:\users\apple\desktop\documents\visual studio 2010\projects\lena\lena\lena.cpp(8): error C3861: 'cvNamedWindow': identifier not found 1>c:\users\apple\desktop\documents\visual studio 2010\projects\lena\lena\lena.cpp(9): error C2065: 'src' : undeclared identifier 1>c:\users\apple\desktop\documents\visual studio 2010\projects\lena\lena\lena.cpp(9): error C3861: 'cvShowImage': identifier not found 1>c:\users\apple\desktop\documents\visual studio 2010\projects\lena\lena\lena.cpp(10): error C3861: 'cvWaitKey': identifier not found 1>c:\users\apple\desktop\documents\visual studio 2010\projects\lena\lena\lena.cpp(11): error C3861: 'cvDestroyWindow': identifier not found 1>c:\users\apple\desktop\documents\visual studio 2010\projects\lena\lena\lena.cpp(12): error C2065: 'src' : undeclared identifier 1>c:\users\apple\desktop\documents\visual studio 2010\projects\lena\lena\lena.cpp(12): error C3861: 'cvReleaseImage': identifier not found 1> 1>Build FAILED. 1> 1>Time Elapsed 00:00:02.25 ========== Build: 0 succeeded, 1 failed, 0 up-to-date, 0 skipped ========== 然后尝试输入: #include <stdio.h> #include <iostream> int main() { printf("Hello world!"); return 0; } 编译也不成功 1>------ Build started: Project: lena, Configuration: Debug Win32 ------ 1>Build started 2015/3/9 9:12:16. 1>InitializeBuildStatus: 1> Touching "Debug\lena.unsuccessfulbuild". 1>ClCompile: 1> lena.cpp 1>ManifestResourceCompile: 1> All outputs are up-to-date. 1>LINK : fatal error LNK1104: cannot open file 'opencv_calib3d300.lib' 1> 1>Build FAILED. 1> 1>Time Elapsed 00:00:03.02 ========== Build: 0 succeeded, 1 failed, 0 up-to-date, 0 skipped ========== 为什么啊55555~,版本号也是对的呀,为什么打不开opencv_calib3d300.lib
opencv配置成功后,进行测试时出错
CMake Warning at /home/obvious/opencv/cmake/OpenCVConfig.cmake:166 (message): Found OpenCV Windows Pack but it has no binaries compatible with your configuration. You should manually point CMake variable OpenCV_DIR to your build of OpenCV library. Call Stack (most recent call first): CMakeLists.txt:10 (find_package) CMake Error at CMakeLists.txt:10 (find_package): Found package configuration file: /home/obvious/opencv/cmake/OpenCVConfig.cmake but it set OpenCV_FOUND to FALSE so package "OpenCV" is considered to be NOT FOUND. ![图片说明](https://img-ask.csdn.net/upload/201703/05/1488699720_108187.png)
opencv安装不成功,求大神们指点!!
为啥配置opencv2.4.4后,用VS2012运行下面代码时会出现“fatal error LNK1112: 模块计算机类型“X86”与目标计算机类型“x64”冲突”? #define _CRT_SECURE_NO_DEPRECATE #include <iostream> #include "opencv/cv.h" #include "opencv/cxcore.h" #include "opencv/highgui.h" #include "opencv/cvwimage.h" using namespace std; int _tmain(int argc,char* argv[]) { IplImage* img = cvLoadImage("D:\\Jellyfish.jpg"); cvNamedWindow("example1",CV_WINDOW_AUTOSIZE); cvShowImage("example1",img); cvWaitKey(0); cvReleaseImage(&img); cvDestroyWindow("example1"); return 0; }
opencv3.0+VS2013配置出错
亲们,配置opencv总是出错啊,所有的链接库我都配置好几遍了,还是有问题啊 1>------ 已启动生成: 项目: opencv_test, 配置: Debug Win32 ------ 1>LINK : fatal error LNK1104: 无法打开文件“opencv_ts300d.obj” ========== 生成: 成功 0 个,失败 1 个,最新 0 个,跳过 0 个 ==========
在ubuntu下配置opencv,cmake成功了,而make时候报错
1 [ 6%] Generating precomp.hpp.gch/opencv_core_Release.gch 2 In file included from /usr/include/c++/6/bits/stl_algo.h:59:0, 3 from /usr/include/c++/6/algorithm:62, 4 from /opt/opencv/opencv-3.1.0/modules/core/include/opencv2/core/base.hpp:53, 5 from /opt/opencv/opencv-3.1.0/modules/core/include/opencv2/core.hpp:54, 6 from /opt/opencv/opencv-3.1.0/modules/core/include/opencv2/core/utility.hpp:52, 7 from /opt/opencv/build/modules/core/precomp.hpp:49: 8 /usr/include/c++/6/cstdlib:75:25: fatal error: stdlib.h: 没有那个文件或目录 9 #include_next <stdlib.h> 10 ^ 11 compilation terminated. 12 modules/core/CMakeFiles/pch_Generate_opencv_core.dir/build.make:62: recipe for target 'modules/core/precomp.hpp.gch/opencv_core_Release.gch' failed 13 make[2]: *** [modules/core/precomp.hpp.gch/opencv_core_Release.gch] Error 1 14 CMakeFiles/Makefile2:1178: recipe for target 'modules/core/CMakeFiles/pch_Generate_opencv_core.dir/all' failed 15 make[1]: *** [modules/core/CMakeFiles/pch_Generate_opencv_core.dir/all] Error 2 16 Makefile:160: recipe for target 'all' failed 17 make: *** [all] Error 2 ![图片说明](https://img-ask.csdn.net/upload/201703/03/1488542516_717767.png)
初次配置opencv2.4.2和vs2010配置不成功,求助!!!!
初次学习opencv在配置的时候详细的按照教程来配置的,程序编译也没有问题; 最后运行的时候提示出现以下错误: “opencvtest.exe”: 已加载“D:\vision\opencvtest\Debug\opencvtest.exe”,已加载符号。 “opencvtest.exe”: 已加载“C:\Windows\SysWOW64\ntdll.dll”,已加载符号(去除源信息)。 “opencvtest.exe”: 已加载“C:\Windows\SysWOW64\kernel32.dll”,已加载符号(去除源信息)。 “opencvtest.exe”: 已加载“C:\Windows\SysWOW64\KernelBase.dll”,已加载符号(去除源信息)。 “opencvtest.exe”: 已加载“C:\Windows\SysWOW64\opencv_core242d.dll”,Cannot find or open the PDB file “opencvtest.exe”: 已加载“C:\Windows\SysWOW64\msvcp100d.dll”,已加载符号(去除源信息)。 程序“[6332] opencvtest.exe: 本机”已退出,返回值为 -1073741701 (0xc000007b)![图片说明](https://img-ask.csdn.net/upload/201709/23/1506168670_700950.png)。 这个要怎么解决啊?困扰一下午了,希望大神们带带我这个新手!
opencv求助,安装问题?!
我配置了一下opencv的环境,里面的例子都可以运行,但是没有找到 libcv.so libcvaux.so libcxcore.so libhighgui.so libml.so这些库只有一些libavutil.so.50 libopencv_calib3d.so之类的请问我这是成功了还是失败???
opencv3.2配置contrib
自己配置opencv3.2+vs2015+contrib老是出错,求做过的大神分享一个cmake成功后用来放置合成的工程的输出文件夹,这样我可以直接配置。万分感谢,急!急!!
JavaWeb servlet中调用opencv类库的问题?
我想在servlet 中调用的opencv , 由于我已经通过Java的main方法成功配置并且已经调用成功啦,但是用在servlet里面通过浏览器访问servlet就会报加载类库失败的错误 , 错误如下: java.lang.UnsatisfiedLinkError: no opencv_java247 in java.library.path java.lang.ClassLoader.loadLibrary(ClassLoader.java:1709) java.lang.Runtime.loadLibrary0(Runtime.java:823) java.lang.System.loadLibrary(System.java:1030) opencv.Code.image_proc2(Code.java:100) opencv.Code.go(Code.java:51) PhpServlet.doGet(PhpServlet.java:21) javax.servlet.http.HttpServlet.service(HttpServlet.java:617) javax.servlet.http.HttpServlet.service(HttpServlet.java:717) 请各位大神指教 , 急急急。。。。。
opencv3.1+win10+vs2013配置问题
新手一枚,配置了两天了,一直都没成功 直接上配置的图吧,一直都是提示无法打开opencv_world310d.dll ![图片说明](https://img-ask.csdn.net/upload/201608/25/1472114623_950772.png) ![图片说明](https://img-ask.csdn.net/upload/201608/25/1472114648_77517.png) ![图片说明](https://img-ask.csdn.net/upload/201608/25/1472114656_534691.png) 代码是这段 #include<opencv2/opencv.hpp> using namespace cv; int main() { Mat picture = imread("D://zhifubao.jpg"); imshow("测试程序", picture); waitKey(0); } 有人知道问题出在哪里么?
VS2010配置Opencv出现fatal error LNK1107错误
程序代码如下: #include<iostream> #include <opencv2/core/core.hpp> #include <opencv2/highgui/highgui.hpp> using namespace cv; int main() { // 读入一张图片(游戏原画) Mat img=imread("pic.jpg"); // 创建一个名为 "游戏原画"窗口 namedWindow("游戏原画"); // 在窗口中显示游戏原画 imshow("游戏原画",img); // 等待6000 ms后窗口自动关闭 waitKey(6000); } 错误信息如下: 1>------ 已启动生成: 项目: OPENCV2, 配置: Debug Win32 ------ 1>生成启动时间为 2017/4/15 14:03:32。 1>InitializeBuildStatus: 1> 正在对“Debug\OPENCV2.unsuccessfulbuild”执行 Touch 任务。 1>ClCompile: 1> 所有输出均为最新。 1>ManifestResourceCompile: 1> 所有输出均为最新。 1>D:\Opencv\opencv\build\x64\vc10\lib\OpenCVConfig.cmake : fatal error LNK1107: 文件无效或损坏: 无法在 0x3642 处读取 1> 1>生成失败。 1> 1>已用时间 00:00:00.09 ========== 生成: 成功 0 个,失败 1 个,最新 0 个,跳过 0 个 ==========
在Win10 VS2015下配置opencv3.3出问题
我按百度上的配置完后,跑一段代码来测试是否配置成功 ``` #include <opencv.hpp> #include <iostream> using namespace cv; using namespace std; int main() { cout << "OpenCV Version: " << CV_VERSION << endl; Mat img = imread("img.jpg"); imshow("img", img); waitKey(0); return 0; } ``` 结果报了这么多问题,程序可以运行,但是窗口一闪而过,看不到图片,打开exe文件就会报错而中止 'computer vision1.exe' (Win32): Loaded 'C:\C++ 试作品\VS2015 Project\MFC 工程\computer vision1\x64\Debug\computer vision1.exe'. Symbols loaded. 'computer vision1.exe' (Win32): Loaded 'C:\Windows\System32\ntdll.dll'. Cannot find or open the PDB file. 'computer vision1.exe' (Win32): Loaded 'C:\Windows\System32\kernel32.dll'. Cannot find or open the PDB file. 'computer vision1.exe' (Win32): Loaded 'C:\Windows\System32\KernelBase.dll'. Cannot find or open the PDB file. 'computer vision1.exe' (Win32): Loaded 'C:\Windows\System32\vcruntime140d.dll'. Cannot find or open the PDB file. 'computer vision1.exe' (Win32): Loaded 'C:\Windows\System32\opencv_world330d.dll'. Cannot find or open the PDB file. 'computer vision1.exe' (Win32): Loaded 'C:\Windows\System32\msvcp140d.dll'. Cannot find or open the PDB file. 'computer vision1.exe' (Win32): Loaded 'C:\Windows\System32\opencv_world330.dll'. Cannot find or open the PDB file. 'computer vision1.exe' (Win32): Loaded 'C:\Windows\System32\ucrtbased.dll'. Cannot find or open the PDB file. 'computer vision1.exe' (Win32): Loaded 'C:\Windows\System32\user32.dll'. Cannot find or open the PDB file. 'computer vision1.exe' (Win32): Loaded 'C:\Windows\System32\gdi32.dll'. Cannot find or open the PDB file. 'computer vision1.exe' (Win32): Loaded 'C:\Windows\System32\win32u.dll'. Cannot find or open the PDB file. 'computer vision1.exe' (Win32): Loaded 'C:\Windows\System32\gdi32full.dll'. Cannot find or open the PDB file. 'computer vision1.exe' (Win32): Loaded 'C:\Windows\System32\ole32.dll'. Cannot find or open the PDB file. 'computer vision1.exe' (Win32): Loaded 'C:\Windows\System32\combase.dll'. Cannot find or open the PDB file. 'computer vision1.exe' (Win32): Loaded 'C:\Windows\System32\oleaut32.dll'. Cannot find or open the PDB file. 'computer vision1.exe' (Win32): Loaded 'C:\Windows\System32\ucrtbase.dll'. Cannot find or open the PDB file. 'computer vision1.exe' (Win32): Loaded 'C:\Windows\System32\msvcp_win.dll'. Cannot find or open the PDB file. 'computer vision1.exe' (Win32): Loaded 'C:\Windows\System32\rpcrt4.dll'. Cannot find or open the PDB file. 'computer vision1.exe' (Win32): Loaded 'C:\Windows\System32\comdlg32.dll'. Cannot find or open the PDB file. 'computer vision1.exe' (Win32): Loaded 'C:\Windows\System32\msvcrt.dll'. Cannot find or open the PDB file. 'computer vision1.exe' (Win32): Loaded 'C:\Windows\System32\bcryptprimitives.dll'. Cannot find or open the PDB file. 'computer vision1.exe' (Win32): Loaded 'C:\Windows\System32\sechost.dll'. Cannot find or open the PDB file. 'computer vision1.exe' (Win32): Loaded 'C:\Windows\System32\SHCore.dll'. Cannot find or open the PDB file. 'computer vision1.exe' (Win32): Loaded 'C:\Windows\System32\advapi32.dll'. Cannot find or open the PDB file. 'computer vision1.exe' (Win32): Loaded 'C:\Windows\System32\shlwapi.dll'. Cannot find or open the PDB file. 'computer vision1.exe' (Win32): Loaded 'C:\Windows\System32\shell32.dll'. Cannot find or open the PDB file. 'computer vision1.exe' (Win32): Loaded 'C:\Windows\System32\msvfw32.dll'. Cannot find or open the PDB file. 'computer vision1.exe' (Win32): Loaded 'C:\Windows\System32\avicap32.dll'. Cannot find or open the PDB file. 'computer vision1.exe' (Win32): Loaded 'C:\Windows\System32\avifil32.dll'. Cannot find or open the PDB file. 'computer vision1.exe' (Win32): Loaded 'C:\Windows\System32\cfgmgr32.dll'. Cannot find or open the PDB file. 'computer vision1.exe' (Win32): Loaded 'C:\Windows\System32\winmm.dll'. Cannot find or open the PDB file. 'computer vision1.exe' (Win32): Loaded 'C:\Windows\System32\winmmbase.dll'. Cannot find or open the PDB file. 'computer vision1.exe' (Win32): Loaded 'C:\Windows\System32\windows.storage.dll'. Cannot find or open the PDB file. 'computer vision1.exe' (Win32): Loaded 'C:\Windows\System32\powrprof.dll'. Cannot find or open the PDB file. 'computer vision1.exe' (Win32): Loaded 'C:\Windows\System32\concrt140d.dll'. Cannot find or open the PDB file. 'computer vision1.exe' (Win32): Loaded 'C:\Windows\WinSxS\amd64_microsoft.windows.common-controls_6595b64144ccf1df_5.82.14393.447_none_0d5aa7fbb6d35646\comctl32.dll'. Cannot find or open the PDB file. 'computer vision1.exe' (Win32): Loaded 'C:\Windows\WinSxS\amd64_microsoft.windows.common-controls_6595b64144ccf1df_5.82.14393.447_none_0d5aa7fbb6d35646\comctl32.dll'. Cannot find or open the PDB file. 'computer vision1.exe' (Win32): Loaded 'C:\Windows\System32\kernel.appcore.dll'. Cannot find or open the PDB file. 'computer vision1.exe' (Win32): Loaded 'C:\Windows\System32\profapi.dll'. Cannot find or open the PDB file. 'computer vision1.exe' (Win32): Loaded 'C:\Windows\System32\msacm32.dll'. Cannot find or open the PDB file. 'computer vision1.exe' (Win32): Unloaded 'C:\Windows\WinSxS\amd64_microsoft.windows.common-controls_6595b64144ccf1df_5.82.14393.447_none_0d5aa7fbb6d35646\comctl32.dll' 'computer vision1.exe' (Win32): Loaded 'C:\Windows\System32\msvcp140.dll'. Cannot find or open the PDB file. 'computer vision1.exe' (Win32): Loaded 'C:\Windows\System32\vcruntime140.dll'. Cannot find or open the PDB file. 'computer vision1.exe' (Win32): Loaded 'C:\Windows\System32\concrt140.dll'. Cannot find or open the PDB file. 'computer vision1.exe' (Win32): Loaded 'C:\Windows\System32\imm32.dll'. Cannot find or open the PDB file. 'computer vision1.exe' (Win32): Loaded 'C:\Windows\System32\uxtheme.dll'. Cannot find or open the PDB file. 'computer vision1.exe' (Win32): Loaded 'C:\Windows\System32\msctf.dll'. Cannot find or open the PDB file. 'computer vision1.exe' (Win32): Loaded 'C:\Windows\System32\dwmapi.dll'. Cannot find or open the PDB file. 'computer vision1.exe' (Win32): Loaded 'C:\Windows\System32\OpenCL.DLL'. Cannot find or open the PDB file. 'computer vision1.exe' (Win32): Loaded 'C:\Windows\System32\DriverStore\FileRepository\igdlh64.inf_amd64_e1474e9d5907af3f\IntelOpenCL64.dll'. Cannot find or open the PDB file. 'computer vision1.exe' (Win32): Loaded 'C:\Program Files (x86)\Common Files\Intel\OpenCL\bin\x64\intelocl64.dll'. Cannot find or open the PDB file. 'computer vision1.exe' (Win32): Loaded 'C:\Windows\System32\opengl32.dll'. Cannot find or open the PDB file. 'computer vision1.exe' (Win32): Loaded 'C:\Program Files (x86)\Common Files\Intel\OpenCL\bin\x64\task_executor64.dll'. Cannot find or open the PDB file. 'computer vision1.exe' (Win32): Loaded 'C:\Windows\System32\ddraw.dll'. Cannot find or open the PDB file. 'computer vision1.exe' (Win32): Loaded 'C:\Windows\System32\dciman32.dll'. Cannot find or open the PDB file. 'computer vision1.exe' (Win32): Loaded 'C:\Windows\System32\glu32.dll'. Cannot find or open the PDB file. 'computer vision1.exe' (Win32): Loaded 'C:\Program Files (x86)\Common Files\Intel\OpenCL\bin\x64\cpu_device64.dll'. Cannot find or open the PDB file. 'computer vision1.exe' (Win32): Loaded 'C:\Windows\System32\version.dll'. Cannot find or open the PDB file. 'computer vision1.exe' (Win32): Loaded 'C:\Windows\System32\DriverStore\FileRepository\igdlh64.inf_amd64_e1474e9d5907af3f\igdrcl64.dll'. Cannot find or open the PDB file. 'computer vision1.exe' (Win32): Loaded 'C:\Windows\System32\dxgi.dll'. Cannot find or open the PDB file. 'computer vision1.exe' (Win32): Loaded 'C:\Windows\System32\ResourcePolicyClient.dll'. Cannot find or open the PDB file. 'computer vision1.exe' (Win32): Unloaded 'C:\Windows\System32\ResourcePolicyClient.dll' 'computer vision1.exe' (Win32): Loaded 'C:\Windows\System32\DriverStore\FileRepository\igdlh64.inf_amd64_e1474e9d5907af3f\igdfcl64.dll'. Cannot find or open the PDB file. 'computer vision1.exe' (Win32): Loaded 'C:\Windows\System32\DriverStore\FileRepository\igdlh64.inf_amd64_e1474e9d5907af3f\igdmcl64.dll'. Cannot find or open the PDB file. 'computer vision1.exe' (Win32): Loaded 'C:\Windows\System32\dbghelp.dll'. Cannot find or open the PDB file. 'computer vision1.exe' (Win32): Loaded 'C:\Windows\System32\DriverStore\FileRepository\igdlh64.inf_amd64_e1474e9d5907af3f\igc64.dll'. Cannot find or open the PDB file. The thread 0x1cd4 has exited with code 0 (0x0). The thread 0x1750 has exited with code 0 (0x0). The thread 0x3668 has exited with code 0 (0x0). The thread 0x2b88 has exited with code 0 (0x0). The program '[6504] computer vision1.exe' has exited with code 0 (0x0).
vs2019配置opencv3.4.5和opencv_contrib-3.4.5编译成功后生成install报错
按照网上的教程cmake成功了,重新生成解决方案也成功了,现在点仅生成install报错,很多回答都是管理员权限,我试了没有用,到底是什么问题啊?卡在这里很长时间了
用cmake编译opencv3.4.0后无法找到opencv_world340.lib 的问题
按照网上给的操作做到了最后一部添加依赖项的时候要求添加”opencv_ts340.lib opencv_world340.lib “这些文件,然而惊讶的发现x86->vc11-lib里面没有这些文件,只有其它的lib。怎么办呢?编译都显示成功的呀。 以下是试运行的代码 #include<iostream> #include <opencv2/core/core.hpp> #include <opencv2/highgui/highgui.hpp> using namespace cv; int main() { // 读入一张图片(游戏原画) Mat img = imread("pic.jpg"); // 创建一个名为 "游戏原画"窗口 namedWindow("游戏原画"); // 在窗口中显示游戏原画 imshow("游戏原画", img); // 等待6000 ms后窗口自动关闭 waitKey(6000); }
vs2013,opencv 2.4.8怎么配置都弄不好
楼主是一名菜鸟。近来在配置opencv屡屡受挫,在网上试了n个版本的教程都没成功过 始终一编译 “1 error C1083: 无法打开包括文件: “opencv2\opencv.hpp”: No such file or directory c:\users\hzy\documents\visual studio 2013\projects\test\test\test.cpp 1 1 test” 老是这样子,不知道这里可以上图
opencv3.0.0生成成功 但是vs2013intellisense报100个错误
opencv3.0.0生成成功,测试图片运行时也能正常显示,但是vs2013环境下intellisense会提示100个莫名其妙的错误,如果新建新项目同样是会报100个与下列错误一样的错误,同样可以生成成功,也可以运行,到底是什么原因呢?**** 编程环境为win7 64位专业版+opencv3.0.0+visual studio2013 Intellisense100个错误如下所示:**** opencv3.0.0生成成功,测试图片运行时也能正常显示,但是vs2013环境下intellisense会提示100个莫名其妙的错误,如果新建新项目同样是会报100个与下列错误一样的错误,同样可以生成成功,也可以运行,到底是什么原因呢?**** 编程环境为win7 64位专业版+opencv3.0.0+visual studio2013 Intellisense100个错误如下所示:**** 16 IntelliSense: “operator=”必须是成员函数 c:\Program Files (x86)\Microsoft Visual Studio 12.0\VC\include\sstream 72 8 Project1 59 IntelliSense: “operator=”必须是成员函数 c:\Program Files (x86)\Microsoft Visual Studio 12.0\VC\include\sstream 440 8 Project1 71 IntelliSense: “operator=”必须是成员函数 c:\Program Files (x86)\Microsoft Visual Studio 12.0\VC\include\sstream 533 8 Project1 83 IntelliSense: “operator=”必须是成员函数 c:\Program Files (x86)\Microsoft Visual Studio 12.0\VC\include\sstream 632 8 Project1 2 IntelliSense: Ptr 不是模板 f:\opencv\build\include\opencv2\core\operations.hpp 371 1 Project1 6 IntelliSense: 不允许使用类型名 f:\opencv\build\include\opencv2\core\operations.hpp 377 15 Project1 29 IntelliSense: 此声明没有存储类或类型说明符 c:\Program Files (x86)\Microsoft Visual Studio 12.0\VC\include\sstream 149 4 Project1 37 IntelliSense: 此声明没有存储类或类型说明符 c:\Program Files (x86)\Microsoft Visual Studio 12.0\VC\include\sstream 182 4 Project1 96 IntelliSense: 此声明没有存储类或类型说明符 f:\opencv\build\include\opencv2\core\utility.hpp 889 35 Project1 97 IntelliSense: 此声明没有存储类或类型说明符 f:\opencv\build\include\opencv2\core\persistence.hpp 1195 42 Project1 24 IntelliSense: 非成员函数上不允许使用类型限定符 c:\Program Files (x86)\Microsoft Visual Studio 12.0\VC\include\sstream 92 15 Project1 64 IntelliSense: 非成员函数上不允许使用类型限定符 c:\Program Files (x86)\Microsoft Visual Studio 12.0\VC\include\sstream 446 17 Project1 66 IntelliSense: 非成员函数上不允许使用类型限定符 c:\Program Files (x86)\Microsoft Visual Studio 12.0\VC\include\sstream 451 15 Project1 76 IntelliSense: 非成员函数上不允许使用类型限定符 c:\Program Files (x86)\Microsoft Visual Studio 12.0\VC\include\sstream 539 17 Project1 78 IntelliSense: 非成员函数上不允许使用类型限定符 c:\Program Files (x86)\Microsoft Visual Studio 12.0\VC\include\sstream 544 15 Project1 88 IntelliSense: 非成员函数上不允许使用类型限定符 c:\Program Files (x86)\Microsoft Visual Studio 12.0\VC\include\sstream 638 17 Project1 90 IntelliSense: 非成员函数上不允许使用类型限定符 c:\Program Files (x86)\Microsoft Visual Studio 12.0\VC\include\sstream 643 15 Project1 20 IntelliSense: 后面有“::”的名称一定是类名或命名空间名 c:\Program Files (x86)\Microsoft Visual Studio 12.0\VC\include\sstream 88 19 Project1 21 IntelliSense: 后面有“::”的名称一定是类名或命名空间名 c:\Program Files (x86)\Microsoft Visual Studio 12.0\VC\include\sstream 89 19 Project1 22 IntelliSense: 后面有“::”的名称一定是类名或命名空间名 c:\Program Files (x86)\Microsoft Visual Studio 12.0\VC\include\sstream 90 19 Project1 34 IntelliSense: 后面有“::”的名称一定是类名或命名空间名 c:\Program Files (x86)\Microsoft Visual Studio 12.0\VC\include\sstream 152 21 Project1 39 IntelliSense: 后面有“::”的名称一定是类名或命名空间名 c:\Program Files (x86)\Microsoft Visual Studio 12.0\VC\include\sstream 184 5 Project1 41 IntelliSense: 后面有“::”的名称一定是类名或命名空间名 c:\Program Files (x86)\Microsoft Visual Studio 12.0\VC\include\sstream 184 23 Project1 53 IntelliSense: 后面有“::”的名称一定是类名或命名空间名 c:\Program Files (x86)\Microsoft Visual Studio 12.0\VC\include\sstream 353 22 Project1 4 IntelliSense: 仅函数声明中允许内联说明符 f:\opencv\build\include\opencv2\core\operations.hpp 376 8 Project1 18 IntelliSense: 类声明外部的说明符无效 c:\Program Files (x86)\Microsoft Visual Studio 12.0\VC\include\sstream 74 2 Project1 61 IntelliSense: 类声明外部的说明符无效 c:\Program Files (x86)\Microsoft Visual Studio 12.0\VC\include\sstream 442 2 Project1 73 IntelliSense: 类声明外部的说明符无效 c:\Program Files (x86)\Microsoft Visual Studio 12.0\VC\include\sstream 535 2 Project1 85 IntelliSense: 类声明外部的说明符无效 c:\Program Files (x86)\Microsoft Visual Studio 12.0\VC\include\sstream 634 2 Project1 95 IntelliSense: 全局范围没有 "_C_double_complex" c:\Program Files (x86)\Microsoft Visual Studio 12.0\VC\include\complex 44 15 Project1 32 IntelliSense: 未定义标识符 "_Al" c:\Program Files (x86)\Microsoft Visual Studio 12.0\VC\include\sstream 151 21 Project1 31 IntelliSense: 未定义标识符 "_Elem" c:\Program Files (x86)\Microsoft Visual Studio 12.0\VC\include\sstream 151 4 Project1 33 IntelliSense: 未定义标识符 "_Elem" c:\Program Files (x86)\Microsoft Visual Studio 12.0\VC\include\sstream 152 4 Project1
opencv hello.obj : error LNK2001: unresolved external symbol _cvNamedWindow
使用的是vs2012 ultimate 和opencv2.4.2,配置基本成功,配置情况贴在后面 源程序如下: #include <cv.h> #include <highgui.h> //#pragma comment(lib,"cv.lib") //#pragma comment(lib,"highgui.lib") int main() { cvNamedWindow("my window",1); return 0; } 环境配置都是正常的: 在环境变量中配置:D:\Program Files (x86)\opencv2.4.2\opencv\build\x64\vc10\bin;D:\Program Files (x86)\opencv2.4.2\opencv\build\common\tbb\intel64\vc10 在vc++包含目录中配置 库目录中配置 连接器的附加依赖项中配置如下: opencv_calib3d242.lib opencv_contrib242.lib opencv_core242.lib opencv_features2d242.lib opencv_flann242.lib opencv_gpu242.lib opencv_haartraining_engine.lib opencv_highgui242.lib opencv_imgproc242.lib opencv_legacy242.lib opencv_ml242.lib opencv_nonfree242.lib opencv_objdetect242.lib opencv_photo242.lib opencv_stitching242.lib opencv_ts242.lib opencv_video242.lib opencv_videostab242.lib 当然debug和release都进行了如此的配置,debug下多一个字母d 以前也是如此配置,基本成功,但是这次始终成功不了,总是出现问题如下: hello.obj : error LNK2001: unresolved external symbol _cvNamedWindow 网上找了很多种解决方案都不奏效: 1说连接器和库不匹配 2说没有cv.lib 和higugui.lib几个文件,所以添加了 #pragma comment(lib,"cv.lib") #pragma comment(lib,"highgui.lib") 但还是运行不成功,求大神帮忙啊!!
为什么Opencv3.4.0使用make编译时出现错误?
环境:Debian(Raspiberry Pi Buster) cmake version: 3.0.2 gcc version: 8.2.0 python version: 3.7.2 make version: 4.2.1 本来计划用opencv基于python进行图像辨别 在使用cmake配置完成后使用make命令编译: ``` sudo make ``` 编译到大约90%时,出现如下错误: ``` #这是之前很多条控制台信息中的warning warning: cast between incompatible function types from ‘PyObject* (*)(PyObject*, PyObject*, PyObject*)’ {aka ‘_object* (*)(_object*, _object*, _object*)’} to ‘PyCFunction’ {aka ‘_object* (*)(_object*, _object*)’} [-Wcast-function-type] ``` ``` #make错误,退出 make[2]: *** [modules/python3/CMakeFiles/opencv_python3.dir/build.make:56: modules/python3/CMakeFiles/opencv_python3.dir/__/src2/cv2.cpp.o] Error 1 make[1]: *** [CMakeFiles/Makefile2:21149: modules/python3/CMakeFiles/opencv_python3.dir/all] Error 2 make: *** [Makefile:138: all] Error 2 ``` 如图(图1中使用了make -i选项忽略错误,继续编译剩余部分,但open_cv python3没有成功编译): ![图片说明](https://img-ask.csdn.net/upload/201908/11/1565498546_278259.png) (图2显示了make的错误) ![图片说明](https://img-ask.csdn.net/upload/201908/11/1565499335_385379.png) ``` #忽略错误后出现的c++error c++: error: Cmakefiles/opencv_python3.dir/__/src2/cv2.cpp.o No such file or dictionary ``` 在网上看到的编译错误的例子都和这个有所区别,没有能够很好地解决问题。有的说这是gcc编译器的问题 希望各位大佬们能够帮忙分析一下错误的原因,因为我的项目急需配置好opencv,也没有其它更好的替代,谢谢~
error LNK2038: _MSC_VER”的不匹配项: 值“1800”不匹配值“1900”
使用vs2017,opencv3.0.0。代码没有错误,为什么会报错 而且我看了一下网上的资料,很多都是高版本不匹配低版本 ![图片说明](https://img-ask.csdn.net/upload/201704/18/1492510225_638772.png) 这是我的配置目录,并没有V120可选 ![图片说明](https://img-ask.csdn.net/upload/201704/18/1492510295_544003.png) 报错 1>------ 已启动生成: 项目: OpenCVExample, 配置: Debug x64 ------ 1>opencv_core300d.lib(alloc.obj) : error LNK2038: 检测到“_MSC_VER”的不匹配项: 值“1800”不匹配值“1900”(App.xaml.obj 中) 1>opencv_core300d.lib(alloc.obj) : error LNK2038: 检测到“RuntimeLibrary”的不匹配项: 值“MTd_StaticDebug”不匹配值“MDd_DynamicDebug”(App.xaml.obj 中) 1>opencv_core300d.lib(matrix.obj) : error LNK2038: 检测到“_MSC_VER”的不匹配项: 值“1800”不匹配值“1900”(App.xaml.obj 中) 1>opencv_core300d.lib(matrix.obj) : error LNK2038: 检测到“RuntimeLibrary”的不匹配项: 值“MTd_StaticDebug”不匹配值“MDd_DynamicDebug”(App.xaml.obj 中) 1>opencv_core300d.lib(stl.obj) : error LNK2038: 检测到“_MSC_VER”的不匹配项: 值“1800”不匹配值“1900”(App.xaml.obj 中) 1>opencv_core300d.lib(stl.obj) : error LNK2038: 检测到“RuntimeLibrary”的不匹配项: 值“MTd_StaticDebug”不匹配值“MDd_DynamicDebug”(App.xaml.obj 中) 值“MDd_DynamicDebug”(App.xaml.obj 中) 1>LINK : fatal error LNK1104: 无法打开文件“libcpmtd.lib” 1>已完成生成项目“OpenCVExample.vcxproj”的操作 - 失败。 ========== 生成: 成功 0 个,失败 1 个,最新 0 个,跳过 0 个 ==========
相见恨晚的超实用网站
搞学习 知乎:www.zhihu.com 简答题:http://www.jiandati.com/ 网易公开课:https://open.163.com/ted/ 网易云课堂:https://study.163.com/ 中国大学MOOC:www.icourse163.org 网易云课堂:study.163.com 哔哩哔哩弹幕网:www.bilibili.com 我要自学网:www.51zxw
花了20分钟,给女朋友们写了一个web版群聊程序
参考博客 [1]https://www.byteslounge.com/tutorials/java-ee-html5-websocket-example
爬虫福利二 之 妹子图网MM批量下载
爬虫福利一:27报网MM批量下载    点击 看了本文,相信大家对爬虫一定会产生强烈的兴趣,激励自己去学习爬虫,在这里提前祝:大家学有所成! 目标网站:妹子图网 环境:Python3.x 相关第三方模块:requests、beautifulsoup4 Re:各位在测试时只需要将代码里的变量 path 指定为你当前系统要保存的路径,使用 python xxx.py 或IDE运行即可。
字节跳动视频编解码面经
引言 本文主要是记录一下面试字节跳动的经历。 三四月份投了字节跳动的实习(图形图像岗位),然后hr打电话过来问了一下会不会opengl,c++,shador,当时只会一点c++,其他两个都不会,也就直接被拒了。 七月初内推了字节跳动的提前批,因为内推没有具体的岗位,hr又打电话问要不要考虑一下图形图像岗,我说实习投过这个岗位不合适,不会opengl和shador,然后hr就说秋招更看重基础。我当时
开源一个功能完整的SpringBoot项目框架
福利来了,给大家带来一个福利。 最近想了解一下有关Spring Boot的开源项目,看了很多开源的框架,大多是一些demo或者是一个未成形的项目,基本功能都不完整,尤其是用户权限和菜单方面几乎没有完整的。 想到我之前做的框架,里面通用模块有:用户模块,权限模块,菜单模块,功能模块也齐全了,每一个功能都是完整的。 打算把这个框架分享出来,供大家使用和学习。 为什么用框架? 框架可以学习整体
Java学习的正确打开方式
在博主认为,对于入门级学习java的最佳学习方法莫过于视频+博客+书籍+总结,前三者博主将淋漓尽致地挥毫于这篇博客文章中,至于总结在于个人,实际上越到后面你会发现学习的最好方式就是阅读参考官方文档其次就是国内的书籍,博客次之,这又是一个层次了,这里暂时不提后面再谈。博主将为各位入门java保驾护航,各位只管冲鸭!!!上天是公平的,只要不辜负时间,时间自然不会辜负你。 何谓学习?博主所理解的学习,它
程序员必须掌握的核心算法有哪些?
由于我之前一直强调数据结构以及算法学习的重要性,所以就有一些读者经常问我,数据结构与算法应该要学习到哪个程度呢?,说实话,这个问题我不知道要怎么回答你,主要取决于你想学习到哪些程度,不过针对这个问题,我稍微总结一下我学过的算法知识点,以及我觉得值得学习的算法。这些算法与数据结构的学习大多数是零散的,并没有一本把他们全部覆盖的书籍。下面是我觉得值得学习的一些算法以及数据结构,当然,我也会整理一些看过
Python——画一棵漂亮的樱花树(不同种樱花+玫瑰+圣诞树喔)
最近翻到一篇知乎,上面有不少用Python(大多是turtle库)绘制的树图,感觉很漂亮,我整理了一下,挑了一些我觉得不错的代码分享给大家(这些我都测试过,确实可以生成喔~) one 樱花树 动态生成樱花 效果图(这个是动态的): 实现代码 import turtle as T import random import time # 画樱花的躯干(60,t) def Tree(branch
深深的码丨Java HashMap 透析
HashMap 相关概念 HashTab、HashMap、TreeMap 均以键值对像是存储或操作数据元素。HashTab继承自Dictionary,HashMap、TreeMap继承自AbstractMap,三者均实现Map接口 **HashTab:**同步哈希表,不支持null键或值,因为同步导致性能影响,很少被使用 **HashMap:**应用较多的非同步哈希表,支持null键或值,是键值对...
大学四年自学走来,这些私藏的实用工具/学习网站我贡献出来了
大学四年,看课本是不可能一直看课本的了,对于学习,特别是自学,善于搜索网上的一些资源来辅助,还是非常有必要的,下面我就把这几年私藏的各种资源,网站贡献出来给你们。主要有:电子书搜索、实用工具、在线视频学习网站、非视频学习网站、软件下载、面试/求职必备网站。 注意:文中提到的所有资源,文末我都给你整理好了,你们只管拿去,如果觉得不错,转发、分享就是最大的支持了。 一、电子书搜索 对于大部分程序员...
linux系列之常用运维命令整理笔录
本博客记录工作中需要的linux运维命令,大学时候开始接触linux,会一些基本操作,可是都没有整理起来,加上是做开发,不做运维,有些命令忘记了,所以现在整理成博客,当然vi,文件操作等就不介绍了,慢慢积累一些其它拓展的命令,博客不定时更新 顺便拉下票,我在参加csdn博客之星竞选,欢迎投票支持,每个QQ或者微信每天都可以投5票,扫二维码即可,http://m234140.nofollow.ax.
Python 基础(一):入门必备知识
目录1 标识符2 关键字3 引号4 编码5 输入输出6 缩进7 多行8 注释9 数据类型10 运算符10.1 常用运算符10.2 运算符优先级 1 标识符 标识符是编程时使用的名字,用于给变量、函数、语句块等命名,Python 中标识符由字母、数字、下划线组成,不能以数字开头,区分大小写。 以下划线开头的标识符有特殊含义,单下划线开头的标识符,如:_xxx ,表示不能直接访问的类属性,需通过类提供
程序员接私活怎样防止做完了不给钱?
首先跟大家说明一点,我们做 IT 类的外包开发,是非标品开发,所以很有可能在开发过程中会有这样那样的需求修改,而这种需求修改很容易造成扯皮,进而影响到费用支付,甚至出现做完了项目收不到钱的情况。 那么,怎么保证自己的薪酬安全呢? 我们在开工前,一定要做好一些证据方面的准备(也就是“讨薪”的理论依据),这其中最重要的就是需求文档和验收标准。一定要让需求方提供这两个文档资料作为开发的基础。之后开发
网页实现一个简单的音乐播放器(大佬别看。(⊙﹏⊙))
今天闲着无事,就想写点东西。然后听了下歌,就打算写个播放器。 于是乎用h5 audio的加上js简单的播放器完工了。 欢迎 改进 留言。 演示地点跳到演示地点 html代码如下`&lt;!DOCTYPE html&gt; &lt;html&gt; &lt;head&gt; &lt;title&gt;music&lt;/title&gt; &lt;meta charset="utf-8"&gt
Python十大装B语法
Python 是一种代表简单思想的语言,其语法相对简单,很容易上手。不过,如果就此小视 Python 语法的精妙和深邃,那就大错特错了。本文精心筛选了最能展现 Python 语法之精妙的十个知识点,并附上详细的实例代码。如能在实战中融会贯通、灵活使用,必将使代码更为精炼、高效,同时也会极大提升代码B格,使之看上去更老练,读起来更优雅。 1. for - else 什么?不是 if 和 else 才
数据库优化 - SQL优化
前面一篇文章从实例的角度进行数据库优化,通过配置一些参数让数据库性能达到最优。但是一些“不好”的SQL也会导致数据库查询变慢,影响业务流程。本文从SQL角度进行数据库优化,提升SQL运行效率。 判断问题SQL 判断SQL是否有问题时可以通过两个表象进行判断: 系统级别表象 CPU消耗严重 IO等待严重 页面响应时间过长
2019年11月中国大陆编程语言排行榜
2019年11月2日,我统计了某招聘网站,获得有效程序员招聘数据9万条。针对招聘信息,提取编程语言关键字,并统计如下: 编程语言比例 rank pl_ percentage 1 java 33.62% 2 c/c++ 16.42% 3 c_sharp 12.82% 4 javascript 12.31% 5 python 7.93% 6 go 7.25% 7
通俗易懂地给女朋友讲:线程池的内部原理
餐厅的约会 餐盘在灯光的照耀下格外晶莹洁白,女朋友拿起红酒杯轻轻地抿了一小口,对我说:“经常听你说线程池,到底线程池到底是个什么原理?”我楞了一下,心里想女朋友今天是怎么了,怎么突然问出这么专业的问题,但做为一个专业人士在女朋友面前也不能露怯啊,想了一下便说:“我先给你讲讲我前同事老王的故事吧!” 大龄程序员老王 老王是一个已经北漂十多年的程序员,岁数大了,加班加不动了,升迁也无望,于是拿着手里
经典算法(5)杨辉三角
杨辉三角 是经典算法,这篇博客对它的算法思想进行了讲解,并有完整的代码实现。
腾讯算法面试题:64匹马8个跑道需要多少轮才能选出最快的四匹?
昨天,有网友私信我,说去阿里面试,彻底的被打击到了。问了为什么网上大量使用ThreadLocal的源码都会加上private static?他被难住了,因为他从来都没有考虑过这个问题。无独有偶,今天笔者又发现有网友吐槽了一道腾讯的面试题,我们一起来看看。 腾讯算法面试题:64匹马8个跑道需要多少轮才能选出最快的四匹? 在互联网职场论坛,一名程序员发帖求助到。二面腾讯,其中一个算法题:64匹
面试官:你连RESTful都不知道我怎么敢要你?
面试官:了解RESTful吗? 我:听说过。 面试官:那什么是RESTful? 我:就是用起来很规范,挺好的 面试官:是RESTful挺好的,还是自我感觉挺好的 我:都挺好的。 面试官:… 把门关上。 我:… 要干嘛?先关上再说。 面试官:我说出去把门关上。 我:what ?,夺门而去 文章目录01 前言02 RESTful的来源03 RESTful6大原则1. C-S架构2. 无状态3.统一的接
JDK12 Collectors.teeing 你真的需要了解一下
前言 在 Java 12 里面有个非常好用但在官方 JEP 没有公布的功能,因为它只是 Collector 中的一个小改动,它的作用是 merge 两个 collector 的结果,这句话显得很抽象,老规矩,我们先来看个图(这真是一个不和谐的图????): 管道改造经常会用这个小东西,通常我们叫它「三通」,它的主要作用就是将 downstream1 和 downstre...
为啥国人偏爱Mybatis,而老外喜欢Hibernate/JPA呢?
关于SQL和ORM的争论,永远都不会终止,我也一直在思考这个问题。昨天又跟群里的小伙伴进行了一番讨论,感触还是有一些,于是就有了今天这篇文。 声明:本文不会下关于Mybatis和JPA两个持久层框架哪个更好这样的结论。只是摆事实,讲道理,所以,请各位看官勿喷。 一、事件起因 关于Mybatis和JPA孰优孰劣的问题,争论已经很多年了。一直也没有结论,毕竟每个人的喜好和习惯是大不相同的。我也看
项目中的if else太多了,该怎么重构?
介绍 最近跟着公司的大佬开发了一款IM系统,类似QQ和微信哈,就是聊天软件。我们有一部分业务逻辑是这样的 if (msgType = "文本") { // dosomething } else if(msgType = "图片") { // doshomething } else if(msgType = "视频") { // doshomething } else { // doshom...
致 Python 初学者
欢迎来到“Python进阶”专栏!来到这里的每一位同学,应该大致上学习了很多 Python 的基础知识,正在努力成长的过程中。在此期间,一定遇到了很多的困惑,对未来的学习方向感到迷茫。我非常理解你们所面临的处境。我从2007年开始接触 python 这门编程语言,从2009年开始单一使用 python 应对所有的开发工作,直至今天。回顾自己的学习过程,也曾经遇到过无数的困难,也曾经迷茫过、困惑过。开办这个专栏,正是为了帮助像我当年一样困惑的 Python 初学者走出困境、快速成长。希望我的经验能真正帮到你
“狗屁不通文章生成器”登顶GitHub热榜,分分钟写出万字形式主义大作
一、垃圾文字生成器介绍 最近在浏览GitHub的时候,发现了这样一个骨骼清奇的雷人项目,而且热度还特别高。 项目中文名:狗屁不通文章生成器 项目英文名:BullshitGenerator 根据作者的介绍,他是偶尔需要一些中文文字用于GUI开发时测试文本渲染,因此开发了这个废话生成器。但由于生成的废话实在是太过富于哲理,所以最近已经被小伙伴们给玩坏了。 他的文风可能是这样的: 你发现,...
程序员:我终于知道post和get的区别
是一个老生常谈的话题,然而随着不断的学习,对于以前的认识有很多误区,所以还是需要不断地总结的,学而时习之,不亦说乎
《程序人生》系列-这个程序员只用了20行代码就拿了冠军
你知道的越多,你不知道的越多 点赞再看,养成习惯GitHub上已经开源https://github.com/JavaFamily,有一线大厂面试点脑图,欢迎Star和完善 前言 这一期不算《吊打面试官》系列的,所有没前言我直接开始。 絮叨 本来应该是没有这期的,看过我上期的小伙伴应该是知道的嘛,双十一比较忙嘛,要值班又要去帮忙拍摄年会的视频素材,还得搞个程序员一天的Vlog,还要写BU...
加快推动区块链技术和产业创新发展,2019可信区块链峰会在京召开
11月8日,由中国信息通信研究院、中国通信标准化协会、中国互联网协会、可信区块链推进计划联合主办,科技行者协办的2019可信区块链峰会将在北京悠唐皇冠假日酒店开幕。   区块链技术被认为是继蒸汽机、电力、互联网之后,下一代颠覆性的核心技术。如果说蒸汽机释放了人类的生产力,电力解决了人类基本的生活需求,互联网彻底改变了信息传递的方式,区块链作为构造信任的技术有重要的价值。   1...
程序员把地府后台管理系统做出来了,还有3.0版本!12月7号最新消息:已在开发中有github地址
第一幕:缘起 听说阎王爷要做个生死簿后台管理系统,我们派去了一个程序员…… 996程序员做的梦: 第一场:团队招募 为了应对地府管理危机,阎王打算找“人”开发一套地府后台管理系统,于是就在地府总经办群中发了项目需求。 话说还是中国电信的信号好,地府都是满格,哈哈!!! 经常会有外行朋友问:看某网站做的不错,功能也简单,你帮忙做一下? 而这次,面对这样的需求,这个程序员...
相关热词 如何提升c#开发能力 矩阵乘法c# c#调用谷歌浏览器 c# 去空格去转义符 c#用户登录窗体代码 c# 流 c# linux 可视化 c# mvc 返回图片 c# 像素空间 c# 日期 最后一天
立即提问