在我ubuntu 系统上我有一份源码了,我想建立repo库来管理怎么搞?

我的系统本地上已经有一份源码了,我想建个repo来管理下代码,怎么百度都有问题
这个是我的步奏:
$curl "http://curl https://storage.googleapis.com/git-repo-downloads/repo > ~/bin/repo
$ chmod a+x ~/bin/repo"
下面这三条我都用过
$repo init -u git://android.git.kernel.org/platform/manifest.git
$repo init -u git://android.git.kernel.org/platform/manifest.git -m dalvik-plus.xml
$repo init -u URL(这个是在当前目录下建立.repo?)
全部报错
fatal: Cannot get https://gerrit.googlesource.com/git-repo/clone.bundle
fatal: error [Errno 101] Network is unreachable
国内,VPN我都有看,就是没有一个成功,搞了好几天了。。请路过的大神帮看下

1个回答

Csdn user default icon
上传中...
上传图片
插入图片
抄袭、复制答案,以达到刷声望分或其他目的的行为,在CSDN问答是严格禁止的,一经发现立刻封号。是时候展现真正的技术了!
其他相关推荐
Android源码如何删除之前的repo仓库
想切换分支,更新一套代码.我把.repo/manifests/下一份项目xml文件拷出来,替换掉.repo/下的manifests.xml,然后sync,但是sync完发现.repo/并没有覆盖之前的,占的空间翻倍了,怎么能删掉.repo/之前那套代码的记录.
IDEA maven设置里面的Repositories这个设置问题
各位大佬好。我的idea工程里面maven设置Repositories没有任何东西。![图片说明](https://img-ask.csdn.net/upload/201911/27/1574824792_987600.png) ![图片说明](https://img-ask.csdn.net/upload/201911/27/1574824602_936414.png) 然后我百度了很多办法,首先是对maven包的setting文件添加localRepository设置地址。 ``` <localRepository>D:\Java\repository</localRepository> ``` 然后还是没有显示。继续百度,让我在pom.xml插入以下代码 ``` <repositories> <repository> <id>spring-milestones</id> <name>Spring Milestones</name> <url>https://repo.spring.io/milestone</url> <snapshots> <enabled>false</enabled> </snapshots> </repository> </repositories> ``` 最后在Repositories这个设置里面出现了以下内容 ![图片说明](https://img-ask.csdn.net/upload/201911/27/1574825161_983557.png) 接下来就是我的问题了:我需要的其实就是在这个显示里面显示一个我自己的本地maven库的地址。 1.接上图,我点Update没有任何作用,他一直报错,更新失败。 2.我其实想要的这个URl地址应该是我自己的‘D:\Java\repository’这个地址,但是他为什么不能自动的把我自己的地址放进去。希望各位大佬多给建议,我一一排查。感谢。 目前已经做了的排查: 1.更换了maven 2.切换setting的仓库地址的斜杠‘D:/Java/repository’ 3.修改了idea中maven设置的地址的斜杠。 目前没有成功!还在思考中。
pip / conda install 报 SSLError
# 我想安装 pycurl 库一直报ssl的错 **安装其他库也报这个错 我python 和 anacoda 卸载重装还是这样** ![图片说明](https://img-ask.csdn.net/upload/201912/29/1577603682_113807.png) ![图片说明](https://img-ask.csdn.net/upload/201912/29/1577603787_388466.png) **网上查到说添加环境变量 添加了但还是不行** anacoda 安装文件夹是anacode (新建文件夹的时候打错了) Python 3.7.6 windows 10 系统 大佬们知道什么原因吗? ``` 错误文本: pip install pycurl WARNING: pip is configured with locations that require TLS/SSL, however the ssl module in Python is not available. Requirement already satisfied: pycurl in d:\anacode\lib\site-packages (7.43.0.3) WARNING: pip is configured with locations that require TLS/SSL, however the ssl module in Python is not available. Could not fetch URL https://pypi.org/simple/pip/: There was a problem confirming the ssl certificate: HTTPSConnectionPool(host='pypi.org', port=443): Max retries exceeded with url: /simple/pip/ (Caused by SSLError("Can't connect to HTTPS URL because the SSL module is not available.")) - skipping C:\Users\Enz>conda install scrapy Collecting package metadata (current_repodata.json): failed CondaHTTPError: HTTP 000 CONNECTION FAILED for url <https://repo.anaconda.com/pkgs/main/win-64/current_repodata.json> Elapsed: - An HTTP error occurred when trying to retrieve this URL. HTTP errors are often intermittent, and a simple retry will get you on your way. If your current network has https://www.anaconda.com blocked, please file a support request with your network engineering team. SSLError(MaxRetryError('HTTPSConnectionPool(host=\'repo.anaconda.com\', port=443): Max retries exceeded with url: /pkgs/main/win-64/current_repodata.json (Caused by SSLError("Can\'t connect to HTTPS URL because the SSL module is not available."))')) ```
ftp://192.168.0.9/pub/repo/repodata/repomd.xml: [Errno 14] FTP Error 500 - Access denied: 500 Trying other mirror怎么解决?
![图片说明](https://img-ask.csdn.net/upload/201912/17/1576570287_195383.jpg)我在用华为云做实验,搭了一个客户端ftp的yum源,但是在服务器yum repolist的时候总是出现这个报错,不知道怎么办了? 客户端ip192.168.0.8 服务器ip192.168.0.9
Jenkins打包项目报错,JDK1.8
``` [INFO] BUILD FAILURE [INFO] ------------------------------------------------------------------------ [INFO] Total time: 6.400 s [INFO] Finished at: 2019-12-31T17:08:37+08:00 [INFO] Final Memory: 32M/117M [INFO] ------------------------------------------------------------------------ [ERROR] Failed to execute goal org.apache.maven.plugins:maven-compiler-plugin:3.8.1:compile (default-compile) on project cmdbunion_eureka: Execution default-compile of goal org.apache.maven.plugins:maven-compiler-plugin:3.8.1:compile failed: A required class was missing while executing org.apache.maven.plugins:maven-compiler-plugin:3.8.1:compile: org/codehaus/plexus/compiler/util/scan/InclusionScanException [ERROR] ----------------------------------------------------- [ERROR] realm = plugin>org.apache.maven.plugins:maven-compiler-plugin:3.8.1 [ERROR] strategy = org.codehaus.plexus.classworlds.strategy.SelfFirstStrategy [ERROR] urls[0] = file:/DATA/repo/repository/org/apache/maven/plugins/maven-compiler-plugin/3.8.1/maven-compiler-plugin-3.8.1.jar [ERROR] urls[1] = file:/DATA/repo/repository/org/codehaus/plexus/plexus-utils/1.1/plexus-utils-1.1.jar [JENKINS] Archiving /DATA/var/lib/jenkins/workspace/cmdbunion_parent/cmdbunion_eureka/pom.xml to com.travelsky/cmdbunion_eureka/0.0.1-SNAPSHOT/cmdbunion_eureka-0.0.1-SNAPSHOT.pom [ERROR] Number of foreign imports: 1 [ERROR] import: Entry[import from realm ClassRealm[maven.api, parent: null]] [ERROR] [ERROR] -----------------------------------------------------: org.codehaus.plexus.compiler.util.scan.InclusionScanException [ERROR] -> [Help 1] [ERROR] [ERROR] To see the full stack trace of the errors, re-run Maven with the -e switch. [ERROR] Re-run Maven using the -X switch to enable full debug logging. [JENKINS] Archiving /DATA/var/lib/jenkins/workspace/cmdbunion_parent/cmdbunion_titsm/pom.xml to com.travelsky/cmdbunion_titsm/0.0.1-SNAPSHOT/cmdbunion_titsm-0.0.1-SNAPSHOT.pom [ERROR] [ERROR] For more information about the errors and possible solutions, please read the following articles: [ERROR] [Help 1] http://cwiki.apache.org/confluence/display/MAVEN/PluginContainerException [ERROR] [ERROR] After correcting the problems, you can resume the build with the command [ERROR] mvn <goals> -rf :cmdbunion_eureka ``` ![图片说明](https://img-ask.csdn.net/upload/201912/31/1577783774_342114.png) ![图片说明](https://img-ask.csdn.net/upload/201912/31/1577783814_821416.png)
android组件集成支付宝SDK问题
Error:Could not resolve all files for configuration ':app:A001DebugCompileClasspath'. > Could not find :alipaySdk-15.6.8-20191021122514:. Searched in the following locations: file:/D:/Android/sdk/extras/m2repository//alipaySdk-15.6.8-20191021122514//alipaySdk-15.6.8-20191021122514-.pom file:/D:/Android/sdk/extras/m2repository//alipaySdk-15.6.8-20191021122514//alipaySdk-15.6.8-20191021122514-.aar file:/D:/Android/sdk/extras/google/m2repository//alipaySdk-15.6.8-20191021122514//alipaySdk-15.6.8-20191021122514-.pom file:/D:/Android/sdk/extras/google/m2repository//alipaySdk-15.6.8-20191021122514//alipaySdk-15.6.8-20191021122514-.aar file:/D:/Android/sdk/extras/android/m2repository//alipaySdk-15.6.8-20191021122514//alipaySdk-15.6.8-20191021122514-.pom file:/D:/Android/sdk/extras/android/m2repository//alipaySdk-15.6.8-20191021122514//alipaySdk-15.6.8-20191021122514-.aar file:/D:/Android/Studio3/gradle/m2repository//alipaySdk-15.6.8-20191021122514//alipaySdk-15.6.8-20191021122514-.pom file:/D:/Android/Studio3/gradle/m2repository//alipaySdk-15.6.8-20191021122514//alipaySdk-15.6.8-20191021122514-.aar https://jcenter.bintray.com//alipaySdk-15.6.8-20191021122514//alipaySdk-15.6.8-20191021122514-.pom https://jcenter.bintray.com//alipaySdk-15.6.8-20191021122514//alipaySdk-15.6.8-20191021122514-.aar file:/E:/wwwroot/gitweb/Android_NDK_YW/app/ELAndroidComponent/repo//alipaySdk-15.6.8-20191021122514//alipaySdk-15.6.8-20191021122514-.pom file:/E:/wwwroot/gitweb/Android_NDK_YW/app/ELAndroidComponent/repo//alipaySdk-15.6.8-20191021122514//alipaySdk-15.6.8-20191021122514-.aar http://maven.aliyun.com/nexus/content/repositories/releases//alipaySdk-15.6.8-20191021122514//alipaySdk-15.6.8-20191021122514-.pom http://maven.aliyun.com/nexus/content/repositories/releases//alipaySdk-15.6.8-20191021122514//alipaySdk-15.6.8-20191021122514-.aar https://dl.bintray.com/jetbrains/anko//alipaySdk-15.6.8-20191021122514//alipaySdk-15.6.8-20191021122514-.pom https://dl.bintray.com/jetbrains/anko//alipaySdk-15.6.8-20191021122514//alipaySdk-15.6.8-20191021122514-.aar https://jitpack.io//alipaySdk-15.6.8-20191021122514//alipaySdk-15.6.8-20191021122514-.pom https://jitpack.io//alipaySdk-15.6.8-20191021122514//alipaySdk-15.6.8-20191021122514-.aar https://repo1.maven.org/maven2//alipaySdk-15.6.8-20191021122514//alipaySdk-15.6.8-20191021122514-.pom https://repo1.maven.org/maven2//alipaySdk-15.6.8-20191021122514//alipaySdk-15.6.8-20191021122514-.aar https://dl.google.com/dl/android/maven2//alipaySdk-15.6.8-20191021122514//alipaySdk-15.6.8-20191021122514-.pom https://dl.google.com/dl/android/maven2//alipaySdk-15.6.8-20191021122514//alipaySdk-15.6.8-20191021122514-.aar file:/E:/wwwroot/gitweb/Android_NDK_YW/app/libs/alipaySdk-15.6.8-20191021122514-.aar file:/E:/wwwroot/gitweb/Android_NDK_YW/app/libs/alipaySdk-15.6.8-20191021122514.aar file:/C:/Users/Administrator/.m2/repository//alipaySdk-15.6.8-20191021122514//alipaySdk-15.6.8-20191021122514-.pom file:/C:/Users/Administrator/.m2/repository//alipaySdk-15.6.8-20191021122514//alipaySdk-15.6.8-20191021122514-.aar file:/E:/wwwroot/gitweb/Android_NDK_YW/ELAndroidComponent/repo/alipaySdk-15.6.8-20191021122514-.aar file:/E:/wwwroot/gitweb/Android_NDK_YW/ELAndroidComponent/repo/alipaySdk-15.6.8-20191021122514.aar file:/E:/wwwroot/gitweb/Android_NDK_YW/app/libs/alipaySdk-15.6.8-20191021122514-.aar file:/E:/wwwroot/gitweb/Android_NDK_YW/app/libs/alipaySdk-15.6.8-20191021122514.aar file:/E:/wwwroot/gitweb/Android_NDK_YW/ELAndroidComponent/repo//alipaySdk-15.6.8-20191021122514//alipaySdk-15.6.8-20191021122514-.pom file:/E:/wwwroot/gitweb/Android_NDK_YW/ELAndroidComponent/repo//alipaySdk-15.6.8-20191021122514//alipaySdk-15.6.8-20191021122514-.aar Required by: project :app > project :ELAndroidComponent:paycomponent 配置好后运行出现以上问题,不知怎么解决,有大神指导一下吗
repo 与 git的基本操作以及建立代码库
我从供应商那里拿到了一套repo的代码库,现在要把它放到自己的服务器上,让其他人可以进行开发,现在的问题是不知道怎样在服务器上建立这个库?怎么更改url?希望能提供一些思路或者资料,谢谢!
yum localinstall 遇到的问题
``` [root@bogon base]# yum localinstall -y gcc-4.8.5-39.el7.x86_64.rpm Loaded plugins: fastestmirror Examining gcc-4.8.5-39.el7.x86_64.rpm: gcc-4.8.5-39.el7.x86_64 Marking gcc-4.8.5-39.el7.x86_64.rpm to be installed Resolving Dependencies --> Running transaction check ---> Package gcc.x86_64 0:4.8.5-39.el7 will be installed --> Processing Dependency: cpp = 4.8.5-39.el7 for package: gcc-4.8.5-39.el7.x86_64 Loading mirror speeds from cached hostfile One of the configured repositories failed (Unknown), and yum doesn't have enough cached data to continue. At this point the only safe thing yum can do is fail. There are a few ways to work "fix" this: 1. Contact the upstream for the repository and get them to fix the problem. 2. Reconfigure the baseurl/etc. for the repository, to point to a working upstream. This is most often useful if you are using a newer distribution release than is supported by the repository (and the packages for the previous distribution release still work). 3. Run the command with the repository temporarily disabled yum --disablerepo=<repoid> ... 4. Disable the repository permanently, so yum won't use it by default. Yum will then just ignore the repository until you permanently enable it again or use --enablerepo for temporary usage: yum-config-manager --disable <repoid> or subscription-manager repos --disable=<repoid> 5. Configure the failing repository to be skipped, if it is unavailable. Note that yum will try to contact the repo. when it runs most commands, so will have to try and fail each time (and thus. yum will be be much slower). If it is a very temporary problem though, this is often a nice compromise: yum-config-manager --save --setopt=<repoid>.skip_if_unavailable=true Cannot retrieve metalink for repository: epel/x86_64. Please verify its path and try again ```
关于odroid-xu4 android源码如何正确下载,项目有多大?
最近在弄xu4的android,由于某些问题,需要下载其源码看看,按照其官网的source code下载方式下载,现在下载了超过了150GB仍然没下完,我下其它的android源码也才50GB左右,希望下过了大佬能否告知下原因或者怎么查询该源码项目总大小?谢谢 官网提示下载步骤: $ repo init -u https://github.com/hardkernel/android.git -b 5422_4.4.4_master $ repo sync $ repo start 5422_4.4.4_master --all 源码介绍网站:https://wiki.odroid.com/odroid-xu4/os_images/android/v6.7
vm 10 ubuntu 14.10系统中下载android源码老是失败
前面的流程基本没问题,就在执行repo sync 之后,每次下载到%60多的时候,就发生错误。
安装anaconda后输入conda info 报错求解
想问下这个administrator : false; offline mode : false是什么问题怎么解决. 并且输入python后显示是环境变量但未激活。并且安装后桌面找不到anaconda的图标。望大神救救我!!! active environment : base active env location : D:\anaconda shell level : 1 user config file : C:\Users\Katharine\.condarc populated config files : conda version : 4.7.10 conda-build version : 3.18.8 python version : 3.7.3.final.0 virtual packages : __cuda=10.0 base environment : D:\anaconda (writable) channel URLs : https://repo.anaconda.com/pkgs/main/win-64 https://repo.anaconda.com/pkgs/main/noarch https://repo.anaconda.com/pkgs/r/win-64 https://repo.anaconda.com/pkgs/r/noarch https://repo.anaconda.com/pkgs/msys2/win-64 https://repo.anaconda.com/pkgs/msys2/noarch package cache : D:\anaconda\pkgs C:\Users\Katharine\.conda\pkgs C:\Users\Katharine\AppData\Local\conda\conda\pkgs envs directories : D:\anaconda\envs C:\Users\Katharine\.conda\envs C:\Users\Katharine\AppData\Local\conda\conda\envs platform : win-64 user-agent : conda/4.7.10 requests/2.22.0 CPython/3.7.3 Windows/10 Windows/10.0.17134 administrator : False netrc file : None offline mode : False
下载ambari包时显示This XML file does not appear to have any style information associated with it. The document tree is shown below.
使用hortonworks.com官网提供的地址下载ambari,下面是下载链接 http://public-repo-1.hortonworks.com/ambari/ubuntu16/2.x/updates/2.7.4.0/ambari-2.7.4.0-ubuntu18.tar.gz 显示报错如下: ![图片说明](https://img-ask.csdn.net/upload/201909/28/1569638273_184440.png) 请问这个如何解决,尝试了很多次都下载不了! 我的电脑是mac,使用的是chrom浏览器
Android8.0源码编译问题
目前在研究Android8.0最新源码,虽然8.0的源码还未稳定释放,但作为Android平台有必要了解每个版本的变化和进展,源代码已经download完毕,就是在编译的时候出现了问题,总是编译不过,未找到原因,错误中说依赖系统的两个库,但已经检查过了,系统这两个库已经存在。哪位大神帮忙看看呢,先谢谢了. ** 1. repo init -u https://android.googlesource.com/platform/manifest -b refs/heads/android-o-preview-2 2. repo sync 3. make ** ![图片说明](https://img-ask.csdn.net/upload/201707/20/1500531618_88910.png)
conda update --all 失败
我想升级numpy,原先先后尝试conda update --all 以及conda update numpy,是可以的,但都因为网络还是什么原因中断了,两个命令都尝试了两次,都中断了。 后来过了一会,我再尝试conda update --all 以及conda update numpy,失败了,报错,报错原因都差不多,以下是conda update --all的报错代码,请各位大佬救救我,小白我万分感谢 ``` (base) C:\Users\RZW>conda update --all # >>>>>>>>>>>>>>>>>>>>>> ERROR REPORT <<<<<<<<<<<<<<<<<<<<<< Traceback (most recent call last): File "D:\Program files\Anaconda\lib\site-packages\libarchive\ffi.py", line 55, in <module> libarchive = ctypes.cdll.LoadLibrary(libarchive_path) File "D:\Program files\Anaconda\lib\ctypes\__init__.py", line 434, in LoadLibrary return self._dlltype(name) File "D:\Program files\Anaconda\lib\ctypes\__init__.py", line 356, in __init__ self._handle = _dlopen(self._name, mode) OSError: [WinError 126] 找不到指定的模块。 During handling of the above exception, another exception occurred: Traceback (most recent call last): File "D:\Program files\Anaconda\lib\site-packages\conda\exceptions.py", line 1062, in __call__ return func(*args, **kwargs) File "D:\Program files\Anaconda\lib\site-packages\conda\cli\main.py", line 84, in _main exit_code = do_call(args, p) File "D:\Program files\Anaconda\lib\site-packages\conda\cli\conda_argparse.py", line 82, in do_call exit_code = getattr(module, func_name)(args, parser) File "D:\Program files\Anaconda\lib\site-packages\conda\cli\main_update.py", line 20, in execute install(args, parser, 'update') File "D:\Program files\Anaconda\lib\site-packages\conda\cli\install.py", line 116, in install if context.use_only_tar_bz2: File "D:\Program files\Anaconda\lib\site-packages\conda\base\context.py", line 664, in use_only_tar_bz2 import conda_package_handling.api File "D:\Program files\Anaconda\lib\site-packages\conda_package_handling\api.py", line 3, in <module> from libarchive.exception import ArchiveError as _LibarchiveArchiveError File "D:\Program files\Anaconda\lib\site-packages\libarchive\__init__.py", line 1, in <module> from .entry import ArchiveEntry File "D:\Program files\Anaconda\lib\site-packages\libarchive\entry.py", line 6, in <module> from . import ffi File "D:\Program files\Anaconda\lib\site-packages\libarchive\ffi.py", line 57, in <module> raise ImportError("Failed to load libarchive library from %s - are any dependencies missing?" ImportError: Failed to load libarchive library from %s - are any dependencies missing?Is your environment activated? `$ D:\Program files\Anaconda\Scripts\conda-script.py update --all` environment variables: CIO_TEST=<not set> CONDA_DEFAULT_ENV=base CONDA_EXE=D:\Program files\Anaconda\condabin\..\Scripts\conda.exe CONDA_EXES="D:\Program files\Anaconda\condabin\..\Scripts\conda.exe" CONDA_PREFIX=D:\Program files\Anaconda CONDA_PROMPT_MODIFIER=(base) CONDA_PYTHON_EXE=D:\Program files\Anaconda\python.exe CONDA_ROOT=D:\Program files\Anaconda CONDA_SHLVL=1 HOMEPATH=\Users\RZW MOZ_PLUGIN_PATH=D:\Program files\Zeon\Gaaiho\Gaaiho Reader\Bin PATH=D:\Program files\Anaconda\Library\bin;D:\Program files\Anaconda;D:\Program files\Anaconda\Library\mingw-w64\bin;D:\Program files\Anaconda\Library\usr\bin;D:\Program files\Anaconda\Library\bin;D:\Program files\Anaconda\Scripts;D:\Program files\Anaconda\bin;D:\Program files\Anaconda;D:\Program files\Anaconda\Library\mingw-w64\bin;D:\Program files\Anaconda\Library\usr\bin;D:\Program files\Anaconda\Library\bin;D:\Program files\Anaconda\Scripts;D:\Program files\Anaconda\bin;D:\Program files\ Anaconda\condabin;C:\Windows\system32;C:\Windows;C:\Windows\System32\W bem;C:\Windows\System32\WindowsPowerShell\v1.0\锛汥:\Program files\Anaconda锛汥:\Program files\Anaconda\Scripts锛汥:\Program files\Anaconda\envs\tensorflow\Lib\site-packages;D:\Program files\Anaconda\Library\bin;D:\Program files\Anaconda;D:\Program files\Anaconda\Library\mingw-w64\bin;D:\Program files\Anaconda\Library\usr\bin;D:\Program files\Anaconda\Library\bin;D:\Program files\Anaconda\Scripts;D:\Program files PSMODULEPATH=C:\Windows\system32\WindowsPowerShell\v1.0\Modules\ REQUESTS_CA_BUNDLE=<not set> SSL_CERT_FILE=<not set> active environment : base active env location : D:\Program files\Anaconda shell level : 1 user config file : C:\Users\RZW\.condarc populated config files : C:\Users\RZW\.condarc conda version : 4.7.11 conda-build version : 3.18.8 python version : 3.7.3.final.0 virtual packages : base environment : D:\Program files\Anaconda (writable) channel URLs : https://mirrors.tuna.tsinghua.edu.cn/anaconda/cloud/msys2/win-64 https://mirrors.tuna.tsinghua.edu.cn/anaconda/cloud/msys2/noarch https://mirrors.tuna.tsinghua.edu.cn/anaconda/cloud/conda-forge/win-64 https://mirrors.tuna.tsinghua.edu.cn/anaconda/cloud/conda-forge/noarch https://mirrors.tuna.tsinghua.edu.cn/anaconda/pkgs/free/win-64 https://mirrors.tuna.tsinghua.edu.cn/anaconda/pkgs/free/noarch https://repo.anaconda.com/pkgs/main/win-64 https://repo.anaconda.com/pkgs/main/noarch https://repo.anaconda.com/pkgs/r/win-64 https://repo.anaconda.com/pkgs/r/noarch https://repo.anaconda.com/pkgs/msys2/win-64 https://repo.anaconda.com/pkgs/msys2/noarch package cache : D:\Program files\Anaconda\pkgs C:\Users\RZW\.conda\pkgs C:\Users\RZW\AppData\Local\conda\conda\pkgs envs directories : D:\Program files\Anaconda\envs C:\Users\RZW\.conda\envs C:\Users\RZW\AppData\Local\conda\conda\envs platform : win-64 user-agent : conda/4.7.11 requests/2.22.0 CPython/3.7.3 Windows/10 Windows/10.0.10240 administrator : False netrc file : None offline mode : False An unexpected error has occurred. Conda has prepared the above report. If submitted, this report will be used by core maintainers to improve future releases of conda. Would you like conda to send this report to the core maintainers? [y/N]: ```
idea创建Maven项目没有src目录 Run有错误
![图片说明](https://img-ask.csdn.net/upload/201911/02/1572702296_122439.png) ``` "C:\Program Files\Java\jdk1.8.0_202\bin\java.exe" -Dmaven.multiModuleProjectDirectory=C:\Users\dx\AppData\Local\Temp\archetype1tmp -Xms128m -Xmx512m -Duser.language=zh -Dfile.encoding=UTF-8 -Dmaven.home=E:\server\apache-maven-3.6.1 -Dclassworlds.conf=E:\server\apache-maven-3.6.1\bin\m2.conf "-Dmaven.ext.class.path=E:\IntelliJ IDEA 2019.2\plugins\maven\lib\maven-event-listener.jar" -classpath E:\server\apache-maven-3.6.1\boot\plexus-classworlds-2.6.0.jar org.codehaus.classworlds.Launcher -Didea.version2019.2 --offline -s E:\server\apache-maven-3.6.1\conf\settings.xml -Dmaven.repo.local=E:\server\Repository -DinteractiveMode=false -DgroupId=com -DartifactId=demo33333333 -Dversion=1.0-SNAPSHOT -DarchetypeGroupId=org.apache.maven.archetypes -DarchetypeArtifactId=maven-archetype-webapp -DarchetypeVersion=RELEASE org.apache.maven.plugins:maven-archetype-plugin:RELEASE:generate [INFO] Scanning for projects... [INFO] ------------------------------------------------------------------------ [INFO] BUILD FAILURE [INFO] ------------------------------------------------------------------------ [INFO] Total time: 0.140 s [INFO] Finished at: 2019-11-02T21:41:10+08:00 [INFO] ------------------------------------------------------------------------ [ERROR] Plugin org.apache.maven.plugins:maven-archetype-plugin:RELEASE or one of its dependencies could not be resolved: Failed to read artifact descriptor for org.apache.maven.plugins:maven-archetype-plugin:jar:RELEASE: Failed to resolve version for org.apache.maven.plugins:maven-archetype-plugin:jar:RELEASE: Could not find metadata org.apache.maven.plugins:maven-archetype-plugin/maven-metadata.xml in local (E:\server\Repository) -> [Help 1] [ERROR] [ERROR] To see the full stack trace of the errors, re-run Maven with the -e switch. [ERROR] Re-run Maven using the -X switch to enable full debug logging. [ERROR] [ERROR] For more information about the errors and possible solutions, please read the following articles: [ERROR] [Help 1] http://cwiki.apache.org/confluence/display/MAVEN/PluginResolutionException 网上的解决方法我都试过了还是报错,有大佬帮忙看下吗? ```
Non-resolvable parent POM for ***
Non-resolvable parent POM for com.test.XXX:XXX: test.XXX:XXX-integration:1.0.0: Failure to find com.test.XXX:XXX-parent:pom:1.0.0 in http://mvn.dev.mayibank. net/artifactory/repo was cached in the local repository, resolution will not be reattempted until the update interval of central has elapsed or updates are forced and 'parent.relativePath' points at 问题描述: 1、parent pom中部分dependency有改变,从springboot版本进行了升级 但是镜像等的都没有改动,本地仓库当前项目删掉后,打包就会报这个错误 但是如果clone一个没有升级之前的项目进行打包没有问题,打包后仓库中有parent的model,打包就没有问题,没有以前老的parent的module就会报错
Jmeter刚启动就报错,java.lang.StackOverflowError: null
* 刚启动就报错,反射错误?? ``` 2019-10-15 19:25:30,381 INFO o.j.r.JARSourceHTTP: Found cached repo 2019-10-15 19:25:30,490 INFO o.j.r.PluginManager: Plugins Status: [jpgc-graphs-basic=2.0, jpgc-graphs-additional=Extras, jpgc-autostop=Extras, jpgc-sense=Standard, jpgc-cmd=Standard, jpgc-graphs-composite=Standard, jpgc-csl=Standard, jpgc-functions=2.1, jpgc-casutg=2.7, jpgc-dbmon=Extras, jpgc-graphs-dist=Extras, jpgc-dummy=Standard, jpgc-filterresults=Standard, jpgc-ffw=Standard, jpgc-ggl=Extras, jpgc-httpraw=Extras, jpgc-sts=Extras, jpgc-fifo=Standard, jpgc-jmxmon=Extras, jpgc-graphs-vs=Extras, jpgc-lockfile=Extras, jpgc-mergeresults=Standard, jpgc-pde=Extras, jpgc-prmctl=Extras, jpgc-perfmon=Standard, jpgc-plugins-manager=1.3, jpgc-synthesis=Standard, jpgc-plancheck=Standard, jpgc-tst=Standard, jpgc-udp=Extras, jpgc-csvars=Extras, jpgc-wsc=Standard, jpgc-xml=Extras, jmeter-core=5.1, jmeter-ftp=5.1, jmeter-http=5.1, jmeter-jdbc=5.1, jmeter-jms=5.1, jmeter-junit=5.1, jmeter-java=5.1, jmeter-ldap=5.1, jmeter-mail=5.1, jmeter-mongodb=5.1, jmeter-native=5.1, jmeter-tcp=5.1, jmeter-components=5.1, jpgc-standard=2.0] 2019-10-15 19:25:30,490 INFO o.j.r.PluginManagerMenuItem: Plugins Manager has upgrades: [jpgc-casutg] 2019-10-15 19:25:30,928 WARN o.a.j.g.u.MenuFactory: Could not instantiate class: kg.apc.jmeter.reporters.LoadosophiaUploaderGui java.lang.reflect.InvocationTargetException: null at sun.reflect.NativeConstructorAccessorImpl.newInstance0(Native Method) ~[?:1.8.0_131] at sun.reflect.NativeConstructorAccessorImpl.newInstance(NativeConstructorAccessorImpl.java:62) ~[?:1.8.0_131] at sun.reflect.DelegatingConstructorAccessorImpl.newInstance(DelegatingConstructorAccessorImpl.java:45) ~[?:1.8.0_131] at java.lang.reflect.Constructor.newInstance(Constructor.java:423) ~[?:1.8.0_131] at org.apache.jmeter.gui.util.MenuFactory.getGUIComponent(MenuFactory.java:174) ~[ApacheJMeter_core.jar:5.1 r1853635] at org.apache.jmeter.gui.util.MenuFactory.initializeMenus(MenuFactory.java:141) ~[ApacheJMeter_core.jar:5.1 r1853635] at org.apache.jmeter.gui.util.MenuFactory.<clinit>(MenuFactory.java:106) ~[ApacheJMeter_core.jar:5.1 r1853635] at org.apache.jmeter.control.gui.TestPlanGui.createPopupMenu(TestPlanGui.java:92) ~[ApacheJMeter_core.jar:5.1 r1853635] at org.apache.jmeter.gui.tree.JMeterTreeNode.createPopupMenu(JMeterTreeNode.java:185) ~[ApacheJMeter_core.jar:5.1 r1853635] at org.apache.jmeter.gui.action.EditCommand.doAction(EditCommand.java:46) ~[ApacheJMeter_core.jar:5.1 r1853635] at org.apache.jmeter.gui.action.ActionRouter.performAction(ActionRouter.java:88) ~[ApacheJMeter_core.jar:5.1 r1853635] at org.apache.jmeter.gui.action.ActionRouter.lambda$actionPerformed$0(ActionRouter.java:70) ~[ApacheJMeter_core.jar:5.1 r1853635] at java.awt.event.InvocationEvent.dispatch(InvocationEvent.java:311) [?:1.8.0_131] at java.awt.EventQueue.dispatchEventImpl(EventQueue.java:756) [?:1.8.0_131] at java.awt.EventQueue.access$500(EventQueue.java:97) [?:1.8.0_131] at java.awt.EventQueue$3.run(EventQueue.java:709) [?:1.8.0_131] at java.awt.EventQueue$3.run(EventQueue.java:703) [?:1.8.0_131] at java.security.AccessController.doPrivileged(Native Method) [?:1.8.0_131] at java.security.ProtectionDomain$JavaSecurityAccessImpl.doIntersectionPrivilege(ProtectionDomain.java:80) [?:1.8.0_131] at java.awt.EventQueue.dispatchEvent(EventQueue.java:726) [?:1.8.0_131] at java.awt.EventDispatchThread.pumpOneEventForFilters(EventDispatchThread.java:201) [?:1.8.0_131] at java.awt.EventDispatchThread.pumpEventsForFilter(EventDispatchThread.java:116) [?:1.8.0_131] at java.awt.EventDispatchThread.pumpEventsForHierarchy(EventDispatchThread.java:105) [?:1.8.0_131] at java.awt.EventDispatchThread.pumpEvents(EventDispatchThread.java:101) [?:1.8.0_131] at java.awt.EventDispatchThread.pumpEvents(EventDispatchThread.java:93) [?:1.8.0_131] at java.awt.EventDispatchThread.run(EventDispatchThread.java:82) [?:1.8.0_131] Caused by: java.lang.NoClassDefFoundError: org/apache/commons/httpclient/methods/multipart/PartSource at kg.apc.jmeter.reporters.LoadosophiaUploaderGui.init(LoadosophiaUploaderGui.java:114) ~[JMeterPlugins-Standard.jar:?] at kg.apc.jmeter.reporters.LoadosophiaUploaderGui.<init>(LoadosophiaUploaderGui.java:28) ~[JMeterPlugins-Standard.jar:?] ... 26 more Caused by: java.lang.ClassNotFoundException: org.apache.commons.httpclient.methods.multipart.PartSource at java.net.URLClassLoader.findClass(URLClassLoader.java:381) ~[?:1.8.0_131] at java.lang.ClassLoader.loadClass(ClassLoader.java:424) ~[?:1.8.0_131] at java.lang.ClassLoader.loadClass(ClassLoader.java:357) ~[?:1.8.0_131] at kg.apc.jmeter.reporters.LoadosophiaUploaderGui.init(LoadosophiaUploaderGui.java:114) ~[JMeterPlugins-Standard.jar:?] at kg.apc.jmeter.reporters.LoadosophiaUploaderGui.<init>(LoadosophiaUploaderGui.java:28) ~[JMeterPlugins-Standard.jar:?] ... 26 more ```’ * 接着启动线程,又报错StackOverflowError, ``` 2019-10-15 19:25:44,875 INFO o.a.j.t.JMeterThread: Thread started: 线程组 2-1 2019-10-15 19:25:44,876 INFO o.a.j.t.JMeterThread: Thread is done: 线程组 2-1 2019-10-15 19:25:44,876 INFO o.a.j.t.JMeterThread: Thread finished: 线程组 2-1 2019-10-15 19:25:45,703 INFO o.a.j.t.JMeterThread: Thread started: jp@gc - Stepping Thread Group (deprecated) 1-2 2019-10-15 19:25:46,703 INFO o.a.j.t.JMeterThread: Thread started: jp@gc - Stepping Thread Group (deprecated) 1-3 2019-10-15 19:25:47,696 INFO o.a.j.t.JMeterThread: Thread started: jp@gc - Stepping Thread Group (deprecated) 1-4 2019-10-15 19:25:48,195 INFO o.a.j.t.JMeterThread: Thread finished: jp@gc - Stepping Thread Group (deprecated) 1-1 2019-10-15 19:25:48,196 ERROR o.a.j.JMeter: Uncaught exception: java.lang.StackOverflowError: null at org.apache.jmeter.testelement.AbstractTestElement.recoverRunningVersion(AbstractTestElement.java:514) ~[ApacheJMeter_core.jar:5.1 r1853635] at org.apache.jmeter.testelement.property.TestElementProperty.recoverRunningVersion(TestElementProperty.java:125) ~[ApacheJMeter_core.jar:5.1 r1853635] at org.apache.jmeter.testelement.property.MultiProperty.recoverRunningVersionOfSubElements(MultiProperty.java:75) ~[ApacheJMeter_core.jar:5.1 r1853635] at org.apache.jmeter.testelement.property.CollectionProperty.recoverRunningVersion(CollectionProperty.java:205) ~[ApacheJMeter_core.jar:5.1 r1853635] at org.apache.jmeter.testelement.AbstractTestElement.recoverRunningVersion(AbstractTestElement.java:514) ~[ApacheJMeter_core.jar:5.1 r1853635] at org.apache.jmeter.testelement.property.TestElementProperty.recoverRunningVersion(TestElementProperty.java:125) ~[ApacheJMeter_core.jar:5.1 r1853635] at org.apache.jmeter.testelement.AbstractTestElement.recoverRunningVersion(AbstractTestElement.java:514) ~[ApacheJMeter_core.jar:5.1 r1853635] at org.apache.jmeter.threads.JMeterThread.notifyTestListeners(JMeterThread.java:973) ~[ApacheJMeter_core.jar:5.1 r1853635] at org.apache.jmeter.threads.JMeterThread$IterationListener.iterationStart(JMeterThread.java:1054) ~[ApacheJMeter_core.jar:5.1 r1853635] at org.apache.jmeter.control.GenericController.fireIterationStart(GenericController.java:399) ~[ApacheJMeter_core.jar:5.1 r1853635] at org.apache.jmeter.control.GenericController.fireIterEvents(GenericController.java:391) ~[ApacheJMeter_core.jar:5.1 r1853635] at org.apache.jmeter.control.GenericController.next(GenericController.java:160) ~[ApacheJMeter_core.jar:5.1 r1853635] at org.apache.jmeter.control.LoopController.next(LoopController.java:135) ~[ApacheJMeter_core.jar:5.1 r1853635] at org.apache.jmeter.control.LoopController.nextIsNull(LoopController.java:167) ~[ApacheJMeter_core.jar:5.1 r1853635] at org.apache.jmeter.control.GenericController.next(GenericController.java:170) ~[ApacheJMeter_core.jar:5.1 r1853635] at org.apache.jmeter.control.LoopController.next(LoopController.java:135) ~[ApacheJMeter_core.jar:5.1 r1853635] at org.apache.jmeter.control.GenericController.nextIsAController(GenericController.java:225) ~[ApacheJMeter_core.jar:5.1 r1853635] at org.apache.jmeter.control.GenericController.next(GenericController.java:175) ~[ApacheJMeter_core.jar:5.1 r1853635] at org.apache.jmeter.control.LoopController.next(LoopController.java:135) ~[ApacheJMeter_core.jar:5.1 r1853635] at org.apache.jmeter.control.LoopController.nextIsNull(LoopController.java:167) ~[ApacheJMeter_core.jar:5.1 r1853635] at org.apache.jmeter.control.GenericController.next(GenericController.java:170) ~[ApacheJMeter_core.jar:5.1 r1853635] at org.apache.jmeter.control.LoopController.next(LoopController.java:135) ~[ApacheJMeter_core.jar:5.1 r1853635] at org.apache.jmeter.control.GenericController.nextIsAController(GenericController.java:225) ~[ApacheJMeter_core.jar:5.1 r1853635] at org.apache.jmeter.control.GenericController.next(GenericController.java:175) ~[ApacheJMeter_core.jar:5.1 r1853635] at org.apache.jmeter.control.LoopController.next(LoopController.java:135) ~[ApacheJMeter_core.jar:5.1 r1853635] at org.apache.jmeter.control.LoopController.nextIsNull(LoopController.java:167) ~[ApacheJMeter_core.jar:5.1 r1853635] at org.apache.jmeter.control.GenericController.next(GenericController.java:170) ~[ApacheJMeter_core.jar:5.1 r1853635] at org.apache.jmeter.control.LoopController.next(LoopController.java:135) ~[ApacheJMeter_core.jar:5.1 r1853635] at org.apache.jmeter.control.GenericController.nextIsAController(GenericController.java:225) ~[ApacheJMeter_core.jar:5.1 r1853635] at org.apache.jmeter.control.GenericController.next(GenericController.java:175) ~[ApacheJMeter_core.jar:5.1 r1853635] ``` 前辈们帮忙看看
求助:ubuntu12.04 +cuda5.5安装问题????????
chester@chester-N81Vg:~/下载$ ls cuda_5.5.22_linux_64.run cuda在linux上的安装指南.doc cuda-repo-ubuntu1204_5.5-0_amd64.deb chester@chester-N81Vg:~/下载$ sudo dpkg -i cuda-repo-ubuntu1204_5.5-0_amd64.deb (正在读取数据库 ... 系统当前共安装有 180795 个文件和目录。) 正预备替换 cuda-repo-ubuntu1204 5.5-0 (使用 cuda-repo-ubuntu1204_5.5-0_amd64.deb) ... 正在解压缩将用于更替的包文件 cuda-repo-ubuntu1204 ... gpg: 密钥‘cudatools’找不到:eof gpg: cudatools: delete key failed: eof 正在设置 cuda-repo-ubuntu1204 (5.5-0) ... gpg: 找不到有效的 OpenPGP 数据。
android repo下载代码超时问题
局域网使用 repo管理代码 gerrit审核的,通过sshkey认证的(生成后公钥发送到服务器开通权限) 之前可以下载代码 重装系统后 用备份的ssh还原/home/用户名/.ssh 然后配置repo 执行 repo init -u git@×××××× 提示 ssh timeout 然后我直接ssh 到服务器 可以链接提示输入密码认证 用git clone 也是ssh超时 。我想问几个问题。 1、ssh生成的公钥 密钥 做备份重装系统后能够直接还原用吗?还是必须再次生成然后再次向服务器申请下载权限? 2、repo init -u git@10.20.××.××:alps/manifest.git -m mtk8127-Korea.xml 提示 ssh: connect to host 10.20.××.×× port 22: Connection timed out fatal: Could not read from remote repository. Please make sure you have the correct access rights and the repository exists. 3、git clone git@×××××也是超时 但是我直接 ssh 10.20.××.×× 是可以的连通的 那么我这个到底是什么原因导致的需要怎么处理 求高手帮忙 对 Ubuntu ssh git repo不懂刚接触。
相见恨晚的超实用网站
搞学习 知乎:www.zhihu.com 简答题:http://www.jiandati.com/ 网易公开课:https://open.163.com/ted/ 网易云课堂:https://study.163.com/ 中国大学MOOC:www.icourse163.org 网易云课堂:study.163.com 哔哩哔哩弹幕网:www.bilibili.com 我要自学网:www.51zxw
花了20分钟,给女朋友们写了一个web版群聊程序
参考博客 [1]https://www.byteslounge.com/tutorials/java-ee-html5-websocket-example
爬虫福利二 之 妹子图网MM批量下载
爬虫福利一:27报网MM批量下载    点击 看了本文,相信大家对爬虫一定会产生强烈的兴趣,激励自己去学习爬虫,在这里提前祝:大家学有所成! 目标网站:妹子图网 环境:Python3.x 相关第三方模块:requests、beautifulsoup4 Re:各位在测试时只需要将代码里的变量 path 指定为你当前系统要保存的路径,使用 python xxx.py 或IDE运行即可。
字节跳动视频编解码面经
引言 本文主要是记录一下面试字节跳动的经历。 三四月份投了字节跳动的实习(图形图像岗位),然后hr打电话过来问了一下会不会opengl,c++,shador,当时只会一点c++,其他两个都不会,也就直接被拒了。 七月初内推了字节跳动的提前批,因为内推没有具体的岗位,hr又打电话问要不要考虑一下图形图像岗,我说实习投过这个岗位不合适,不会opengl和shador,然后hr就说秋招更看重基础。我当时
Java学习的正确打开方式
在博主认为,对于入门级学习java的最佳学习方法莫过于视频+博客+书籍+总结,前三者博主将淋漓尽致地挥毫于这篇博客文章中,至于总结在于个人,实际上越到后面你会发现学习的最好方式就是阅读参考官方文档其次就是国内的书籍,博客次之,这又是一个层次了,这里暂时不提后面再谈。博主将为各位入门java保驾护航,各位只管冲鸭!!!上天是公平的,只要不辜负时间,时间自然不会辜负你。 何谓学习?博主所理解的学习,它
程序员必须掌握的核心算法有哪些?
由于我之前一直强调数据结构以及算法学习的重要性,所以就有一些读者经常问我,数据结构与算法应该要学习到哪个程度呢?,说实话,这个问题我不知道要怎么回答你,主要取决于你想学习到哪些程度,不过针对这个问题,我稍微总结一下我学过的算法知识点,以及我觉得值得学习的算法。这些算法与数据结构的学习大多数是零散的,并没有一本把他们全部覆盖的书籍。下面是我觉得值得学习的一些算法以及数据结构,当然,我也会整理一些看过
大学四年自学走来,这些私藏的实用工具/学习网站我贡献出来了
大学四年,看课本是不可能一直看课本的了,对于学习,特别是自学,善于搜索网上的一些资源来辅助,还是非常有必要的,下面我就把这几年私藏的各种资源,网站贡献出来给你们。主要有:电子书搜索、实用工具、在线视频学习网站、非视频学习网站、软件下载、面试/求职必备网站。 注意:文中提到的所有资源,文末我都给你整理好了,你们只管拿去,如果觉得不错,转发、分享就是最大的支持了。 一、电子书搜索 对于大部分程序员...
linux系列之常用运维命令整理笔录
本博客记录工作中需要的linux运维命令,大学时候开始接触linux,会一些基本操作,可是都没有整理起来,加上是做开发,不做运维,有些命令忘记了,所以现在整理成博客,当然vi,文件操作等就不介绍了,慢慢积累一些其它拓展的命令,博客不定时更新 顺便拉下票,我在参加csdn博客之星竞选,欢迎投票支持,每个QQ或者微信每天都可以投5票,扫二维码即可,http://m234140.nofollow.ax.
比特币原理详解
一、什么是比特币 比特币是一种电子货币,是一种基于密码学的货币,在2008年11月1日由中本聪发表比特币白皮书,文中提出了一种去中心化的电子记账系统,我们平时的电子现金是银行来记账,因为银行的背后是国家信用。去中心化电子记账系统是参与者共同记账。比特币可以防止主权危机、信用风险。其好处不多做赘述,这一层面介绍的文章很多,本文主要从更深层的技术原理角度进行介绍。 二、问题引入 假设现有4个人...
Python 基础(一):入门必备知识
目录1 标识符2 关键字3 引号4 编码5 输入输出6 缩进7 多行8 注释9 数据类型10 运算符10.1 常用运算符10.2 运算符优先级 1 标识符 标识符是编程时使用的名字,用于给变量、函数、语句块等命名,Python 中标识符由字母、数字、下划线组成,不能以数字开头,区分大小写。 以下划线开头的标识符有特殊含义,单下划线开头的标识符,如:_xxx ,表示不能直接访问的类属性,需通过类提供
这30个CSS选择器,你必须熟记(上)
关注前端达人,与你共同进步CSS的魅力就是让我们前端工程师像设计师一样进行网页的设计,我们能轻而易举的改变颜色、布局、制作出漂亮的影音效果等等,我们只需要改几行代码,不需...
国产开源API网关项目进入Apache孵化器:APISIX
点击蓝色“程序猿DD”关注我回复“资源”获取独家整理的学习资料!近日,又有一个开源项目加入了这个Java开源界大名鼎鼎的Apache基金会,开始进行孵化器。项目名称:AP...
程序员接私活怎样防止做完了不给钱?
首先跟大家说明一点,我们做 IT 类的外包开发,是非标品开发,所以很有可能在开发过程中会有这样那样的需求修改,而这种需求修改很容易造成扯皮,进而影响到费用支付,甚至出现做完了项目收不到钱的情况。 那么,怎么保证自己的薪酬安全呢? 我们在开工前,一定要做好一些证据方面的准备(也就是“讨薪”的理论依据),这其中最重要的就是需求文档和验收标准。一定要让需求方提供这两个文档资料作为开发的基础。之后开发
网页实现一个简单的音乐播放器(大佬别看。(⊙﹏⊙))
今天闲着无事,就想写点东西。然后听了下歌,就打算写个播放器。 于是乎用h5 audio的加上js简单的播放器完工了。 欢迎 改进 留言。 演示地点跳到演示地点 html代码如下`&lt;!DOCTYPE html&gt; &lt;html&gt; &lt;head&gt; &lt;title&gt;music&lt;/title&gt; &lt;meta charset="utf-8"&gt
Python十大装B语法
Python 是一种代表简单思想的语言,其语法相对简单,很容易上手。不过,如果就此小视 Python 语法的精妙和深邃,那就大错特错了。本文精心筛选了最能展现 Python 语法之精妙的十个知识点,并附上详细的实例代码。如能在实战中融会贯通、灵活使用,必将使代码更为精炼、高效,同时也会极大提升代码B格,使之看上去更老练,读起来更优雅。 1. for - else 什么?不是 if 和 else 才
数据库优化 - SQL优化
前面一篇文章从实例的角度进行数据库优化,通过配置一些参数让数据库性能达到最优。但是一些“不好”的SQL也会导致数据库查询变慢,影响业务流程。本文从SQL角度进行数据库优化,提升SQL运行效率。 判断问题SQL 判断SQL是否有问题时可以通过两个表象进行判断: 系统级别表象 CPU消耗严重 IO等待严重 页面响应时间过长
2019年11月中国大陆编程语言排行榜
2019年11月2日,我统计了某招聘网站,获得有效程序员招聘数据9万条。针对招聘信息,提取编程语言关键字,并统计如下: 编程语言比例 rank pl_ percentage 1 java 33.62% 2 c/c++ 16.42% 3 c_sharp 12.82% 4 javascript 12.31% 5 python 7.93% 6 go 7.25% 7
通俗易懂地给女朋友讲:线程池的内部原理
餐厅的约会 餐盘在灯光的照耀下格外晶莹洁白,女朋友拿起红酒杯轻轻地抿了一小口,对我说:“经常听你说线程池,到底线程池到底是个什么原理?”我楞了一下,心里想女朋友今天是怎么了,怎么突然问出这么专业的问题,但做为一个专业人士在女朋友面前也不能露怯啊,想了一下便说:“我先给你讲讲我前同事老王的故事吧!” 大龄程序员老王 老王是一个已经北漂十多年的程序员,岁数大了,加班加不动了,升迁也无望,于是拿着手里
经典算法(5)杨辉三角
杨辉三角 是经典算法,这篇博客对它的算法思想进行了讲解,并有完整的代码实现。
编写Spring MVC控制器的14个技巧
本期目录 1.使用@Controller构造型 2.实现控制器接口 3.扩展AbstractController类 4.为处理程序方法指定URL映射 5.为处理程序方法指定HTTP请求方法 6.将请求参数映射到处理程序方法 7.返回模型和视图 8.将对象放入模型 9.处理程序方法中的重定向 10.处理表格提交和表格验证 11.处理文件上传 12.在控制器中自动装配业务类 ...
腾讯算法面试题:64匹马8个跑道需要多少轮才能选出最快的四匹?
昨天,有网友私信我,说去阿里面试,彻底的被打击到了。问了为什么网上大量使用ThreadLocal的源码都会加上private static?他被难住了,因为他从来都没有考虑过这个问题。无独有偶,今天笔者又发现有网友吐槽了一道腾讯的面试题,我们一起来看看。 腾讯算法面试题:64匹马8个跑道需要多少轮才能选出最快的四匹? 在互联网职场论坛,一名程序员发帖求助到。二面腾讯,其中一个算法题:64匹
面试官:你连RESTful都不知道我怎么敢要你?
面试官:了解RESTful吗? 我:听说过。 面试官:那什么是RESTful? 我:就是用起来很规范,挺好的 面试官:是RESTful挺好的,还是自我感觉挺好的 我:都挺好的。 面试官:… 把门关上。 我:… 要干嘛?先关上再说。 面试官:我说出去把门关上。 我:what ?,夺门而去 文章目录01 前言02 RESTful的来源03 RESTful6大原则1. C-S架构2. 无状态3.统一的接
求小姐姐抠图竟遭白眼?痛定思痛,我决定用 Python 自力更生!
点击蓝色“Python空间”关注我丫加个“星标”,每天一起快乐的学习大家好,我是 Rocky0429,一个刚恰完午饭,正在用刷网页浪费生命的蒟蒻...一堆堆无聊八卦信息的网页内容慢慢使我的双眼模糊,一个哈欠打出了三斤老泪,就在此时我看到了一张图片:是谁!是谁把我女朋友的照片放出来的!awsl!太好看了叭...等等,那个背景上的一堆鬼画符是什么鬼?!真是看不下去!叔叔婶婶能忍,隔壁老王的三姨妈的四表...
为啥国人偏爱Mybatis,而老外喜欢Hibernate/JPA呢?
关于SQL和ORM的争论,永远都不会终止,我也一直在思考这个问题。昨天又跟群里的小伙伴进行了一番讨论,感触还是有一些,于是就有了今天这篇文。 声明:本文不会下关于Mybatis和JPA两个持久层框架哪个更好这样的结论。只是摆事实,讲道理,所以,请各位看官勿喷。 一、事件起因 关于Mybatis和JPA孰优孰劣的问题,争论已经很多年了。一直也没有结论,毕竟每个人的喜好和习惯是大不相同的。我也看
SQL-小白最佳入门sql查询一
不要偷偷的查询我的个人资料,即使你再喜欢我,也不要这样,真的不好;
项目中的if else太多了,该怎么重构?
介绍 最近跟着公司的大佬开发了一款IM系统,类似QQ和微信哈,就是聊天软件。我们有一部分业务逻辑是这样的 if (msgType = "文本") { // dosomething } else if(msgType = "图片") { // doshomething } else if(msgType = "视频") { // doshomething } else { // doshom...
致 Python 初学者
欢迎来到“Python进阶”专栏!来到这里的每一位同学,应该大致上学习了很多 Python 的基础知识,正在努力成长的过程中。在此期间,一定遇到了很多的困惑,对未来的学习方向感到迷茫。我非常理解你们所面临的处境。我从2007年开始接触 python 这门编程语言,从2009年开始单一使用 python 应对所有的开发工作,直至今天。回顾自己的学习过程,也曾经遇到过无数的困难,也曾经迷茫过、困惑过。开办这个专栏,正是为了帮助像我当年一样困惑的 Python 初学者走出困境、快速成长。希望我的经验能真正帮到你
“狗屁不通文章生成器”登顶GitHub热榜,分分钟写出万字形式主义大作
一、垃圾文字生成器介绍 最近在浏览GitHub的时候,发现了这样一个骨骼清奇的雷人项目,而且热度还特别高。 项目中文名:狗屁不通文章生成器 项目英文名:BullshitGenerator 根据作者的介绍,他是偶尔需要一些中文文字用于GUI开发时测试文本渲染,因此开发了这个废话生成器。但由于生成的废话实在是太过富于哲理,所以最近已经被小伙伴们给玩坏了。 他的文风可能是这样的: 你发现,...
程序员:我终于知道post和get的区别
是一个老生常谈的话题,然而随着不断的学习,对于以前的认识有很多误区,所以还是需要不断地总结的,学而时习之,不亦说乎
《程序人生》系列-这个程序员只用了20行代码就拿了冠军
你知道的越多,你不知道的越多 点赞再看,养成习惯GitHub上已经开源https://github.com/JavaFamily,有一线大厂面试点脑图,欢迎Star和完善 前言 这一期不算《吊打面试官》系列的,所有没前言我直接开始。 絮叨 本来应该是没有这期的,看过我上期的小伙伴应该是知道的嘛,双十一比较忙嘛,要值班又要去帮忙拍摄年会的视频素材,还得搞个程序员一天的Vlog,还要写BU...
相关热词 c#选择结构应用基本算法 c# 收到udp包后回包 c#oracle 头文件 c# 序列化对象 自定义 c# tcp 心跳 c# ice连接服务端 c# md5 解密 c# 文字导航控件 c#注册dll文件 c#安装.net
立即提问