关于ubuntu下python的import的一个问题

比如 import pygame
我之前安装pygame时是sudo pip install python-pygame
然后我如果打开python 2.7的IDLE,import pygame是没问题的
但是如果在terminal 里先$ python,然后import pygame就会说no moudule named pygame
求dalao们教教如何解决

1个回答

terminal里面看看你python安装环境中有没有这个包。site packages

a8228771
a8228771 我用path发现jupyter的路径跟直接terminal里python的路径一样是在anaconda2里的,但是是跟IDLE的不同,IDLE的在usr里,如果我要import tensorflow ,如果用IDLE可以直接import,用terminal打开的python不行,于是我在anaconda那配置了tensorflow的运行环境后并在那安装了,但是我在terminal里activate tensorflow这个才能正常import,如果用jupyter也还是不行,新手不太懂,希望能指导下
大约 3 年之前 回复
Csdn user default icon
上传中...
上传图片
插入图片
抄袭、复制答案,以达到刷声望分或其他目的的行为,在CSDN问答是严格禁止的,一经发现立刻封号。是时候展现真正的技术了!
其他相关推荐
python中import文件出错

我有两台机器:computer1和computer2,在computer1上有一个如下结构的文件夹,其中test.py中写有: from b.c import fun 。我在a文件夹下运行python b/test.py就可以成功,把代码拷到computer2上后,所有路径都相同,在a文件夹下运行python b/test.py就错误,而改成from c import fun就可以。 python里import的路径到底是怎么回事? ├── <a>/ │ ├── <b>/ │ │ ├── test.py │ │ ├── <c>/ │ │ │ ├── fun.py └── ...

ubuntu16.04 python2.7环境下使用matplotlib不能画图

刚安装了matplotlib,试了下下面几行代码,但不能画图,请问该怎么解决呢? ``` >>> import matplotlib.pyplot as plt >>> plt.bar(left = (0,1),height = (1,0.5)) <Container object of 2 artists> >>> plt.show() (.:14956): GLib-GIO-CRITICAL **: g_dbus_connection_register_object: assertion 'G_IS_DBUS_CONNECTION (connection)' failed (.:14956): GLib-GIO-CRITICAL **: g_dbus_connection_register_object: assertion 'G_IS_DBUS_CONNECTION (connection)' failed (.:14956): GLib-GIO-CRITICAL **: g_dbus_connection_get_unique_name: assertion 'G_IS_DBUS_CONNECTION (connection)' failed Traceback (most recent call last): File "/usr/local/lib/python2.7/dist-packages/matplotlib/backends/backend_gtk3.py", line 339, in idle_draw self.draw() File "/usr/local/lib/python2.7/dist-packages/matplotlib/backends/backend_gtk3.py", line 332, in draw self.get_property("window").process_updates (False) TypeError: Couldn't find foreign struct converter for 'cairo.Context' ```

各位朋友好,请教ubuntu系统python3.4环境下安装matplotlib报错的解决办法

具体的问题是这样的: 我的系统是Ubuntu14.04 的64位系统,python3.4版本下,想使用matplotlib来做图。 由于matplotlib依赖numpy和python的图像库PIL,因此我先安装numpy和PIL然后,再安装matplotlib, 这里附上我的安装matplotlib的shell命令 #安装科学计算库numpy sudo pip3 install numpy #安装图像处理库PIL sudo apt-get install python3.4-dev -y sudo apt-get install libjpeg8-dev zlib1g-dev libfreetype6-dev -y sudo ln -s /usr/lib/x86_64-linux-gnu/libjpeg.so /usr/lib sudo ln -s /usr/lib/x86_64-linux-gnu/libfreetype.so /usr/lib sudo ln -s /usr/lib/x86_64-linux-gnu/libz.so /usr/lib sudo apt-get install python3-pil #安装画图库matplotlib sudo pip3 install matplotlib 但是发现虽然安装成功(在python3的shell交互环境下, import matplotlib 是可以的),但是 执行如下语句 from matplotlib import pyplot as plt 报错: "/usr/local/lib/python3.4/dist-packages/matplotlib-1.5.1-py3.4-linux-x86_64.egg/matplotlib/backends/backend_gtk3.py", line 58, in <module> cursors.MOVE : Gdk.Cursor.new(Gdk.CursorType.FLEUR), TypeError: constructor returned NULL 希望各位朋友能指点一下,十分感谢

ubuntu16.04下python打开http/https报错

![ubuntu16.04下使用python中的urllib.urlopen()打开https报错IOError](https://img-ask.csdn.net/upload/201708/27/1503834919_805174.png) ``` >>> import urllib >>> urllib.urlopen('https://www.baidu.com') Traceback (most recent call last): File "<stdin>", line 1, in <module> File "/usr/local/lib/python2.7/urllib.py", line 87, in urlopen return opener.open(url) File "/usr/local/lib/python2.7/urllib.py", line 210, in open return self.open_unknown(fullurl, data) File "/usr/local/lib/python2.7/urllib.py", line 222, in open_unknown raise IOError, ('url error', 'unknown url type', type) IOError: [Errno url error] unknown url type: 'https' ``` 报错信息:IOError: [Errno url error] unknown url type: 'https' ![ubuntu16.04下使用python中的urllib2.urlopen()打开https/http报错](https://img-ask.csdn.net/upload/201708/27/1503835100_415721.png) ``` >>> import urllib2 >>> urllib2.urlopen('https://www.baidu.com') Traceback (most recent call last): File "<stdin>", line 1, in <module> File "/usr/local/lib/python2.7/urllib2.py", line 154, in urlopen return opener.open(url, data, timeout) File "/usr/local/lib/python2.7/urllib2.py", line 429, in open response = self._open(req, data) File "/usr/local/lib/python2.7/urllib2.py", line 452, in _open 'unknown_open', req) File "/usr/local/lib/python2.7/urllib2.py", line 407, in _call_chain result = func(*args) File "/usr/local/lib/python2.7/urllib2.py", line 1266, in unknown_open raise URLError('unknown url type: %s' % type) urllib2.URLError: <urlopen error unknown url type: https> >>> urllib2.urlopen('http://www.baidu.com') Traceback (most recent call last): File "<stdin>", line 1, in <module> File "/usr/local/lib/python2.7/urllib2.py", line 154, in urlopen return opener.open(url, data, timeout) File "/usr/local/lib/python2.7/urllib2.py", line 429, in open response = self._open(req, data) File "/usr/local/lib/python2.7/urllib2.py", line 447, in _open '_open', req) File "/usr/local/lib/python2.7/urllib2.py", line 407, in _call_chain result = func(*args) File "/usr/local/lib/python2.7/urllib2.py", line 1228, in http_open return self.do_open(httplib.HTTPConnection, req) File "/usr/local/lib/python2.7/urllib2.py", line 1198, in do_open raise URLError(err) urllib2.URLError: <urlopen error [Errno -3] Temporary failure in name resolution> >>> ``` 报错信息: urllib2.URLError: <urlopen error unknown url type: https> urllib2.URLError: <urlopen error [Errno -3] Temporary failure in name resolution> 这个要如何解决?求大神指点迷津,谢谢!

ubuntu18.04 python3.6 pip安装mysqlclient报错

ubuntu18.04 python3.6 pip安装mysqlclient报错 求大佬解答 ``` Building wheels for collected packages: mysqlclient Running setup.py bdist_wheel for mysqlclient ... error Complete output from command /usr/bin/python3 -u -c "import setuptools, tokenize;__file__='/tmp/pip-build-njxuuzpo/mysqlclient/setup.py';f=getattr(tokenize, 'open', open)(__file__);code=f.read().replace('\r\n', '\n');f.close();exec(compile(code, __file__, 'exec'))" bdist_wheel -d /tmp/tmpzs54ny_2pip-wheel- --python-tag cp36: running bdist_wheel running build running build_py creating build creating build/lib.linux-x86_64-3.6 creating build/lib.linux-x86_64-3.6/MySQLdb copying MySQLdb/__init__.py -> build/lib.linux-x86_64-3.6/MySQLdb copying MySQLdb/_exceptions.py -> build/lib.linux-x86_64-3.6/MySQLdb copying MySQLdb/compat.py -> build/lib.linux-x86_64-3.6/MySQLdb copying MySQLdb/connections.py -> build/lib.linux-x86_64-3.6/MySQLdb copying MySQLdb/converters.py -> build/lib.linux-x86_64-3.6/MySQLdb copying MySQLdb/cursors.py -> build/lib.linux-x86_64-3.6/MySQLdb copying MySQLdb/release.py -> build/lib.linux-x86_64-3.6/MySQLdb copying MySQLdb/times.py -> build/lib.linux-x86_64-3.6/MySQLdb creating build/lib.linux-x86_64-3.6/MySQLdb/constants copying MySQLdb/constants/__init__.py -> build/lib.linux-x86_64-3.6/MySQLdb/constants copying MySQLdb/constants/CLIENT.py -> build/lib.linux-x86_64-3.6/MySQLdb/constants copying MySQLdb/constants/CR.py -> build/lib.linux-x86_64-3.6/MySQLdb/constants copying MySQLdb/constants/ER.py -> build/lib.linux-x86_64-3.6/MySQLdb/constants copying MySQLdb/constants/FIELD_TYPE.py -> build/lib.linux-x86_64-3.6/MySQLdb/constants copying MySQLdb/constants/FLAG.py -> build/lib.linux-x86_64-3.6/MySQLdb/constants running build_ext building 'MySQLdb._mysql' extension creating build/temp.linux-x86_64-3.6 creating build/temp.linux-x86_64-3.6/MySQLdb x86_64-linux-gnu-gcc -pthread -DNDEBUG -g -fwrapv -O2 -Wall -g -fstack-protector-strong -Wformat -Werror=format-security -Wdate-time -D_FORTIFY_SOURCE=2 -fPIC -Dversion_info=(1,4,5,'final',0) -D__version__=1.4.5 -I/usr/include/mysql -I/usr/include/python3.6m -c MySQLdb/_mysql.c -o build/temp.linux-x86_64-3.6/MySQLdb/_mysql.o x86_64-linux-gnu-gcc -pthread -shared -Wl,-O1 -Wl,-Bsymbolic-functions -Wl,-Bsymbolic-functions -Wl,-z,relro -Wl,-Bsymbolic-functions -Wl,-z,relro -g -fstack-protector-strong -Wformat -Werror=format-security -Wdate-time -D_FORTIFY_SOURCE=2 build/temp.linux-x86_64-3.6/MySQLdb/_mysql.o -lmysqlclient -lpthread -lz -lm -lrt -latomic -lssl -lcrypto -ldl -o build/lib.linux-x86_64-3.6/MySQLdb/_mysql.cpython-36m-x86_64-linux-gnu.so /usr/bin/ld: cannot find -lssl /usr/bin/ld: cannot find -lcrypto collect2: error: ld returned 1 exit status error: command 'x86_64-linux-gnu-gcc' failed with exit status 1 ---------------------------------------- Failed building wheel for mysqlclient Running setup.py clean for mysqlclient Failed to build mysqlclient Installing collected packages: mysqlclient Running setup.py install for mysqlclient ... error Complete output from command /usr/bin/python3 -u -c "import setuptools, tokenize;__file__='/tmp/pip-build-njxuuzpo/mysqlclient/setup.py';f=getattr(tokenize, 'open', open)(__file__);code=f.read().replace('\r\n', '\n');f.close();exec(compile(code, __file__, 'exec'))" install --record /tmp/pip-ldoqhl56-record/install-record.txt --single-version-externally-managed --compile --user --prefix=: running install running build running build_py creating build creating build/lib.linux-x86_64-3.6 creating build/lib.linux-x86_64-3.6/MySQLdb copying MySQLdb/__init__.py -> build/lib.linux-x86_64-3.6/MySQLdb copying MySQLdb/_exceptions.py -> build/lib.linux-x86_64-3.6/MySQLdb copying MySQLdb/compat.py -> build/lib.linux-x86_64-3.6/MySQLdb copying MySQLdb/connections.py -> build/lib.linux-x86_64-3.6/MySQLdb copying MySQLdb/converters.py -> build/lib.linux-x86_64-3.6/MySQLdb copying MySQLdb/cursors.py -> build/lib.linux-x86_64-3.6/MySQLdb copying MySQLdb/release.py -> build/lib.linux-x86_64-3.6/MySQLdb copying MySQLdb/times.py -> build/lib.linux-x86_64-3.6/MySQLdb creating build/lib.linux-x86_64-3.6/MySQLdb/constants copying MySQLdb/constants/__init__.py -> build/lib.linux-x86_64-3.6/MySQLdb/constants copying MySQLdb/constants/CLIENT.py -> build/lib.linux-x86_64-3.6/MySQLdb/constants copying MySQLdb/constants/CR.py -> build/lib.linux-x86_64-3.6/MySQLdb/constants copying MySQLdb/constants/ER.py -> build/lib.linux-x86_64-3.6/MySQLdb/constants copying MySQLdb/constants/FIELD_TYPE.py -> build/lib.linux-x86_64-3.6/MySQLdb/constants copying MySQLdb/constants/FLAG.py -> build/lib.linux-x86_64-3.6/MySQLdb/constants running build_ext building 'MySQLdb._mysql' extension creating build/temp.linux-x86_64-3.6 creating build/temp.linux-x86_64-3.6/MySQLdb x86_64-linux-gnu-gcc -pthread -DNDEBUG -g -fwrapv -O2 -Wall -g -fstack-protector-strong -Wformat -Werror=format-security -Wdate-time -D_FORTIFY_SOURCE=2 -fPIC -Dversion_info=(1,4,5,'final',0) -D__version__=1.4.5 -I/usr/include/mysql -I/usr/include/python3.6m -c MySQLdb/_mysql.c -o build/temp.linux-x86_64-3.6/MySQLdb/_mysql.o x86_64-linux-gnu-gcc -pthread -shared -Wl,-O1 -Wl,-Bsymbolic-functions -Wl,-Bsymbolic-functions -Wl,-z,relro -Wl,-Bsymbolic-functions -Wl,-z,relro -g -fstack-protector-strong -Wformat -Werror=format-security -Wdate-time -D_FORTIFY_SOURCE=2 build/temp.linux-x86_64-3.6/MySQLdb/_mysql.o -lmysqlclient -lpthread -lz -lm -lrt -latomic -lssl -lcrypto -ldl -o build/lib.linux-x86_64-3.6/MySQLdb/_mysql.cpython-36m-x86_64-linux-gnu.so /usr/bin/ld: cannot find -lssl /usr/bin/ld: cannot find -lcrypto collect2: error: ld returned 1 exit status error: command 'x86_64-linux-gnu-gcc' failed with exit status 1 ---------------------------------------- Command "/usr/bin/python3 -u -c "import setuptools, tokenize;__file__='/tmp/pip-build-njxuuzpo/mysqlclient/setup.py';f=getattr(tokenize, 'open', open)(__file__);code=f.read().replace('\r\n', '\n');f.close();exec(compile(code, __file__, 'exec'))" install --record /tmp/pip-ldoqhl56-record/install-record.txt --single-version-externally-managed --compile --user --prefix=" failed with error code 1 in /tmp/pip-build-njxuuzpo/mysqlclient/ ```

python import matplotlib.pyplot 报错 DLL load failed

Anaconda3.5 python3.6 pycharm win7系统 import matplotlib没问题 matplotlib 2.1.0 import matplotlib.pyplot 报错 ![图片说明](https://img-ask.csdn.net/upload/201712/07/1512653783_182335.png) 另外,import matplotlib之前有个错误,更新了numpy之后好了。 在网上没找到类似的问题

ubuntu上python无法爬取网页

在ubuntu12.04下写了个简单的python测试代码: # -*- coding: UTF-8 -*- import time,urllib2,urllib,StringIO,sys,os,multiprocessing,sqlite3 if __name__ == '__main__': stockUrl="http://www.baidu.com" stockWeb = urllib.urlopen(stockUrl).read() print stockWeb 但是出现了如下错误: Traceback (most recent call last): File "test.py", line 6, in <module> stockWeb = urllib.urlopen(stockUrl).read() File "/usr/lib/python2.7/urllib.py", line 86, in urlopen return opener.open(url) File "/usr/lib/python2.7/urllib.py", line 207, in open return getattr(self, name)(url) File "/usr/lib/python2.7/urllib.py", line 344, in open_http h.endheaders(data) File "/usr/lib/python2.7/httplib.py", line 954, in endheaders self._send_output(message_body) File "/usr/lib/python2.7/httplib.py", line 814, in _send_output self.send(msg) File "/usr/lib/python2.7/httplib.py", line 776, in send self.connect() File "/usr/lib/python2.7/httplib.py", line 757, in connect self.timeout, self.source_address) File "/usr/lib/python2.7/socket.py", line 553, in create_connection for res in getaddrinfo(host, port, 0, SOCK_STREAM): IOError: [Errno socket error] [Errno -2] Name or service not known GOOGLE了也没找到解决办法,这是什么问题? 另外,同样的代码吗,我在另一台同样环境机器上是可以运行的

ubuntu安装pycrypto之后,import Crypto报错==

![图片说明](https://img-ask.csdn.net/upload/201807/23/1532316873_874514.png) 我已经安装了pycrypto了,用的是pycharm,我不知道为啥就是报错,求高手指点。

Python中import Theano失败

![图片说明](https://img-ask.csdn.net/upload/201803/07/1520424566_566593.png) 如图,Python版本3.5.4,已经安装了MinGW和theano,但是在python中import时出现这样的错误,大佬们有什么解决思路么?

python提示ImportError: No module named Image

我ubuntu安装了PIL,在python环境下输入:import Image时没有提示错误,可以运行. 但是我电脑同时安装了virtualenv,当在venv环境下输入import Image时会提示ImportError: No module named Image. 我想可能是虚拟环境下没有PIL 的问题,于是我又在venv环境下安装Python Imaging Library 1.7,然后又输入了一遍sudo apt-get install python-imaging. 没想到在venv环境下进行来上述两步后,再输入import Image时仍然提示同样的错误. 都装过了为什么还是提示没有Image呢?哪位老师指点一下,谢谢.

linux使用clion进行c++和python的交叉编译,无法导入python的第三方库

在ubuntu14.04下使用clion进行c++调用python编写的模块,当python中import第三方库(如numpy时),出现错误。具体如下: 这是我的代码: cmakelist: ``` cmake_minimum_required(VERSION 3.5) project(image_pretreat) set(CMAKE_CXX_FLAGS "${CMAKE_CXX_FLAGS} -std=c++11 -util -ldl -pthread") # 添加Python.h头文件路径 include_directories(/home/neil/.pyenv/versions/3.6.4/include/python3.6m) # 添加python动态链接库文件目录 link_directories(/home/neil/.pyenv/versions/3.6.4/lib/python3.6/config-3.6m-x86_64-linux-gnu) set(SOURCE_FILES main.cpp) add_executable(image_pretreat ${SOURCE_FILES}) # 依赖库文件 target_link_libraries(image_pretreat libpython3.6m.a) target_link_libraries(image_pretreat ${CMAKE_DL_LIBS}) target_link_libraries(image_pretreat util) ``` main函数 ``` #include <Python.h> #include <iostream> using namespace std; int main() { Py_Initialize(); //声明python对象(模型、函数、参数、返回值) PyObject *pModule, *pFunction, *pArgs, *pRetValue; PyRun_SimpleString("import sys"); PyRun_SimpleString("sys.path.append('/home/neil/ClionProjects/image_pretreat')"); //调用python模块 pModule = PyImport_ImportModule("test123"); if (!pModule) { printf("import python failed!!\n"); return -1; } //调用python模块中的函数 pFunction = PyObject_GetAttrString(pModule, "add"); if (!pFunction) { printf("get python function failed!!!\n"); return -1; } //新建python元组对象 pArgs = PyTuple_New(2); PyTuple_SetItem(pArgs, 0, Py_BuildValue("i", 1)); PyTuple_SetItem(pArgs, 1, Py_BuildValue("i", 2)); int r1,r2; r1=r2=0; pRetValue=PyObject_CallObject(pFunction, pArgs); PyArg_ParseTuple(pRetValue, "i|i", &r1, &r2); printf("%d,%d",r1,r2); //关闭 Python 脚本解释器 Py_Finalize(); return 0; } ``` Python模块 ``` import numpy as np def add(a,b): return a+b,a-b ``` 报错: import python failed!! Process finished with exit code 255 已采取方法: 1、将python3.6各个路径都包含进了PYTHONPATH和PYTHONHOME环境变量 2、主函数中手动设置py_SetPythonhome函数

php上的ubuntu proc_open命令错误与python

<div class="post-text" itemprop="text"> <p>i faced this problem while i was trying to use <strong>youtube-dl by php on ubuntu</strong>.</p> <blockquote> <p><strong>I am using XAMPP for Linux v1.8.3 (PHP 5.5.9)</strong></p> </blockquote> <hr> <p>The error i received after executing:</p> <blockquote> <p>{"status":0,"errors":"Traceback (most recent call last): File \"/usr/bin/youtube-dl\", line 3, in import youtube_dl File \"/usr/lib/python2.7/dist-packages/youtube_dl/_<em>init</em>_.py\", line 65, in from .utils import ( File \"/usr/lib/python2.7/dist-packages/youtube_dl/utils.py\", line 18, in import ssl File \"/usr/lib/python2.7/ssl.py\", line 61, in import _ssl # if we can't import it, let the error propagate ImportError: /usr/lib/python2.7/lib-dynload/_ssl.x86_64-linux-gnu.so: symbol GENERAL_NAME_free, version OPENSSL_1.0.0 not defined in file libcrypto.so.1.0.0 with link time reference</p> </blockquote> <p>And this is my php code</p> <pre><code>&lt;?php $url = 'https://www.youtube.com/watch?v=xFQFMSNZW08&amp;list=RDV-jLo0Ovems'; //escapeshellarg $string = ('youtube-dl --max-quality 2180 --write-thumbnail -x --audio-format mp3 -c -o "/home/bahaa/%(id)s.%(ext)s" https://www.youtube.com/watch?v=xFQFMSNZW08&amp;list=RDV-jLo0Ovems'); $descriptorspec = array( 0 =&gt; array("pipe", "r"), // stdin 1 =&gt; array("pipe", "w"), // stdout 2 =&gt; array("pipe", "w"), // stderr ); $process = proc_open($string, $descriptorspec, $pipes); $stdout = stream_get_contents($pipes[1]); fclose($pipes[1]); $stderr = stream_get_contents($pipes[2]); fclose($pipes[2]); $ret = proc_close($process); echo json_encode( array( 'status' =&gt; $ret, 'errors' =&gt; str_replace(array('', " "), "&lt;br /&gt;", $stderr."&lt;hr /&gt;"), 'output' =&gt; $stdout, ) ); ?&gt; </code></pre> <p>Any help will be appreciated. </p> </div>

Linux环境下,在Qt中调用Python,导入第三方库时出错?

有关python的文件列表如下: ![图片说明](https://img-ask.csdn.net/upload/202003/10/1583811655_177622.png) 在Terminal中用python解释器运行时完全正常: ![图片说明](https://img-ask.csdn.net/upload/202003/10/1583811736_800874.png) 在把该py文件加入Qt项目后,运行时出错。 ![图片说明](https://img-ask.csdn.net/upload/202003/10/1583811777_994860.png) 以下是python的调用代码: ``` //【1】初始化 Py_Initialize(); if (!Py_IsInitialized()) { qDebug() << "init python failed"; return; } //【2】添加python模块路径 PyRun_SimpleString("import sys"); PyRun_SimpleString("sys.path.append('/root/IOLTest/')"); //【3】导入python模块 PyObject* pModule = PyImport_ImportModule("bandpass"); if (!pModule) { qDebug() << "import module bandpass failed"; return; } //【4】获取python函数 PyObject* pFunhello= PyObject_GetAttrString(pModule,"hello"); if(!pFunhello) { qDebug() << "call hello failed"; return; } //【5】调用python函数 PyObject_CallObject(pFunhello,NULL); //【6】释放python组件 Py_Finalize(); ``` 程序运行到第三步导入python模块时出错,try-except打印的信息是: ``` IMPORTANT: PLEASE READ THIS FOR ADVICE ON HOW TO SOLVE THIS ISSUE! Importing the numpy c-extensions failed. - Try uninstalling and reinstalling numpy. - If you have already done that, then: 1. Check that you expected to use Python3.6 from "/usr/bin/python3", and that you have no directories in your PATH or PYTHONPATH that can interfere with the Python and numpy version "1.18.1" you're trying to use. 2. If (1) looks fine, you can open a new issue at https://github.com/numpy/numpy/issues. Please include details on: - how you installed Python - how you installed numpy - your operating system - whether or not you have multiple versions of Python installed - if you built from source, your compiler versions and ideally a build log - If you're working with a numpy git repository, try `git clean -xdf` (removes all files not under version control) and rebuild numpy. Note: this error has many possible causes, so please don't comment on an existing issue about this - open a new one instead. Original error was: /usr/local/lib/python3.6/dist-packages/numpy/core/_multiarray_umath.cpython-36m-x86_64-linux-gnu.so: undefined symbol: PyExc_ImportError ``` 问题出在导入第三方库上,即 import scipy.signal as signal 这行代码,若是去掉,则可以正常运行。 貌似是Qt里的环境跟Terminal不一样,所以有没有知道原因和解决方案的大牛,还望指点一二。

ubuntu下Anaconda下好了但是无法启动Spyder

Anaconda加入了环境变量了, 我用conda list看了是存在一个spyder的。 vim修改好了程序也能运行 但是终端下试图运行spyder都报错,看信息是缺了东西?但是我下载Anaconda的时候都没有改动原来的设定。 > Traceback (most recent call last): > File "/root/anaconda2/bin/spyder", line 6, in <module> > sys.exit(spyder.app.start.main()) > File "/root/anaconda2/lib/python2.7/site-packages/spyder/app/start.py", line 103, in main > from spyder.app import mainwindow > File "/root/anaconda2/lib/python2.7/site-packages/spyder/app/mainwindow.py", line 78, in <module> > from qtpy.compat import from_qvariant > File "/root/anaconda2/lib/python2.7/site-packages/qtpy/compat.py", line 15, in <module> > from .QtWidgets import QFileDialog > File "/root/anaconda2/lib/python2.7/site-packages/qtpy/QtWidgets.py", line 22, in <module> > from PyQt5.QtWidgets import * > ImportError: libGL.so.1: cannot open shared object file: No such file or directory 可转支付宝,谢谢! 更新: =20170507= ![Anaconda版本](https://img-ask.csdn.net/upload/201705/07/1494137456_673954.png) 谢谢大家看来我是缺了很多东西。 现在 * pygt 更新 4.3.14-py27_0 --> 4.3.17-py27_0 * libgl1-mesa-dev下载了最新版本12.0.6-0ubuntu0.16.04.1) * 再spyder也是报错信息变为 > This application failed to start because it could not find or load the Qt platform plugin "xcb" > in "". > Available platform plugins are: minimal, offscreen, xcb. > Reinstalling the application may fix this problem. 此外 再度apt-get install libgl1-mesa-dev或者apt-get install "^libxcb.*" libx11-xcb-dev libglu1-mesa-dev libxrender-dev 除了说已经安装最新,它会提示我有2个没用的可以卸载 > The following packages were automatically installed and are no longer required: > linux-headers-4.4.0-31 linux-headers-4.4.0-31-generic linux-image-4.4.0-31-generic > linux-image-extra-4.4.0-31-generic > Use 'apt autoremove' to remove them. 不过我没敢动。多余的应该不影响?

关于python安装pymssql报错,求大神指点,在ubuntu14.04下

报错内容: ``` (pyenvdata)lin@lin-ThinkPad:~$ pip install pymssql Downloading/unpacking pymssql Downloading pymssql-2.1.1.tar.gz (2.4MB): 2.4MB downloaded Running setup.py (path:/home/lin/pyenvdata/build/pymssql/setup.py) egg_info for package pymssql setup.py: platform.system() => 'Linux' setup.py: platform.architecture() => ('64bit', 'ELF') setup.py: platform.linux_distribution() => ('Ubuntu', '14.04', 'trusty') setup.py: platform.libc_ver() => ('glibc', '2.4') setup.py: Not using bundled FreeTDS setup.py: include_dirs = ['/usr/local/include'] setup.py: library_dirs = ['/usr/local/lib'] Installed /home/lin/pyenvdata/build/pymssql/setuptools_git-1.1-py2.7.egg Installing collected packages: pymssql Running setup.py install for pymssql setup.py: platform.system() => 'Linux' setup.py: platform.architecture() => ('64bit', 'ELF') setup.py: platform.linux_distribution() => ('Ubuntu', '14.04', 'trusty') setup.py: platform.libc_ver() => ('glibc', '2.4') setup.py: Not using bundled FreeTDS setup.py: include_dirs = ['/usr/local/include'] setup.py: library_dirs = ['/usr/local/lib'] building '_mssql' extension x86_64-linux-gnu-gcc -pthread -fno-strict-aliasing -DNDEBUG -g -fwrapv -O2 -Wall -Wstrict-prototypes -fPIC -I/usr/local/include -I/usr/include/python2.7 -c _mssql.c -o build/temp.linux-x86_64-2.7/_mssql.o -DMSDBLIB _mssql.c:314:22: fatal error: sqlfront.h: 没有那个文件或目录 #include "sqlfront.h" ^ compilation terminated. error: command 'x86_64-linux-gnu-gcc' failed with exit status 1 Complete output from command /home/lin/pyenvdata/bin/python -c "import setuptools, tokenize;__file__='/home/lin/pyenvdata/build/pymssql/setup.py';exec(compile(getattr(tokenize, 'open', open)(__file__).read().replace('\r\n', '\n'), __file__, 'exec'))" install --record /tmp/pip-c75p_h-record/install-record.txt --single-version-externally-managed --compile --install-headers /home/lin/pyenvdata/include/site/python2.7: setup.py: platform.system() => 'Linux' setup.py: platform.architecture() => ('64bit', 'ELF') setup.py: platform.linux_distribution() => ('Ubuntu', '14.04', 'trusty') setup.py: platform.libc_ver() => ('glibc', '2.4') setup.py: Not using bundled FreeTDS setup.py: include_dirs = ['/usr/local/include'] setup.py: library_dirs = ['/usr/local/lib'] running install running build running build_ext building '_mssql' extension creating build creating build/temp.linux-x86_64-2.7 x86_64-linux-gnu-gcc -pthread -fno-strict-aliasing -DNDEBUG -g -fwrapv -O2 -Wall -Wstrict-prototypes -fPIC -I/usr/local/include -I/usr/include/python2.7 -c _mssql.c -o build/temp.linux-x86_64-2.7/_mssql.o -DMSDBLIB _mssql.c:314:22: fatal error: sqlfront.h: 没有那个文件或目录 #include "sqlfront.h" ^ compilation terminated. error: command 'x86_64-linux-gnu-gcc' failed with exit status 1 ---------------------------------------- Cleaning up... Command /home/lin/pyenvdata/bin/python -c "import setuptools, tokenize;__file__='/home/lin/pyenvdata/build/pymssql/setup.py';exec(compile(getattr(tokenize, 'open', open)(__file__).read().replace('\r\n', '\n'), __file__, 'exec'))" install --record /tmp/pip-c75p_h-record/install-record.txt --single-version-externally-managed --compile --install-headers /home/lin/pyenvdata/include/site/python2.7 failed with error code 1 in /home/lin/pyenvdata/build/pymssql Traceback (most recent call last): File "/home/lin/pyenvdata/bin/pip", line 11, in <module> sys.exit(main()) File "/home/lin/pyenvdata/local/lib/python2.7/site-packages/pip/__init__.py", line 185, in main return command.main(cmd_args) File "/home/lin/pyenvdata/local/lib/python2.7/site-packages/pip/basecommand.py", line 161, in main text = '\n'.join(complete_log) UnicodeDecodeError: 'ascii' codec can't decode byte 0xe6 in position 46: ordinal not in range(128) ```

TK1 python comport caffe error

Traceback (most recent call last): File "/home/ubuntu/python_data_test.py", line 9, in <module> import caffe File "/home/ubuntu/caffe/python/caffe/__init__.py", line 1, in <module> from .pycaffe import Net, SGDSolver, NesterovSolver, AdaGradSolver, RMSPropSolver, AdaDeltaSolver, AdamSolver, NCCL, Timer File "/home/ubuntu/caffe/python/caffe/pycaffe.py", line 13, in <module> from ._caffe import Net, SGDSolver, NesterovSolver, AdaGradSolver, \ ImportError: libcudart.so.6.5: cannot open shared object file: No such file or directory

python3.6.5安装from Crypto.Cipher import AES 插件

winrand.c C:\Program Files (x86)\Windows Kits\10\include\10.0.10240.0\ucrt\inttypes.h(26): error C2061: 语法 错误: 标识符“intmax_t” C:\Program Files (x86)\Windows Kits\10\include\10.0.10240.0\ucrt\inttypes.h(27): error C2061: 语法 错误: 标识符“rem” C:\Program Files (x86)\Windows Kits\10\include\10.0.10240.0\ucrt\inttypes.h(27): error C2059: 语法 错误:“;” C:\Program Files (x86)\Windows Kits\10\include\10.0.10240.0\ucrt\inttypes.h(28): error C2059: 语法 错误:“}” C:\Program Files (x86)\Windows Kits\10\include\10.0.10240.0\ucrt\inttypes.h(30): error C2061: 语法 错误: 标识符“imaxdiv_t” C:\Program Files (x86)\Windows Kits\10\include\10.0.10240.0\ucrt\inttypes.h(30): error C2059: 语法 错误:“;” C:\Program Files (x86)\Windows Kits\10\include\10.0.10240.0\ucrt\inttypes.h(40): error C2143: 语法 错误: 缺少“{”(在“__cdecl”的前面) C:\Program Files (x86)\Windows Kits\10\include\10.0.10240.0\ucrt\inttypes.h(41): error C2146: 语法 错误: 缺少“)”(在标识符“_Number”的前面) C:\Program Files (x86)\Windows Kits\10\include\10.0.10240.0\ucrt\inttypes.h(41): error C2061: 语法 错误: 标识符“_Number” C:\Program Files (x86)\Windows Kits\10\include\10.0.10240.0\ucrt\inttypes.h(41): error C2059: 语法 错误:“;” C:\Program Files (x86)\Windows Kits\10\include\10.0.10240.0\ucrt\inttypes.h(42): error C2059: 语法 错误:“)” C:\Program Files (x86)\Windows Kits\10\include\10.0.10240.0\ucrt\inttypes.h(45): error C2143: 语法 错误: 缺少“{”(在“__cdecl”的前面) C:\Program Files (x86)\Windows Kits\10\include\10.0.10240.0\ucrt\inttypes.h(46): error C2146: 语法 错误: 缺少“)”(在标识符“_Numerator”的前面) C:\Program Files (x86)\Windows Kits\10\include\10.0.10240.0\ucrt\inttypes.h(46): error C2061: 语法 错误: 标识符“_Numerator” C:\Program Files (x86)\Windows Kits\10\include\10.0.10240.0\ucrt\inttypes.h(46): error C2059: 语法 错误:“;” C:\Program Files (x86)\Windows Kits\10\include\10.0.10240.0\ucrt\inttypes.h(46): error C2059: 语法 错误:“,” C:\Program Files (x86)\Windows Kits\10\include\10.0.10240.0\ucrt\inttypes.h(48): error C2059: 语法 错误:“)” C:\Program Files (x86)\Windows Kits\10\include\10.0.10240.0\ucrt\inttypes.h(50): error C2143: 语法 错误: 缺少“{”(在“__cdecl”的前面) C:\Program Files (x86)\Windows Kits\10\include\10.0.10240.0\ucrt\inttypes.h(56): error C2143: 语法 错误: 缺少“{”(在“__cdecl”的前面) C:\Program Files (x86)\Windows Kits\10\include\10.0.10240.0\ucrt\inttypes.h(63): error C2143: 语法 错误: 缺少“{”(在“__cdecl”的前面) C:\Program Files (x86)\Windows Kits\10\include\10.0.10240.0\ucrt\inttypes.h(69): error C2143: 语法 错误: 缺少“{”(在“__cdecl”的前面) C:\Program Files (x86)\Windows Kits\10\include\10.0.10240.0\ucrt\inttypes.h(76): error C2143: 语法 错误: 缺少“{”(在“__cdecl”的前面) C:\Program Files (x86)\Windows Kits\10\include\10.0.10240.0\ucrt\inttypes.h(82): error C2143: 语法 错误: 缺少“{”(在“__cdecl”的前面) C:\Program Files (x86)\Windows Kits\10\include\10.0.10240.0\ucrt\inttypes.h(89): error C2143: 语法 错误: 缺少“{”(在“__cdecl”的前面) C:\Program Files (x86)\Windows Kits\10\include\10.0.10240.0\ucrt\inttypes.h(95): error C2143: 语法 错误: 缺少“{”(在“__cdecl”的前面) error: command 'C:\\Program Files (x86)\\Microsoft Visual Studio\\2017\\Community\\VC\\Tools\\MSVC\ \14.13.26128\\bin\\HostX86\\x64\\cl.exe' failed with exit status 2 ---------------------------------------- Command "d:\python36\python.exe -u -c "import setuptools, tokenize;__file__='C:\\Users\\ADMINI~1\\AppDa ta\\Local\\Temp\\pip-install-f11kwaa6\\pycrypto\\setup.py';f=getattr(tokenize, 'open', open)(__file__); code=f.read().replace('\r\n', '\n');f.close();exec(compile(code, __file__, 'exec'))" install --record C :\Users\ADMINI~1\AppData\Local\Temp\pip-record-0_lm9jbu\install-record.txt --single-version-externally- managed --compile" failed with error code 1 in C:\Users\ADMINI~1\AppData\Local\Temp\pip-install-f11kwaa 6\pycrypto\

QT调用Python,调用第三库不成功

如果python 中没有import matplotlib.pyplot as plt 这行代码 QT调用成功,如果python中有这行代码在debug下调用成功release下不成功 请问这是什么原因

在中国程序员是青春饭吗?

今年,我也32了 ,为了不给大家误导,咨询了猎头、圈内好友,以及年过35岁的几位老程序员……舍了老脸去揭人家伤疤……希望能给大家以帮助,记得帮我点赞哦。 目录: 你以为的人生 一次又一次的伤害 猎头界的真相 如何应对互联网行业的「中年危机」 一、你以为的人生 刚入行时,拿着傲人的工资,想着好好干,以为我们的人生是这样的: 等真到了那一天,你会发现,你的人生很可能是这样的: ...

程序员请照顾好自己,周末病魔差点一套带走我。

程序员在一个周末的时间,得了重病,差点当场去世,还好及时挽救回来了。

Java基础知识面试题(2020最新版)

文章目录Java概述何为编程什么是Javajdk1.5之后的三大版本JVM、JRE和JDK的关系什么是跨平台性?原理是什么Java语言有哪些特点什么是字节码?采用字节码的最大好处是什么什么是Java程序的主类?应用程序和小程序的主类有何不同?Java应用程序与小程序之间有那些差别?Java和C++的区别Oracle JDK 和 OpenJDK 的对比基础语法数据类型Java有哪些数据类型switc...

和黑客斗争的 6 天!

互联网公司工作,很难避免不和黑客们打交道,我呆过的两家互联网公司,几乎每月每天每分钟都有黑客在公司网站上扫描。有的是寻找 Sql 注入的缺口,有的是寻找线上服务器可能存在的漏洞,大部分都...

Intellij IDEA 实用插件安利

1. 前言从2020 年 JVM 生态报告解读 可以看出Intellij IDEA 目前已经稳坐 Java IDE 头把交椅。而且统计得出付费用户已经超过了八成(国外统计)。IDEA 的...

搜狗输入法也在挑战国人的智商!

故事总是一个接着一个到来...上周写完《鲁大师已经彻底沦为一款垃圾流氓软件!》这篇文章之后,鲁大师的市场工作人员就找到了我,希望把这篇文章删除掉。经过一番沟通我先把这篇文章从公号中删除了...

总结了 150 余个神奇网站,你不来瞅瞅吗?

原博客再更新,可能就没了,之后将持续更新本篇博客。

副业收入是我做程序媛的3倍,工作外的B面人生是怎样的?

提到“程序员”,多数人脑海里首先想到的大约是:为人木讷、薪水超高、工作枯燥…… 然而,当离开工作岗位,撕去层层标签,脱下“程序员”这身外套,有的人生动又有趣,马上展现出了完全不同的A/B面人生! 不论是简单的爱好,还是正经的副业,他们都干得同样出色。偶尔,还能和程序员的特质结合,产生奇妙的“化学反应”。 @Charlotte:平日素颜示人,周末美妆博主 大家都以为程序媛也个个不修边幅,但我们也许...

MySQL数据库面试题(2020最新版)

文章目录数据库基础知识为什么要使用数据库什么是SQL?什么是MySQL?数据库三大范式是什么mysql有关权限的表都有哪几个MySQL的binlog有有几种录入格式?分别有什么区别?数据类型mysql有哪些数据类型引擎MySQL存储引擎MyISAM与InnoDB区别MyISAM索引与InnoDB索引的区别?InnoDB引擎的4大特性存储引擎选择索引什么是索引?索引有哪些优缺点?索引使用场景(重点)...

如果你是老板,你会不会踢了这样的员工?

有个好朋友ZS,是技术总监,昨天问我:“有一个老下属,跟了我很多年,做事勤勤恳恳,主动性也很好。但随着公司的发展,他的进步速度,跟不上团队的步伐了,有点...

我入职阿里后,才知道原来简历这么写

私下里,有不少读者问我:“二哥,如何才能写出一份专业的技术简历呢?我总感觉自己写的简历太烂了,所以投了无数份,都石沉大海了。”说实话,我自己好多年没有写过简历了,但我认识的一个同行,他在阿里,给我说了一些他当年写简历的方法论,我感觉太牛逼了,实在是忍不住,就分享了出来,希望能够帮助到你。 01、简历的本质 作为简历的撰写者,你必须要搞清楚一点,简历的本质是什么,它就是为了来销售你的价值主张的。往深...

魂迁光刻,梦绕芯片,中芯国际终获ASML大型光刻机

据羊城晚报报道,近日中芯国际从荷兰进口的一台大型光刻机,顺利通过深圳出口加工区场站两道闸口进入厂区,中芯国际发表公告称该光刻机并非此前盛传的EUV光刻机,主要用于企业复工复产后的生产线扩容。 我们知道EUV主要用于7nm及以下制程的芯片制造,光刻机作为集成电路制造中最关键的设备,对芯片制作工艺有着决定性的影响,被誉为“超精密制造技术皇冠上的明珠”,根据之前中芯国际的公报,目...

优雅的替换if-else语句

场景 日常开发,if-else语句写的不少吧??当逻辑分支非常多的时候,if-else套了一层又一层,虽然业务功能倒是实现了,但是看起来是真的很不优雅,尤其是对于我这种有强迫症的程序"猿",看到这么多if-else,脑袋瓜子就嗡嗡的,总想着解锁新姿势:干掉过多的if-else!!!本文将介绍三板斧手段: 优先判断条件,条件不满足的,逻辑及时中断返回; 采用策略模式+工厂模式; 结合注解,锦...

离职半年了,老东家又发 offer,回不回?

有小伙伴问松哥这个问题,他在上海某公司,在离职了几个月后,前公司的领导联系到他,希望他能够返聘回去,他很纠结要不要回去? 俗话说好马不吃回头草,但是这个小伙伴既然感到纠结了,我觉得至少说明了两个问题:1.曾经的公司还不错;2.现在的日子也不是很如意。否则应该就不会纠结了。 老实说,松哥之前也有过类似的经历,今天就来和小伙伴们聊聊回头草到底吃不吃。 首先一个基本观点,就是离职了也没必要和老东家弄的苦...

2020阿里全球数学大赛:3万名高手、4道题、2天2夜未交卷

阿里巴巴全球数学竞赛( Alibaba Global Mathematics Competition)由马云发起,由中国科学技术协会、阿里巴巴基金会、阿里巴巴达摩院共同举办。大赛不设报名门槛,全世界爱好数学的人都可参与,不论是否出身数学专业、是否投身数学研究。 2020年阿里巴巴达摩院邀请北京大学、剑桥大学、浙江大学等高校的顶尖数学教师组建了出题组。中科院院士、美国艺术与科学院院士、北京国际数学...

为什么你不想学习?只想玩?人是如何一步一步废掉的

不知道是不是只有我这样子,还是你们也有过类似的经历。 上学的时候总有很多光辉历史,学年名列前茅,或者单科目大佬,但是虽然慢慢地长大了,你开始懈怠了,开始废掉了。。。 什么?你说不知道具体的情况是怎么样的? 我来告诉你: 你常常潜意识里或者心理觉得,自己真正的生活或者奋斗还没有开始。总是幻想着自己还拥有大把时间,还有无限的可能,自己还能逆风翻盘,只不是自己还没开始罢了,自己以后肯定会变得特别厉害...

百度工程师,获利10万,判刑3年!

所有一夜暴富的方法都写在刑法中,但总有人心存侥幸。这些年互联网犯罪高发,一些工程师高技术犯罪更是引发关注。这两天,一个百度运维工程师的案例传遍朋友圈。1...

程序员为什么千万不要瞎努力?

本文作者用对比非常鲜明的两个开发团队的故事,讲解了敏捷开发之道 —— 如果你的团队缺乏统一标准的环境,那么即使勤劳努力,不仅会极其耗时而且成果甚微,使用...

为什么程序员做外包会被瞧不起?

二哥,有个事想询问下您的意见,您觉得应届生值得去外包吗?公司虽然挺大的,中xx,但待遇感觉挺低,马上要报到,挺纠结的。

当HR压你价,说你只值7K,你该怎么回答?

当HR压你价,说你只值7K时,你可以流畅地回答,记住,是流畅,不能犹豫。 礼貌地说:“7K是吗?了解了。嗯~其实我对贵司的面试官印象很好。只不过,现在我的手头上已经有一份11K的offer。来面试,主要也是自己对贵司挺有兴趣的,所以过来看看……”(未完) 这段话主要是陪HR互诈的同时,从公司兴趣,公司职员印象上,都给予对方正面的肯定,既能提升HR的好感度,又能让谈判气氛融洽,为后面的发挥留足空间。...

面试:第十六章:Java中级开发

HashMap底层实现原理,红黑树,B+树,B树的结构原理 Spring的AOP和IOC是什么?它们常见的使用场景有哪些?Spring事务,事务的属性,传播行为,数据库隔离级别 Spring和SpringMVC,MyBatis以及SpringBoot的注解分别有哪些?SpringMVC的工作原理,SpringBoot框架的优点,MyBatis框架的优点 SpringCould组件有哪些,他们...

面试阿里p7,被按在地上摩擦,鬼知道我经历了什么?

面试阿里p7被问到的问题(当时我只知道第一个):@Conditional是做什么的?@Conditional多个条件是什么逻辑关系?条件判断在什么时候执...

无代码时代来临,程序员如何保住饭碗?

编程语言层出不穷,从最初的机器语言到如今2500种以上的高级语言,程序员们大呼“学到头秃”。程序员一边面临编程语言不断推陈出新,一边面临由于许多代码已存在,程序员编写新应用程序时存在重复“搬砖”的现象。 无代码/低代码编程应运而生。无代码/低代码是一种创建应用的方法,它可以让开发者使用最少的编码知识来快速开发应用程序。开发者通过图形界面中,可视化建模来组装和配置应用程序。这样一来,开发者直...

面试了一个 31 岁程序员,让我有所触动,30岁以上的程序员该何去何从?

最近面试了一个31岁8年经验的程序猿,让我有点感慨,大龄程序猿该何去何从。

大三实习生,字节跳动面经分享,已拿Offer

说实话,自己的算法,我一个不会,太难了吧

程序员垃圾简历长什么样?

已经连续五年参加大厂校招、社招的技术面试工作,简历看的不下于万份 这篇文章会用实例告诉你,什么是差的程序员简历! 疫情快要结束了,各个公司也都开始春招了,作为即将红遍大江南北的新晋UP主,那当然要为小伙伴们做点事(手动狗头)。 就在公众号里公开征简历,义务帮大家看,并一一点评。《启舰:春招在即,义务帮大家看看简历吧》 一石激起千层浪,三天收到两百多封简历。 花光了两个星期的所有空闲时...

《Oracle Java SE编程自学与面试指南》最佳学习路线图2020年最新版(进大厂必备)

正确选择比瞎努力更重要!

字节跳动面试官竟然问了我JDBC?

轻松等回家通知

面试官:你连SSO都不懂,就别来面试了

大厂竟然要考我SSO,卧槽。

实时更新:计算机编程语言排行榜—TIOBE世界编程语言排行榜(2020年6月份最新版)

内容导航: 1、TIOBE排行榜 2、总榜(2020年6月份) 3、本月前三名 3.1、C 3.2、Java 3.3、Python 4、学习路线图 5、参考地址 1、TIOBE排行榜 TIOBE排行榜是根据全世界互联网上有经验的程序员、课程和第三方厂商的数量,并使用搜索引擎(如Google、Bing、Yahoo!)以及Wikipedia、Amazon、YouTube统计出排名数据。

阿里面试官让我用Zk(Zookeeper)实现分布式锁

他可能没想到,我当场手写出来了

立即提问
相关内容推荐