roguesir
roguesir
采纳率63.6%
2017-03-28 05:47

Mac 安装caffe时候出现如下错误,求解答

10
已采纳

提示./include/caffe/common.hpp:5:10: fatal error: 'gflags/gflags.h' file not found

1 error generated.
make: *** [.build_release/tools/upgrade_solver_proto_text.o] Error 1
make: *** [.build_release/tools/upgrade_net_proto_text.o] Error 1
make: *** [.build_release/tools/upgrade_net_proto_binary.o] Error 1

请问该如何处理?求解答

  • 点赞
  • 写回答
  • 关注问题
  • 收藏
  • 复制链接分享
  • 邀请回答

1条回答

  • dongbiao2009 gaodongbiao 4年前

    运行brew install gflags,如果提示已安装但没有link,就运行brew link gflags。
    如果link不成功可能要修改一下/usr/local目录的权限。
    修改权限(yourusername要替换成当前电脑用户名):
    chown -R yourusername /usr/local
    chmod -R u+w /usr/local

    点赞 评论 复制链接分享

相关推荐