studio使用gradle成功build,idea却失败

报错如下:

Error:Gradle: A problem occurred configuring root project 'MyApplication1'.
> Could not resolve all dependencies for configuration ':classpath'.
   > Could not resolve com.android.tools.build:gradle:2.2.2.
     Required by:
         :MyApplication1:unspecified
      > Could not resolve com.android.tools.build:gradle:2.2.2.
         > Could not get resource 'https://jcenter.bintray.com/com/android/tools/build/gradle/2.2.2/gradle-2.2.2.pom'.
            > Could not GET 'https://jcenter.bintray.com/com/android/tools/build/gradle/2.2.2/gradle-2.2.2.pom'. Received status code 400 from server: Bad Request

十分诡异!studio和idea 的 gradle设置几乎是一样的!gradle对应的版本也是存在的
图片说明
看了下网上很多文章,并没有解决问题!
是否有人遇到过相似问题,并且成功解决问题呢?

2个回答

Could not GET 'https://jcenter.bintray.com/com/android/tools/build/gradle/2.2.2/gradle-2.2.2.pom'.

--- 你这是网络访问有问题啊

StartsWithLove
StartsWithLove 上网是OK的啊
大约 3 年之前 回复

上网是OK的,而且Android Studio也是可以跑项目的。图片说明
如果真是网络问题...那这样的网络问题,该如何下手解决...

Csdn user default icon
上传中...
上传图片
插入图片
抄袭、复制答案,以达到刷声望分或其他目的的行为,在CSDN问答是严格禁止的,一经发现立刻封号。是时候展现真正的技术了!
其他相关推荐
新建工程后Android Studio 一直处于 Gradle Build Running

之前下载了Android Studio,是为了打开前辈写的APP然后做改进,也一直没有什么问题。最近开始自己写APP了,就新建了工程,然后就一直处于Gradle Build Running状态。 ![图片说明](https://img-ask.csdn.net/upload/201801/08/1515354912_187285.png) 网上的很多方法都试过了: (1)我的gradle-wrapper.properties的内容为distributionUrl=https\://services.gradle.org/distributions/gradle-3.3-all.zip,所以我用的是离线好的gradle-3.3-all.zip,放在默认的路径里,C:\Users\Administrator\.gradle\wrapper\dists\gradle-3.3-all\55gk2rcmfc6p2dg9u9ohc3hw9,并且选择的是offline,但是没有用 ![图片说明](https://img-ask.csdn.net/upload/201801/08/1515355353_727716.png) (2)关于添加grandle.properties文件,以及内容为org.gradle.daemon=true的建议也没有作用 我的build.gradle文件的内容如下: ![图片说明](https://img-ask.csdn.net/upload/201801/08/1515356033_39616.png) 请问怎样才能解决呢?

springboot gradle项目build成功,但是bootrun的时候失败了,折腾半天了,没有解决问题,跪求大神解答

> Task :app-ygrs-weixin:bootRun FAILED D:\IdeaProjects\microrada\app-ygrs-weixin\build\libs\app-ygrs-weixin-pathing.jar java.lang.NoClassDefFoundError: javax/servlet/Filter at java.lang.Class.getDeclaredMethods0(Native Method) at java.lang.Class.privateGetDeclaredMethods(Class.java:2701) at java.lang.Class.privateGetMethodRecursive(Class.java:3048) at java.lang.Class.getMethod0(Class.java:3018) at java.lang.Class.getMethod(Class.java:1784) at sun.launcher.LauncherHelper.validateMainClass(LauncherHelper.java:650) at sun.launcher.LauncherHelper.checkAndLoadMain(LauncherHelper.java:632) Caused by: java.lang.ClassNotFoundException: javax.servlet.Filter at java.net.URLClassLoader.findClass(URLClassLoader.java:382) at java.lang.ClassLoader.loadClass(ClassLoader.java:424) at sun.misc.Launcher$AppClassLoader.loadClass(Launcher.java:349) at java.lang.ClassLoader.loadClass(ClassLoader.java:357) ... 7 more Error: A JNI error has occurred, please check your installation and try again Exception in thread "main" FAILURE: Build failed with an exception.

Android studio配置Gradle路径错误

Gradle location is incorrect.这是怎么回事呀,百度上找不到答案

为什么我的android studio一运行程序就要build gradle而且时间特别慢?

报的log如下,build 了差不多15分钟才弹出选择avd界面,该怎么优化呢?: 8:50:25 Gradle build finished in 14m 51s 231ms

Android Studio 新建项目sync failed 失败 gradle包 下载好了,第一步能通过 就是如图的错误

![图片说明](https://img-ask.csdn.net/upload/201904/24/1556068345_388683.png) 8:53 Gradle sync failed: Connection timed out: connect Consult IDE log for more details (Help | Show Log) (37 s 239 ms) 换文件夹位置也试过了 就感觉Load通过了 Configure失败 是哪里的配置问题吗 安装的Studio是1.8.1 使用的gradle是4.6 https\://services.gradle.org/distributions/gradle-4.6-all.zip 这个也能下载 也放进去了 Gradle sync failed: Connection timed out: connect Consult IDE log for more details (Help | Show Log)

Android Studio Gradle project sync failed,Configure project:app 前出现红叹号

Android Studio Gradle project sync failed,Configure project:app 前出现红叹号 ![图片说明](https://img-ask.csdn.net/upload/201905/13/1557746272_155433.jpg) 提示为 ``` org.gradle.api.ProjectConfigurationException: A problem occurred configuring project ':app' at java.util.concurrent.ThreadPoolExecutor.runWorker(ThreadPoolExecutor.java:1142) at java.util.concurrent.ThreadPoolExecutor$Worker.run(ThreadPoolExecutor.java:617) at org.gradle.internal.concurrent.ThreadFactoryImpl$ManagedThreadRunnable.run(ThreadFactoryImpl.java:55) at java.lang.Thread.run(Thread.java:745) Caused by: com.android.builder.errors.EvalIssueException: Failed to install the following Android SDK packages as some licences have not been accepted. build-tools;28.0.2 Android SDK Build-Tools 28.0.2 To build this project, accept the SDK license agreements and install the missing components using the Android Studio SDK Manager. Alternatively, to transfer the license agreements from one workstation to another, see http://d.android.com/r/studio-ui/export-licenses.html Using Android SDK: D:\Android\SDK at com.android.build.gradle.internal.SdkHandler.initTarget(SdkHandler.java:194) at com.android.build.gradle.BasePlugin.ensureTargetSetup(BasePlugin.java:980) at com.android.build.gradle.BasePlugin.createAndroidTasks(BasePlugin.java:752) at com.android.build.gradle.BasePlugin.lambda$null$4(BasePlugin.java:690) at com.android.builder.profile.ThreadRecorder.record(ThreadRecorder.java:81) at com.android.build.gradle.BasePlugin.lambda$createTasks$5(BasePlugin.java:686) at org.gradle.internal.event.BroadcastDispatch$ActionInvocationHandler.dispatch(BroadcastDispatch.java:91) at org.gradle.internal.event.BroadcastDispatch$ActionInvocationHandler.dispatch(BroadcastDispatch.java:80) at org.gradle.internal.event.AbstractBroadcastDispatch.dispatch(AbstractBroadcastDispatch.java:42) at org.gradle.internal.event.BroadcastDispatch$SingletonDispatch.dispatch(BroadcastDispatch.java:230) at org.gradle.internal.event.BroadcastDispatch$SingletonDispatch.dispatch(BroadcastDispatch.java:149) at org.gradle.internal.event.AbstractBroadcastDispatch.dispatch(AbstractBroadcastDispatch.java:58) at org.gradle.internal.event.BroadcastDispatch$CompositeDispatch.dispatch(BroadcastDispatch.java:324) at org.gradle.internal.event.BroadcastDispatch$CompositeDispatch.dispatch(BroadcastDispatch.java:234) at org.gradle.internal.event.ListenerBroadcast.dispatch(ListenerBroadcast.java:140) at org.gradle.internal.event.ListenerBroadcast.dispatch(ListenerBroadcast.java:37) at org.gradle.internal.dispatch.ProxyDispatchAdapter$DispatchingInvocationHandler.invoke(ProxyDispatchAdapter.java:93) at com.sun.proxy.$Proxy27.afterEvaluate(Unknown Source) at org.gradle.configuration.project.LifecycleProjectEvaluator.notifyAfterEvaluate(LifecycleProjectEvaluator.java:76) ... 85 more ```

Gradle project sync failed 绝非老问题,我试过了各种方法均未成功

Gradle project sync failed.Basic functionality(e.e. edit... Error:Unable to start the daemon process. This problem might be caused by incorrect configuration of the daemon. For example, an unrecognized jvm option is used. Please refer to the user guide chapter on the daemon at https://docs.gradle.org/4.1/userguide/gradle_daemon.html Please read the following process output to find out more: ----------------------- idea.log 2018-01-18 20:16:52,280 [se-915-b01] INFO - #com.intellij.idea.Main - ------------------------------------------------------ IDE STARTED ------------------------------------------------------ 2018-01-18 20:16:52,284 [se-915-b01] INFO - #com.intellij.idea.Main - IDE: Android Studio (build #AI-171.4443003, 10 Nov 2017 02:49) 2018-01-18 20:16:52,284 [se-915-b01] INFO - #com.intellij.idea.Main - OS: Windows 10 (10.0, amd64) 2018-01-18 20:16:52,284 [se-915-b01] INFO - #com.intellij.idea.Main - JRE: 1.8.0_152-release-915-b01 (JetBrains s.r.o) 2018-01-18 20:16:52,284 [se-915-b01] INFO - #com.intellij.idea.Main - JVM: 25.152-b01 (OpenJDK 64-Bit Server VM) 2018-01-18 20:16:52,287 [se-915-b01] INFO - #com.intellij.idea.Main - JVM Args: -Xms256m -Xmx1280m -XX:ReservedCodeCacheSize=240m -XX:+UseConcMarkSweepGC -XX:SoftRefLRUPolicyMSPerMB=50 -Dsun.io.useCanonCaches=false -Djava.net.preferIPv4Stack=true -Djna.nosys=true -Djna.boot.library.path= -da -Djb.vmOptionsFile=C:\Program Files\Android\Android Studio\bin\studio64.exe.vmoptions -Xbootclasspath/a:C:\Program Files\Android\Android Studio\lib\boot.jar -Didea.platform.prefix=AndroidStudio -Didea.jre.check=true -Didea.paths.selector=AndroidStudio3.0 -XX:ErrorFile=C:\Users\mjj\java_error_in_studio_%p.log -XX:HeapDumpPath=C:\Users\mjj\java_error_in_studio.hprof gradle.properties 只有下面一项 org.gradle.jvmargs=-Xmx1536m 已尝试的解决办法均未成功: 1. 彻底干净的卸载Android Studio,重装,问题重现。 2. 修改 org.gradle.jvmargs=-Xmx1536m 为 512 或 1028,无用. 3. 让防火墙放行Android Studio,关闭防火墙,电脑上还有电脑管家,没有发现异常。 4. 查阅https://docs.gradle.org 第9、12章,均未找到解决办法。 5. 我的C盘空间有100G,但Windows10 + Android Studio 之后就满了,我用分区助手调整为400G,Genymotion不能启动了,之前也没有成功运行过虚拟机。彻底卸载重装后能启动了,注册到期,但仍然能有成功运行虚拟机。重装后DB Browser for SQLite 仍然不能运行。重装Eclipse后 不能安装插件,Intellij IDEA 也有问题,暂不能准确描述。 老问题: Android 虚拟机不能启动 Emulator: Process finished with exit code -1073741819 (0xC0000005) 我尝试下载了所有的镜像、有带google API 的,也有不带的。曾经有几次能启动不带Google API 的镜像。我帖子介绍说用户家目录中不能有中文,我按知乎上的方法更改了家目录,不成功。我切换到其它用户目录下仍然出现同样的问题,包括原始用户名为拼音的用户。

gradle构建不成功 控制台输出如下

# gradle构建不成功 控制台输出见下 > Task :ms-contract:assemble UP-TO-DATE > Task :ms-contract:compileTestJava UP-TO-DATE > Task :ms-contract:processTestResources NO-SOURCE > Task :ms-contract:testClasses UP-TO-DATE > Task :ms-contract:test com.yunlu.contract.service.ContractServiceImplTest > testSaveSalesTeam FAILED java.lang.Exception at ContractServiceImplTest.java:56 com.yunlu.contract.service.ContractTerminateServiceImplTest > testModifyContractStatus FAILED java.lang.AssertionError at ContractTerminateServiceImplTest.java:54 com.yunlu.contract.service.ContractTerminateServiceImplTest > testTerminateAdd FAILED java.lang.AssertionError at ContractTerminateServiceImplTest.java:41 16 tests completed, 3 failed > Task :ms-contract:test FAILED FAILURE: Build failed with an exception. * What went wrong: Execution failed for task ':ms-contract:test'. > There were failing tests. See the report at: file:///data/project/ms-contract/build/reports/tests/test/index.html * Try: Run with --stacktrace option to get the stack trace. Run with --info or --debug option to get more log output. Run with --scan to get full insights. * Get more help at https://help.gradle.org Deprecated Gradle features were used in this build, making it incompatible with Gradle 5.0. Use '--warning-mode all' to show the individual deprecation warnings. See https://docs.gradle.org/4.10.2/userguide/command_line_interface.html#sec:command_line_warnings BUILD FAILED in 2m 16s 查看报告只有一个这东西 java.lang.Exception: Duplicate confirmation of competition information. 不知道什么原因,求助!!!

刚安装好android studio 后新建第一个项目报错 Gradle sync failed

android studio 新建项目 Gradle sync failed: The first result from the daemon was empty. Most likely the process died immediately after connection. ![图片说明](https://img-ask.csdn.net/upload/201701/24/1485259415_875463.png) 关闭了杀毒软件,但还是报错; File->Invalidate Caches/Restart仍然出现这样的错误 ![图片说明](https://img-ask.csdn.net/upload/201701/24/1485259599_139647.png) 电脑没有连接任何其他设备 关于gradle的设置和文件是这样的:![图片说明](https://img-ask.csdn.net/upload/201701/24/1485259902_92537.png) ![图片说明](https://img-ask.csdn.net/upload/201701/24/1485259913_196525.png) ![图片说明](https://img-ask.csdn.net/upload/201701/24/1485261039_326185.png) 打开后看到: Caused by: org.gradle.launcher.daemon.client.NoUsableDaemonFoundException: Unable to find a usable idle daemon. I have connected to 100 different daemons but I could not use any of them to run the build. BuildActionParameters were DefaultBuildActionParameters {, currentDir=F:\Android_studio_projects\MyApplication, systemProperties size=91, envVariables size=43, logLevel=LIFECYCLE, daemonUsage=IMPLICITLY_DISABLED, continuous=false, interactive=false, injectedPluginClasspath=[]}.

Adroid Studio无法找到maven_push.gradle文件

Error:(32, 0) Could not read script 'C:\Study\smarthome+\SmartHome+\maven_push.gradle' as it does not exist. Adroid Studio将GitHub上的开源项目导入时无法找到maven_push.gradle文件

idea导入安卓项目时出现错误

Process 'command 'C:\Users\daiyuhe\AppData\Local\Android\Sdk\build-tools\28.0.3\aapt.exe'' finished with non-zero exit value 1 org.gradle.initialization.ReportedException: org.gradle.internal.exceptions.LocationAwareException: Execution failed for task ':processDebugResources'. at org.gradle.initialization.DefaultGradleLauncher.doBuildStages(DefaultGradleLauncher.java:137) at org.gradle.initialization.DefaultGradleLauncher.executeTasks(DefaultGradleLauncher.java:107) at org.gradle.internal.invocation.GradleBuildController$1.call(GradleBuildController.java:78) at org.gradle.internal.invocation.GradleBuildController$1.call(GradleBuildController.java:75) at org.gradle.internal.work.DefaultWorkerLeaseService.withLocks(DefaultWorkerLeaseService.java:152) at org.gradle.internal.invocation.GradleBuildController.doBuild(GradleBuildController.java:100) at org.gradle.internal.invocation.GradleBuildController.run(GradleBuildController.java:75) at org.gradle.tooling.internal.provider.runner.BuildModelActionRunner.run(BuildModelActionRunner.java:53) at org.gradle.launcher.exec.ChainingBuildActionRunner.run(ChainingBuildActionRunner.java:35) at org.gradle.launcher.exec.ChainingBuildActionRunner.run(ChainingBuildActionRunner.java:35) at org.gradle.tooling.internal.provider.ValidatingBuildActionRunner.run(ValidatingBuildActionRunner.java:32) at org.gradle.launcher.exec.RunAsBuildOperationBuildActionRunner$1.run(RunAsBuildOperationBuildActionRunner.java:43) at org.gradle.internal.progress.DefaultBuildOperationExecutor$RunnableBuildOperationWorker.execute(DefaultBuildOperationExecutor.java:336) at org.gradle.internal.progress.DefaultBuildOperationExecutor$RunnableBuildOperationWorker.execute(DefaultBuildOperationExecutor.java:328) at org.gradle.internal.progress.DefaultBuildOperationExecutor.execute(DefaultBuildOperationExecutor.java:197) at org.gradle.internal.progress.DefaultBuildOperationExecutor.run(DefaultBuildOperationExecutor.java:107) at org.gradle.launcher.exec.RunAsBuildOperationBuildActionRunner.run(RunAsBuildOperationBuildActionRunner.java:40) at org.gradle.tooling.internal.provider.SubscribableBuildActionRunner.run(SubscribableBuildActionRunner.java:51) at org.gradle.launcher.exec.InProcessBuildActionExecuter.execute(InProcessBuildActionExecuter.java:45) at org.gradle.launcher.exec.InProcessBuildActionExecuter.execute(InProcessBuildActionExecuter.java:29) at org.gradle.launcher.exec.BuildTreeScopeBuildActionExecuter.execute(BuildTreeScopeBuildActionExecuter.java:39) at org.gradle.launcher.exec.BuildTreeScopeBuildActionExecuter.execute(BuildTreeScopeBuildActionExecuter.java:25) at org.gradle.tooling.internal.provider.ContinuousBuildActionExecuter.execute(ContinuousBuildActionExecuter.java:71) at org.gradle.tooling.internal.provider.ContinuousBuildActionExecuter.execute(ContinuousBuildActionExecuter.java:45) at org.gradle.tooling.internal.provider.ServicesSetupBuildActionExecuter.execute(ServicesSetupBuildActionExecuter.java:51) at org.gradle.tooling.internal.provider.ServicesSetupBuildActionExecuter.execute(ServicesSetupBuildActionExecuter.java:32) at org.gradle.tooling.internal.provider.GradleThreadBuildActionExecuter.execute(GradleThreadBuildActionExecuter.java:36) at org.gradle.tooling.internal.provider.GradleThreadBuildActionExecuter.execute(GradleThreadBuildActionExecuter.java:25) at org.gradle.tooling.internal.provider.ParallelismConfigurationBuildActionExecuter.execute(ParallelismConfigurationBuildActionExecuter.java:43) at org.gradle.tooling.internal.provider.ParallelismConfigurationBuildActionExecuter.execute(ParallelismConfigurationBuildActionExecuter.java:29) at org.gradle.tooling.internal.provider.StartParamsValidatingActionExecuter.execute(StartParamsValidatingActionExecuter.java:64) at org.gradle.tooling.internal.provider.StartParamsValidatingActionExecuter.execute(StartParamsValidatingActionExecuter.java:29) at org.gradle.tooling.internal.provider.SessionFailureReportingActionExecuter.execute(SessionFailureReportingActionExecuter.java:55) at org.gradle.tooling.internal.provider.SessionFailureReportingActionExecuter.execute(SessionFailureReportingActionExecuter.java:42) at org.gradle.tooling.internal.provider.SetupLoggingActionExecuter.execute(SetupLoggingActionExecuter.java:58) at org.gradle.tooling.internal.provider.SetupLoggingActionExecuter.execute(SetupLoggingActionExecuter.java:33) at org.gradle.launcher.daemon.server.exec.ExecuteBuild.doBuild(ExecuteBuild.java:67) at org.gradle.launcher.daemon.server.exec.BuildCommandOnly.execute(BuildCommandOnly.java:36) at org.gradle.launcher.daemon.server.api.DaemonCommandExecution.proceed(DaemonCommandExecution.java:120) at org.gradle.launcher.daemon.server.exec.WatchForDisconnection.execute(WatchForDisconnection.java:37) at org.gradle.launcher.daemon.server.api.DaemonCommandExecution.proceed(DaemonCommandExecution.java:120) at org.gradle.launcher.daemon.server.exec.ResetDeprecationLogger.execute(ResetDeprecationLogger.java:26) at org.gradle.launcher.daemon.server.api.DaemonCommandExecution.proceed(DaemonCommandExecution.java:120) at org.gradle.launcher.daemon.server.exec.RequestStopIfSingleUsedDaemon.execute(RequestStopIfSingleUsedDaemon.java:34) at org.gradle.launcher.daemon.server.api.DaemonCommandExecution.proceed(DaemonCommandExecution.java:120) at org.gradle.launcher.daemon.server.exec.ForwardClientInput$2.call(ForwardClientInput.java:74) at org.gradle.launcher.daemon.server.exec.ForwardClientInput$2.call(ForwardClientInput.java:72) at org.gradle.util.Swapper.swap(Swapper.java:38) at org.gradle.launcher.daemon.server.exec.ForwardClientInput.execute(ForwardClientInput.java:72) at org.gradle.launcher.daemon.server.api.DaemonCommandExecution.proceed(DaemonCommandExecution.java:120) at org.gradle.launcher.daemon.server.exec.LogAndCheckHealth.execute(LogAndCheckHealth.java:55) at org.gradle.launcher.daemon.server.api.DaemonCommandExecution.proceed(DaemonCommandExecution.java:120) at org.gradle.launcher.daemon.server.exec.LogToClient.doBuild(LogToClient.java:62) at org.gradle.launcher.daemon.server.exec.BuildCommandOnly.execute(BuildCommandOnly.java:36) at org.gradle.launcher.daemon.server.api.DaemonCommandExecution.proceed(DaemonCommandExecution.java:120) at org.gradle.launcher.daemon.server.exec.EstablishBuildEnvironment.doBuild(EstablishBuildEnvironment.java:82) at org.gradle.launcher.daemon.server.exec.BuildCommandOnly.execute(BuildCommandOnly.java:36) at org.gradle.launcher.daemon.server.api.DaemonCommandExecution.proceed(DaemonCommandExecution.java:120) at org.gradle.launcher.daemon.server.exec.StartBuildOrRespondWithBusy$1.run(StartBuildOrRespondWithBusy.java:50) at org.gradle.launcher.daemon.server.DaemonStateCoordinator$1.run(DaemonStateCoordinator.java:297) at org.gradle.internal.concurrent.ExecutorPolicy$CatchAndRecordFailures.onExecute(ExecutorPolicy.java:63) at org.gradle.internal.concurrent.ManagedExecutorImpl$1.run(ManagedExecutorImpl.java:46) at java.util.concurrent.ThreadPoolExecutor.runWorker(ThreadPoolExecutor.java:1149) at java.util.concurrent.ThreadPoolExecutor$Worker.run(ThreadPoolExecutor.java:624) at org.gradle.internal.concurrent.ThreadFactoryImpl$ManagedThreadRunnable.run(ThreadFactoryImpl.java:55) at java.lang.Thread.run(Thread.java:748) Caused by: org.gradle.internal.exceptions.LocationAwareException: Execution failed for task ':processDebugResources'. at org.gradle.initialization.DefaultExceptionAnalyser.transform(DefaultExceptionAnalyser.java:74) at org.gradle.initialization.MultipleBuildFailuresExceptionAnalyser.transform(MultipleBuildFailuresExceptionAnalyser.java:47) at org.gradle.initialization.StackTraceSanitizingExceptionAnalyser.transform(StackTraceSanitizingExceptionAnalyser.java:30) at org.gradle.initialization.DefaultGradleLauncher.doBuildStages(DefaultGradleLauncher.java:135) at org.gradle.initialization.DefaultGradleLauncher.executeTasks(DefaultGradleLauncher.java:107) at org.gradle.internal.invocation.GradleBuildController$1.call(GradleBuildController.java:78) at org.gradle.internal.invocation.GradleBuildController$1.call(GradleBuildController.java:75) at org.gradle.internal.work.DefaultWorkerLeaseService.withLocks(DefaultWorkerLeaseService.java:152) at org.gradle.internal.invocation.GradleBuildController.doBuild(GradleBuildController.java:100) at org.gradle.internal.invocation.GradleBuildController.run(GradleBuildController.java:75) at org.gradle.tooling.internal.provider.runner.BuildModelActionRunner.run(BuildModelActionRunner.java:53) at org.gradle.launcher.exec.ChainingBuildActionRunner.run(ChainingBuildActionRunner.java:35) at org.gradle.launcher.exec.ChainingBuildActionRunner.run(ChainingBuildActionRunner.java:35) at org.gradle.tooling.internal.provider.ValidatingBuildActionRunner.run(ValidatingBuildActionRunner.java:32) at org.gradle.launcher.exec.RunAsBuildOperationBuildActionRunner$1.run(RunAsBuildOperationBuildActionRunner.java:43) at org.gradle.internal.progress.DefaultBuildOperationExecutor$RunnableBuildOperationWorker.execute(DefaultBuildOperationExecutor.java:336) at org.gradle.internal.progress.DefaultBuildOperationExecutor$RunnableBuildOperationWorker.execute(DefaultBuildOperationExecutor.java:328) at org.gradle.internal.progress.DefaultBuildOperationExecutor.execute(DefaultBuildOperationExecutor.java:197) at org.gradle.internal.progress.DefaultBuildOperationExecutor.run(DefaultBuildOperationExecutor.java:107) at org.gradle.launcher.exec.RunAsBuildOperationBuildActionRunner.run(RunAsBuildOperationBuildActionRunner.java:40) at org.gradle.tooling.internal.provider.SubscribableBuildActionRunner.run(SubscribableBuildActionRunner.java:51) at org.gradle.launcher.exec.InProcessBuildActionExecuter.execute(InProcessBuildActionExecuter.java:45) at org.gradle.launcher.exec.InProcessBuildActionExecuter.execute(InProcessBuildActionExecuter.java:29) at org.gradle.launcher.exec.BuildTreeScopeBuildActionExecuter.execute(BuildTreeScopeBuildActionExecuter.java:39) at org.gradle.launcher.exec.BuildTreeScopeBuildActionExecuter.execute(BuildTreeScopeBuildActionExecuter.java:25) at org.gradle.tooling.internal.provider.ContinuousBuildActionExecuter.execute(ContinuousBuildActionExecuter.java:71) at org.gradle.tooling.internal.provider.ContinuousBuildActionExecuter.execute(ContinuousBuildActionExecuter.java:45) at org.gradle.tooling.internal.provider.ServicesSetupBuildActionExecuter.execute(ServicesSetupBuildActionExecuter.java:51) at org.gradle.tooling.internal.provider.ServicesSetupBuildActionExecuter.execute(ServicesSetupBuildActionExecuter.java:32) at org.gradle.tooling.internal.provider.GradleThreadBuildActionExecuter.execute(GradleThreadBuildActionExecuter.java:36) at org.gradle.tooling.internal.provider.GradleThreadBuildActionExecuter.execute(GradleThreadBuildActionExecuter.java:25) at org.gradle.tooling.internal.provider.ParallelismConfigurationBuildActionExecuter.execute(ParallelismConfigurationBuildActionExecuter.java:43) at org.gradle.tooling.internal.provider.ParallelismConfigurationBuildActionExecuter.execute(ParallelismConfigurationBuildActionExecuter.java:29) at org.gradle.tooling.internal.provider.StartParamsValidatingActionExecuter.execute(StartParamsValidatingActionExecuter.java:64) at org.gradle.tooling.internal.provider.StartParamsValidatingActionExecuter.execute(StartParamsValidatingActionExecuter.java:29) at org.gradle.tooling.internal.provider.SessionFailureReportingActionExecuter.execute(SessionFailureReportingActionExecuter.java:55) at org.gradle.tooling.internal.provider.SessionFailureReportingActionExecuter.execute(SessionFailureReportingActionExecuter.java:42) at org.gradle.tooling.internal.provider.SetupLoggingActionExecuter.execute(SetupLoggingActionExecuter.java:58) at org.gradle.tooling.internal.provider.SetupLoggingActionExecuter.execute(SetupLoggingActionExecuter.java:33) at org.gradle.launcher.daemon.server.exec.ExecuteBuild.doBuild(ExecuteBuild.java:67) at org.gradle.launcher.daemon.server.exec.BuildCommandOnly.execute(BuildCommandOnly.java:36) at org.gradle.launcher.daemon.server.api.DaemonCommandExecution.proceed(DaemonCommandExecution.java:120) at org.gradle.launcher.daemon.server.exec.WatchForDisconnection.execute(WatchForDisconnection.java:37) at org.gradle.launcher.daemon.server.api.DaemonCommandExecution.proceed(DaemonCommandExecution.java:120) at org.gradle.launcher.daemon.server.exec.ResetDeprecationLogger.execute(ResetDeprecationLogger.java:26) at org.gradle.launcher.daemon.server.api.DaemonCommandExecution.proceed(DaemonCommandExecution.java:120) at org.gradle.launcher.daemon.server.exec.RequestStopIfSingleUsedDaemon.execute(RequestStopIfSingleUsedDaemon.java:34) at org.gradle.launcher.daemon.server.api.DaemonCommandExecution.proceed(DaemonCommandExecution.java:120) at org.gradle.launcher.daemon.server.exec.ForwardClientInput$2.call(ForwardClientInput.java:74) at org.gradle.launcher.daemon.server.exec.ForwardClientInput$2.call(ForwardClientInput.java:72) at org.gradle.util.Swapper.swap(Swapper.java:38) at org.gradle.launcher.daemon.server.exec.ForwardClientInput.execute(ForwardClientInput.java:72) at org.gradle.launcher.daemon.server.api.DaemonCommandExecution.proceed(DaemonCommandExecution.java:120) at org.gradle.launcher.daemon.server.exec.LogAndCheckHealth.execute(LogAndCheckHealth.java:55) at org.gradle.launcher.daemon.server.api.DaemonCommandExecution.proceed(DaemonCommandExecution.java:120) at org.gradle.launcher.daemon.server.exec.LogToClient.doBuild(LogToClient.java:62) at org.gradle.launcher.daemon.server.exec.BuildCommandOnly.execute(BuildCommandOnly.java:36) at org.gradle.launcher.daemon.server.api.DaemonCommandExecution.proceed(DaemonCommandExecution.java:120) at org.gradle.launcher.daemon.server.exec.EstablishBuildEnvironment.doBuild(EstablishBuildEnvironment.java:82) at org.gradle.launcher.daemon.server.exec.BuildCommandOnly.execute(BuildCommandOnly.java:36) at org.gradle.launcher.daemon.server.api.DaemonCommandExecution.proceed(DaemonCommandExecution.java:120) at org.gradle.launcher.daemon.server.exec.StartBuildOrRespondWithBusy$1.run(StartBuildOrRespondWithBusy.java:50) at org.gradle.launcher.daemon.server.DaemonStateCoordinator$1.run(DaemonStateCoordinator.java:297) at org.gradle.internal.concurrent.ExecutorPolicy$CatchAndRecordFailures.onExecute(ExecutorPolicy.java:63) at org.gradle.internal.concurrent.ManagedExecutorImpl$1.run(ManagedExecutorImpl.java:46) at org.gradle.internal.concurrent.ThreadFactoryImpl$ManagedThreadRunnable.run(ThreadFactoryImpl.java:55) Caused by: org.gradle.api.tasks.TaskExecutionException: Execution failed for task ':processDebugResources'. at org.gradle.api.internal.tasks.execution.ExecuteActionsTaskExecuter.executeActions(ExecuteActionsTaskExecuter.java:100) at org.gradle.api.internal.tasks.execution.ExecuteActionsTaskExecuter.execute(ExecuteActionsTaskExecuter.java:70) at org.gradle.api.internal.tasks.execution.SkipUpToDateTaskExecuter.execute(SkipUpToDateTaskExecuter.java:63) at org.gradle.api.internal.tasks.execution.ResolveTaskOutputCachingStateExecuter.execute(ResolveTaskOutputCachingStateExecuter.java:54) at org.gradle.api.internal.tasks.execution.ValidatingTaskExecuter.execute(ValidatingTaskExecuter.java:58) at org.gradle.api.internal.tasks.execution.SkipEmptySourceFilesTaskExecuter.execute(SkipEmptySourceFilesTaskExecuter.java:88) at org.gradle.api.internal.tasks.execution.ResolveTaskArtifactStateTaskExecuter.execute(ResolveTaskArtifactStateTaskExecuter.java:52) at org.gradle.api.internal.tasks.execution.SkipTaskWithNoActionsExecuter.execute(SkipTaskWithNoActionsExecuter.java:52) at org.gradle.api.internal.tasks.execution.SkipOnlyIfTaskExecuter.execute(SkipOnlyIfTaskExecuter.java:54) at org.gradle.api.internal.tasks.execution.ExecuteAtMostOnceTaskExecuter.execute(ExecuteAtMostOnceTaskExecuter.java:43) at org.gradle.api.internal.tasks.execution.CatchExceptionTaskExecuter.execute(CatchExceptionTaskExecuter.java:34) at org.gradle.execution.taskgraph.DefaultTaskGraphExecuter$EventFiringTaskWorker$1.run(DefaultTaskGraphExecuter.java:248) at org.gradle.internal.progress.DefaultBuildOperationExecutor$RunnableBuildOperationWorker.execute(DefaultBuildOperationExecutor.java:336) at org.gradle.internal.progress.DefaultBuildOperationExecutor$RunnableBuildOperationWorker.execute(DefaultBuildOperationExecutor.java:328) at org.gradle.internal.progress.DefaultBuildOperationExecutor.execute(DefaultBuildOperationExecutor.java:197) at org.gradle.internal.progress.DefaultBuildOperationExecutor.run(DefaultBuildOperationExecutor.java:107) at org.gradle.execution.taskgraph.DefaultTaskGraphExecuter$EventFiringTaskWorker.execute(DefaultTaskGraphExecuter.java:241) at org.gradle.execution.taskgraph.DefaultTaskGraphExecuter$EventFiringTaskWorker.execute(DefaultTaskGraphExecuter.java:230) at org.gradle.execution.taskgraph.DefaultTaskPlanExecutor$TaskExecutorWorker.processTask(DefaultTaskPlanExecutor.java:124) at org.gradle.execution.taskgraph.DefaultTaskPlanExecutor$TaskExecutorWorker.access$200(DefaultTaskPlanExecutor.java:80) at org.gradle.execution.taskgraph.DefaultTaskPlanExecutor$TaskExecutorWorker$1.execute(DefaultTaskPlanExecutor.java:105) at org.gradle.execution.taskgraph.DefaultTaskPlanExecutor$TaskExecutorWorker$1.execute(DefaultTaskPlanExecutor.java:99) at org.gradle.execution.taskgraph.DefaultTaskExecutionPlan.execute(DefaultTaskExecutionPlan.java:625) at org.gradle.execution.taskgraph.DefaultTaskExecutionPlan.executeWithTask(DefaultTaskExecutionPlan.java:580) at org.gradle.execution.taskgraph.DefaultTaskPlanExecutor$TaskExecutorWorker.run(DefaultTaskPlanExecutor.java:99) ... 3 more Caused by: java.lang.RuntimeException: com.android.ide.common.process.ProcessException: Failed to execute aapt at com.android.build.gradle.tasks.ProcessAndroidResources.doFullTaskAction(ProcessAndroidResources.java:201) at com.android.build.gradle.internal.tasks.IncrementalTask.taskAction(IncrementalTask.java:82) at org.gradle.internal.reflect.JavaMethod.invoke(JavaMethod.java:73) at org.gradle.api.internal.project.taskfactory.DefaultTaskClassInfoStore$IncrementalTaskAction.doExecute(DefaultTaskClassInfoStore.java:173) at org.gradle.api.internal.project.taskfactory.DefaultTaskClassInfoStore$StandardTaskAction.execute(DefaultTaskClassInfoStore.java:134) at org.gradle.api.internal.project.taskfactory.DefaultTaskClassInfoStore$StandardTaskAction.execute(DefaultTaskClassInfoStore.java:121) at org.gradle.api.internal.tasks.execution.ExecuteActionsTaskExecuter$1.run(ExecuteActionsTaskExecuter.java:122) at org.gradle.internal.progress.DefaultBuildOperationExecutor$RunnableBuildOperationWorker.execute(DefaultBuildOperationExecutor.java:336) at org.gradle.internal.progress.DefaultBuildOperationExecutor$RunnableBuildOperationWorker.execute(DefaultBuildOperationExecutor.java:328) at org.gradle.internal.progress.DefaultBuildOperationExecutor.execute(DefaultBuildOperationExecutor.java:197) at org.gradle.internal.progress.DefaultBuildOperationExecutor.run(DefaultBuildOperationExecutor.java:107) at org.gradle.api.internal.tasks.execution.ExecuteActionsTaskExecuter.executeAction(ExecuteActionsTaskExecuter.java:111) at org.gradle.api.internal.tasks.execution.ExecuteActionsTaskExecuter.executeActions(ExecuteActionsTaskExecuter.java:92) ... 27 more Caused by: com.android.ide.common.process.ProcessException: Failed to execute aapt at com.android.builder.core.AndroidBuilder.processResources(AndroidBuilder.java:867) at com.android.build.gradle.tasks.ProcessAndroidResources.doFullTaskAction(ProcessAndroidResources.java:194) ... 39 more Caused by: java.util.concurrent.ExecutionException: com.android.ide.common.process.ProcessException: Error while executing process C:\Users\daiyuhe\AppData\Local\Android\Sdk\build-tools\28.0.3\aapt.exe with arguments {package -f --no-crunch -I C:\Users\daiyuhe\AppData\Local\Android\Sdk\platforms\android-28\android.jar -M \\?\C:\Users\daiyuhe\Documents\Java_workspace\Calculator\build\intermediates\manifests\full\debug\AndroidManifest.xml -S C:\Users\daiyuhe\Documents\Java_workspace\Calculator\build\intermediates\res\merged\debug -m -J \\?\C:\Users\daiyuhe\Documents\Java_workspace\Calculator\build\generated\source\r\debug -F C:\Users\daiyuhe\Documents\Java_workspace\Calculator\build\intermediates\res\resources-debug.ap_ --debug-mode --custom-package com.daiyuhe.app.calculator -0 apk --output-text-symbols \\?\C:\Users\daiyuhe\Documents\Java_workspace\Calculator\build\intermediates\symbols\debug --no-version-vectors} at com.google.common.util.concurrent.AbstractFuture$Sync.getValue(AbstractFuture.java:299) at com.google.common.util.concurrent.AbstractFuture$Sync.get(AbstractFuture.java:286) at com.google.common.util.concurrent.AbstractFuture.get(AbstractFuture.java:116) at com.android.builder.core.AndroidBuilder.processResources(AndroidBuilder.java:865) ... 40 more Caused by: com.android.ide.common.process.ProcessException: Error while executing process C:\Users\daiyuhe\AppData\Local\Android\Sdk\build-tools\28.0.3\aapt.exe with arguments {package -f --no-crunch -I C:\Users\daiyuhe\AppData\Local\Android\Sdk\platforms\android-28\android.jar -M \\?\C:\Users\daiyuhe\Documents\Java_workspace\Calculator\build\intermediates\manifests\full\debug\AndroidManifest.xml -S C:\Users\daiyuhe\Documents\Java_workspace\Calculator\build\intermediates\res\merged\debug -m -J \\?\C:\Users\daiyuhe\Documents\Java_workspace\Calculator\build\generated\source\r\debug -F C:\Users\daiyuhe\Documents\Java_workspace\Calculator\build\intermediates\res\resources-debug.ap_ --debug-mode --custom-package com.daiyuhe.app.calculator -0 apk --output-text-symbols \\?\C:\Users\daiyuhe\Documents\Java_workspace\Calculator\build\intermediates\symbols\debug --no-version-vectors} at com.android.build.gradle.internal.process.GradleProcessResult.buildProcessException(GradleProcessResult.java:74) at com.android.build.gradle.internal.process.GradleProcessResult.assertNormalExitValue(GradleProcessResult.java:49) at com.android.builder.internal.aapt.AbstractProcessExecutionAapt$1.onSuccess(AbstractProcessExecutionAapt.java:78) at com.android.builder.internal.aapt.AbstractProcessExecutionAapt$1.onSuccess(AbstractProcessExecutionAapt.java:74) at com.google.common.util.concurrent.Futures$6.run(Futures.java:1319) at com.google.common.util.concurrent.MoreExecutors$DirectExecutor.execute(MoreExecutors.java:457) at com.google.common.util.concurrent.ExecutionList.executeListener(ExecutionList.java:156) at com.google.common.util.concurrent.ExecutionList.execute(ExecutionList.java:145) at com.google.common.util.concurrent.AbstractFuture.set(AbstractFuture.java:185) at com.google.common.util.concurrent.SettableFuture.set(SettableFuture.java:53) at com.android.build.gradle.internal.process.GradleProcessExecutor$1.run(GradleProcessExecutor.java:60) Caused by: org.gradle.process.internal.ExecException: Process 'command 'C:\Users\daiyuhe\AppData\Local\Android\Sdk\build-tools\28.0.3\aapt.exe'' finished with non-zero exit value 1 at org.gradle.process.internal.DefaultExecHandle$ExecResultImpl.assertNormalExitValue(DefaultExecHandle.java:380) at com.android.build.gradle.internal.process.GradleProcessResult.assertNormalExitValue(GradleProcessResult.java:47) ... 9 more

android studio插件jrebel for android报错

报错信息,请问怎么解决,或者提供思路 ``` :app:processDebugResources FAILED Error:failed to create directory 'C:\Users\Administrator\.jrebel-android\gradle\0\debug\build-dir\WAvatar\app\build\generated\source\r\debug\android\support\v7\appcompat', error: 13 Permission denied. Error:Execution failed for task ':app:processDebugResources'. > Process 'C:\Users\Administrator\.jrebel-android\distributions\2.5.14_20171220124024\bin\win32\aapt2.exe' finished with non-zero exit value 1 ```

android studio 关于jar包问题 不知道怎么解决

apply plugin: 'com.android.application' apply plugin: 'com.jakewharton.butterknife' android { compileSdkVersion 25 buildToolsVersion "25.0.0" useLibrary 'org.apache.http.legacy' defaultConfig { applicationId "com.mynj" minSdkVersion 16 targetSdkVersion 25 versionCode 1 versionName "1.0" } buildTypes { release { minifyEnabled false proguardFiles getDefaultProguardFile('proguard-android.txt'), 'proguard-rules.pro' } } sourceSets { main { assets.srcDirs = ['src/main/assets', 'src/main/assets/'] } } } dependencies { compile fileTree(include: ['*.jar'], dir: 'libs') androidTestCompile('com.android.support.test.espresso:espresso-core:2.2.2', { exclude group: 'com.android.support', module: 'support-annotations' }) testCompile 'junit:junit:4.12' compile 'com.android.support:appcompat-v7:25.0.1' compile 'com.android.support:recyclerview-v7:25.0.1' compile 'io.reactivex.rxjava2:rxjava:2.1.2' compile 'io.reactivex.rxjava2:rxandroid:2.0.1' compile 'com.squareup.retrofit2:retrofit:2.3.0' compile 'com.squareup.retrofit2:converter-gson:2.3.0' compile 'com.jakewharton.retrofit:retrofit2-rxjava2-adapter:1.0.0' compile 'com.squareup.okhttp3:okhttp:3.8.1' compile 'com.squareup.okhttp3:logging-interceptor:3.8.1' compile 'com.jakewharton:butterknife:8.4.0' annotationProcessor 'com.jakewharton:butterknife-compiler:8.4.0' compile 'com.squareup.picasso:picasso:2.5.1' compile 'com.github.bumptech.glide:glide:3.5.2' } 运行之后报错 Gradle build finished with 186 error(s) in 1m 39s 514ms Error:warning: Ignoring InnerClasses attribute for an anonymous inner class Error:(com.mysql.jdbc.ConnectionImpl$1) that doesn't come with an Error:associated EnclosingMethod attribute. This class was probably produced by a Error:compiler that did not target the modern .class file format. The recommended Error:solution is to recompile the class from source, using an up-to-date compiler Error:and without specifying any "-target" type options. The consequence of ignoring Error:this warning is that reflective operations on this class will incorrectly Error:indicate that it is *not* an inner class. Error:(com.mysql.jdbc.ConnectionImpl$10) that doesn't come with an Error:warning: Ignoring InnerClasses attribute for an anonymous inner class Error:associated EnclosingMethod attribute. This class was probably produced by a Error:compiler that did not target the modern .class file format. The recommended Error:solution is to recompile the class from source, using an up-to-date compiler Error:and without specifying any "-target" type options. The consequence of ignoring Error:this warning is that reflective operations on this class will incorrectly Error:warning: Ignoring InnerClasses attribute for an anonymous inner class Error:indicate that it is *not* an inner class. Error:(com.mysql.jdbc.ConnectionImpl$2) that doesn't come with an Error:associated EnclosingMethod attribute. This class was probably produced by a Error:compiler that did not target the modern .class file format. The recommended Error:solution is to recompile the class from source, using an up-to-date compiler Error:and without specifying any "-target" type options. The consequence of ignoring Error:this warning is that reflective operations on this class will incorrectly Error:indicate that it is *not* an inner class. Error:(com.mysql.jdbc.ConnectionImpl$3) that doesn't come with an Error:warning: Ignoring InnerClasses attribute for an anonymous inner class Error:associated EnclosingMethod attribute. This class was probably produced by a Error:compiler that did not target the modern .class file format. The recommended Error:solution is to recompile the class from source, using an up-to-date compiler Error:and without specifying any "-target" type options. The consequence of ignoring Error:this warning is that reflective operations on this class will incorrectly Error:indicate that it is *not* an inner class.

studio使用问题求助,都设置jvmargs=-Xmx1024m

都设置jvmargs=-Xmx1024m studio64.exe.vmoptions中也设置还是报错 Error:Unable to start the daemon process: could not reserve enough space for object heap. Please assign more memory to Gradle in the project's gradle.properties file. For example, the following line, in the gradle.properties file, sets the maximum Java heap size to 1,024 MB: <em>org.gradle.jvmargs=-Xmx1024m</em> <a href="http://www.gradle.org/docs/current/userguide/build_environment.html">Read Gradle's configuration guide</a><br><a href="http://docs.oracle.com/javase/7/docs/technotes/guides/vm/gc-ergonomics.html">Read about Java's heap size</a>

android studio 混淆文件配置

![据说android studio 默认将libs的第三方jar包忽略混淆,所以就没有将类似#-libraryjars libs/umeng-analytics-v5.2.4.jar的操作写入到配置文件,只是将-keep class com.umeng.**{*;}和忽略警告的操作写入配置文件。但是发现gradle在.idea/libraries中引入了其他很多jar包以及这些包的存储地址。刚好程序报错中的com.b.a.a.a 就是指的idea/libraries中的一个包中的类,即为com.loopj.android.http.AsyncHttpClient,不知道怎么在混淆配置文件中忽略这些包的混淆。最后通过配置,发现这些包还是被混淆了,不知道怎么才能配置好这些包不被混淆](https://img-ask.csdn.net/upload/201511/10/1447140316_8891.jpg) 下面是我的配置文件: -optimizationpasses 5 -dontusemixedcaseclassnames -verbose -dontpreverify -optimizations !code/simplification/arithmetic,!field/*,!class/merging/* -keepattributes *Annotation* -keepattributes Signature -keep class android.**{*;} -keep public class * extends android.view -keep public class * extends android.app.Fragment -keep public class * extends android.app.Activity -keep public class * extends android.app.Application -keep public class * extends android.app.Service -keep public class * extends android.content.BroadcastReceiver -keep public class * extends android.content.ContentProvider -keep public class * extends android.app.backup.BackupAgentHelper -keep public class * extends android.preference.Preference -keep public class * extends android.support.V4.** -keep public class * extends android.vending.licensing.ILicensingService -dontwarn android.support.v4.** -keep class * extends android.support.v4.**{*;} -dontwarn android.support.v7.** -keep class * extends android.support.v7.**{*;} /* 将libs文件下的三方包忽略混淆*/ -keep class com.mob.logcolletor.**{ *;} -dontwarn com.mob.tools.** -keep class com.mob.tools.**{ *;} -dontwarn com.mob.baidu.** -keep class com.mob.baidu.**{ *;} -dontwarn cn.sharesdk.framework.** -keep class cn.sharesdk.framework.**{ *;} -dontwarn cn.sharesdk.system.email.** -keep class cn.sharesdk.system.email.**{ *;} -dontwarn cn.sharesdk.tencent.qq.** -keep class cn.sharesdk.tencent.qq.**{ *;} -dontwarn cn.sharesdk.system.text.** -keep class cn.sharesdk.system.text.**{ *;} -dontwarn cn.sharesdk.wechat.friends.** -keep class cn.sharesdk.wechat.friends.**{ *;} -dontwarn cn.sharesdk.wechat.utils.** -keep class cn.sharesdk.wechat.utils.**{ *;} -dontwarn cn.sharesdk.wechat.favorite.** -keep class cn.sharesdk.wechat.favorite.**{ *;} -dontwarn cn.sharesdk.wechat.moments.** -keep class cn.sharesdk.wechat.moments.**{ *;} -dontwarn com.tencent.** -keep class com.tencent..**{ *;} -keep public interface com.mob.logcolletor.** -keep public interface com.mob.tools.** -keep public interface com.mob.baidu.** -keep public interface cn.sharesdk.framework.** -keep public interface cn.sharesdk.system.email.** -keep public interface cn.sharesdk.tencent.qq.** -keep public interface cn.sharesdk.system.text.** -keep public interface cn.sharesdk.wechat.friends.** -keep public interface cn.sharesdk.wechat.utils.** -keep public interface cn.sharesdk.wechat.favorite.** -keep public interface cn.sharesdk.wechat.moments.** -keepclasseswithmembernames class * { native <methods>; } -keepclassmembers public class * extends android.view.View { void set*(***); *** get*(); } -keepclasseswithmembernames class * { void onClick*(...); } -keepclasseswithmembernames class * { *** *Callback(...); } -keepclasseswithmembernames class * { public <init>(android.content.Context,android.util.AttributeSet,int); } -keepclasseswithmembernames class * { public <init>(android.content.Context,android.util.AttributeSet); } -keepclassmembers class * extends android.app.Activity { public void *(android.view.View); } -keepclassmembers enum * { public static **[] values(); public static ** valueOf(java.lang.String); } -keep class * implements android.os.Parcelable { public static final android.os.Parcelable$Creator *; } -keep class org.apache.http.**{*;} -keepclassmembers class **.R$* { public static <fields>; } /* 将External Libraries文件下的三方包忽略混淆*/ -libraryjars $USER_HOME$/.gradle/caches/modules-2/files-2.1/com.loopj.android/android-async-http/1.4.8/77bbfe240e437ecb396d982afa0d3bd4f9090ba7/android-async-http-1.4.8.jar -libraryjars $USER_HOME$/.gradle/caches/modules-2/files-2.1/com.loopj.android/android-async-http/1.4.8/ec314dce534e83c93364388d023625bb8e605e38/android-async-http-1.4.8-sources.jar! -libraryjars build/intermediates/exploded-aar/com.soundcloud.android/android-crop/1.0.0/jars/classes.jar -libraryjars build/intermediates/exploded-aar/com.android.support/appcompat-v7/23.0.0/jars/classes.jar -libraryjars $USER_HOME$/Documents/androidWorkSpace/android-sdk-macosx/extras/android/m2repository/com/android/support/appcompat-v7/23.0.0/appcompat-v7-23.0.0-sources.jar -libraryjars $USER_HOME$/.gradle/caches/modules-2/files-2.1/com.jakewharton/butterknife/7.0.1/d5d13ea991eab0252e3710e5df3d6a9d4b21d461/butterknife-7.0.1.jar -libraryjars $USER_HOME$/.gradle/caches/modules-2/files-2.1/com.jakewharton/butterknife/7.0.1/ad53343e57ae0969aaf451a19eef381abe2ad3a1/butterknife-7.0.1-sources.jar -libraryjars build/intermediates/exploded-aar/com.android.support/cardview-v7/23.0.0/jars/classes.jar -libraryjars $USER_HOME$/Documents/androidWorkSpace/android-sdk-macosx/extras/android/m2repository/com/android/support/cardview-v7/23.0.0/cardview-v7-23.0.0-sources.jar -libraryjars build/intermediates/exploded-aar/com.android.support/design/23.0.0/jars/classes.jar -libraryjars $USER_HOME$/.gradle/caches/modules-2/files-2.1/com.github.bumptech.glide/glide/3.6.1/86b122e640af09b0723e1fa44083c354ba6d9089/glide-3.6.1.jar -libraryjars $USER_HOME$/.gradle/caches/modules-2/files-2.1/com.github.bumptech.glide/glide/3.6.1/c84c6f18844d9ae76308619008d40277de5e77d3/glide-3.6.1-sources.jar -libraryjars $USER_HOME$/.gradle/caches/modules-2/files-2.1/com.google.code.gson/gson/2.3/5fc52c41ef0239d1093a1eb7c3697036183677ce/gson-2.3.jar -libraryjars $USER_HOME$/.gradle/caches/modules-2/files-2.1/com.google.code.gson/gson/2.3/21e31b9298ed677b17fcac6dd0eb0a82ec35adc2/gson-2.3-sources.jar -libraryjars $USER_HOME$/.gradle/caches/modules-2/files-2.1/org.apache.httpcomponents/httpcore/4.3.2/31fbbff1ddbf98f3aa7377c94d33b0447c646b6e/httpcore-4.3.2.jar -libraryjars $USER_HOME$/.gradle/caches/modules-2/files-2.1/org.apache.httpcomponents/httpcore/4.3.2/4809f38359edeea9487f747e09aa58ec8d3a54c5/httpcore-4.3.2-sources.jar -libraryjars build/intermediates/exploded-aar/com.rengwuxian.materialedittext/library/2.1.4/jars/classes.jar -libraryjars $USER_HOME$/.gradle/caches/modules-2/files-2.1/com.nineoldandroids/library/2.4.0/e9b63380f3a242dbdbf103a2355ad7e43bad17cb/library-2.4.0.jar -libraryjars $USER_HOME$/.gradle/caches/modules-2/files-2.1/com.nineoldandroids/library/2.4.0/83d41901478fa8795254244acbafd03f14224dab/library-2.4.0-sources.jar -libraryjars build/intermediates/exploded-aar/com.orhanobut/logger/1.10/jars/classes.jar -libraryjars build/intermediates/exploded-aar/com.android.support/recyclerview-v7/23.0.0/jars/classes.jar -libraryjars $USER_HOME$/Documents/androidWorkSpace/android-sdk-macosx/extras/android/m2repository/com/android/support/recyclerview-v7/23.0.0/recyclerview-v7-23.0.0-sources.jar -libraryjars $USER_HOME$/Documents/androidWorkSpace/android-sdk-macosx/extras/android/m2repository/com/android/support/support-annotations/23.0.0/support-annotations-23.0.0.jar -libraryjars $USER_HOME$/Documents/androidWorkSpace/android-sdk-macosx/extras/android/m2repository/com/android/support/support-annotations/23.0.0/support-annotations-23.0.0-sources.jar -libraryjars build/intermediates/exploded-aar/com.android.support/support-v4/23.0.0/jars/classes.jar -libraryjars build/intermediates/exploded-aar/com.android.support/support-v4/23.0.0/jars/libs/internal_impl-23.0.0.jar -libraryjars $USER_HOME$/Documents/androidWorkSpace/android-sdk-macosx/extras/android/m2repository/com/android/support/support-v4/23.0.0/support-v4-23.0.0-sources.jar -dontwarn com.loopj.android.http.** -keep class com.loopj.android.http.**{ *;} -dontwarn com.baidu.** -keep class com.baidu.**{ *;} -dontwarn com.bumptech.glide.** -keep class com.bumptech.glide.**{ *;} -dontwarn com.google.gson.** -keep class com.google.gson.http.**{ *;} -dontwarn com.nineoldandroids.** -keep class com.nineoldandroids.**{ *;} -dontwarn com.orhanobut.logger.** -keep class com.orhanobut.logger.**{ *;} -dontwarn com.rengwuxian.materialedittext.** -keep class com.rengwuxian.materialedittext.**{ *;} -dontwarn com.soundcloud.android.crop.** -keep class com.soundcloud.android.crop.**{ *;} -ignorewarning -dump class_files.txt -printseeds seeds.txt -printusage unused.txt -printmapping mapping.txt

Server sent an unsupported extension: type_35

Error:A problem occurred configuring root project 'GpFunnyVideo'. > Could not resolve all dependencies for configuration ':classpath'. > Could not resolve com.android.tools.build:gradle:2.2.3. Required by: :GpFunnyVideo:unspecified > Could not resolve com.android.tools.build:gradle:2.2.3. > Could not get resource 'https://jcenter.bintray.com/com/android/tools/build/gradle/2.2.3/gradle-2.2.3.pom'. > Could not GET 'https://jcenter.bintray.com/com/android/tools/build/gradle/2.2.3/gradle-2.2.3.pom'. > Server sent an unsupported extension: type_35 > Could not resolve com.google.gms:google-services:3.0.0. Required by: :GpFunnyVideo:unspecified > Could not resolve com.google.gms:google-services:3.0.0. > Could not get resource 'https://jcenter.bintray.com/com/google/gms/google-services/3.0.0/google-services-3.0.0.pom'. > Could not GET 'https://jcenter.bintray.com/com/google/gms/google-services/3.0.0/google-services-3.0.0.pom'. > Server sent an unsupported extension: type_35 有没有android studio的大神啊,这个错误怎么解决啊 我明明挂了VPN的。求大神解答啊!!!!!!!!!

如何在Android Studio中指定NDK位置?

如何在Android Studio中指定NDK位置? ==== #### 问题描述 NDK已经手工下载解包在本地: ``` D:\Portable\android-ndk-r13b ``` 每次创建支持C++项目时,都提示NDK没配置,都要手工指定一次NDK位置。 ``` Error:NDK not configured. Download it with SDK manager.) ``` 如何在Android Studio中指定NDK位置,以避免每次创建都手工指定? #### 截图 ![图片说明](https://img-ask.csdn.net/upload/201702/18/1487385462_190845.jpg) ![图片说明](https://img-ask.csdn.net/upload/201702/18/1487385717_373489.jpg) #### 系统信息: ``` Android Studio 2.2.2 Windows 10, x64 ```

OpenJdk platform binary idea64启动报错

parallel desktop 虚拟机中装了win7,win7中安装idea64,就简单写了个helloworld输出,运行就报以下错误,win7中的显卡也升级不了 Error:Abnormal build process termination: "C:\Me\JetBrains\IntelliJ IDEA 2018.3.3\jre64\bin\java.exe" -Xmx700m -Djava.awt.headless=true -Djava.endorsed.dirs=\"\" -Djdt.compiler.useSingleThread=true -Dcompile.parallel=false -Drebuild.on.dependency.change=true -Djava.net.preferIPv4Stack=true -Dio.netty.initialSeedUniquifier=5762697851691075053 -Dfile.encoding=GBK -Duser.language=zh -Duser.country=CN -Didea.paths.selector=IntelliJIdea2018.3 "-Didea.home.path=C:\Me\JetBrains\IntelliJ IDEA 2018.3.3" -Didea.config.path=C:\Users\Brazen\.IntelliJIdea2018.3\config -Didea.plugins.path=C:\Users\Brazen\.IntelliJIdea2018.3\config\plugins -Djps.log.dir=C:/Users/Brazen/.IntelliJIdea2018.3/system/log/build-log "-Djps.fallback.jdk.home=C:/Me/JetBrains/IntelliJ IDEA 2018.3.3/jre64" -Djps.fallback.jdk.version=1.8.0_152-release -Dio.netty.noUnsafe=true -Djava.io.tmpdir=C:/Users/Brazen/.IntelliJIdea2018.3/system/compile-server/test_f6da7a95/_temp_ -Djps.backward.ref.index.builder=true -Dkotlin.incremental.compilation=true -Dkotlin.daemon.enabled -Dkotlin.daemon.client.alive.path=\"C:\Users\Brazen\AppData\Local\Temp\kotlin-idea-3894503579951865671-is-running\" -classpath "C:/Me/JetBrains/IntelliJ IDEA 2018.3.3/lib/jps-launcher.jar;C:/Me/JetBrains/IntelliJ IDEA 2018.3.3/jre64/lib/tools.jar;C:/Me/JetBrains/IntelliJ IDEA 2018.3.3/lib/optimizedFileManager.jar" org.jetbrains.jps.cmdline.Launcher "C:/Me/JetBrains/IntelliJ IDEA 2018.3.3/lib/netty-common-4.1.30.Final.jar;C:/Me/JetBrains/IntelliJ IDEA 2018.3.3/lib/annotations.jar;C:/Me/JetBrains/IntelliJ IDEA 2018.3.3/lib/jps-builders.jar;C:/Me/JetBrains/IntelliJ IDEA 2018.3.3/lib/aether-spi-1.1.0.jar;C:/Me/JetBrains/IntelliJ IDEA 2018.3.3/lib/maven-builder-support-3.3.9.jar;C:/Me/JetBrains/IntelliJ IDEA 2018.3.3/lib/maven-aether-provider-3.3.9.jar;C:/Me/JetBrains/IntelliJ IDEA 2018.3.3/lib/oro-2.0.8.jar;C:/Me/JetBrains/IntelliJ IDEA 2018.3.3/lib/slf4j-api-1.7.25.jar;C:/Me/JetBrains/IntelliJ IDEA 2018.3.3/lib/httpcore-4.4.10.jar;C:/Me/JetBrains/IntelliJ IDEA 2018.3.3/lib/nanoxml-2.2.3.jar;C:/Me/JetBrains/IntelliJ IDEA 2018.3.3/lib/plexus-interpolation-1.21.jar;C:/Me/JetBrains/IntelliJ IDEA 2018.3.3/lib/aether-impl-1.1.0.jar;C:/Me/JetBrains/IntelliJ IDEA 2018.3.3/lib/commons-lang3-3.4.jar;C:/Me/JetBrains/IntelliJ IDEA 2018.3.3/lib/commons-codec-1.10.jar;C:/Me/JetBrains/IntelliJ IDEA 2018.3.3/lib/forms_rt.jar;C:/Me/JetBrains/IntelliJ IDEA 2018.3.3/lib/trove4j.jar;C:/Me/JetBrains/IntelliJ IDEA 2018.3.3/lib/maven-model-builder-3.3.9.jar;C:/Me/JetBrains/IntelliJ IDEA 2018.3.3/lib/jps-model.jar;C:/Me/JetBrains/IntelliJ IDEA 2018.3.3/lib/idea_rt.jar;C:/Me/JetBrains/IntelliJ IDEA 2018.3.3/lib/util.jar;C:/Me/JetBrains/IntelliJ IDEA 2018.3.3/lib/plexus-component-annotations-1.6.jar;C:/Me/JetBrains/IntelliJ IDEA 2018.3.3/lib/protobuf-java-3.4.0.jar;C:/Me/JetBrains/IntelliJ IDEA 2018.3.3/lib/netty-buffer-4.1.30.Final.jar;C:/Me/JetBrains/IntelliJ IDEA 2018.3.3/lib/asm-all-7.0.jar;C:/Me/JetBrains/IntelliJ IDEA 2018.3.3/lib/log4j.jar;C:/Me/JetBrains/IntelliJ IDEA 2018.3.3/lib/aether-dependency-resolver.jar;C:/Me/JetBrains/IntelliJ IDEA 2018.3.3/lib/guava-25.1-jre.jar;C:/Me/JetBrains/IntelliJ IDEA 2018.3.3/lib/aether-connector-basic-1.1.0.jar;C:/Me/JetBrains/IntelliJ IDEA 2018.3.3/lib/netty-resolver-4.1.30.Final.jar;C:/Me/JetBrains/IntelliJ IDEA 2018.3.3/lib/aether-transport-http-1.1.0.jar;C:/Me/JetBrains/IntelliJ IDEA 2018.3.3/lib/commons-logging-1.2.jar;C:/Me/JetBrains/IntelliJ IDEA 2018.3.3/lib/resources_en.jar;C:/Me/JetBrains/IntelliJ IDEA 2018.3.3/lib/aether-api-1.1.0.jar;C:/Me/JetBrains/IntelliJ IDEA 2018.3.3/lib/maven-repository-metadata-3.3.9.jar;C:/Me/JetBrains/IntelliJ IDEA 2018.3.3/lib/jna-platform.jar;C:/Me/JetBrains/IntelliJ IDEA 2018.3.3/lib/aether-util-1.1.0.jar;C:/Me/JetBrains/IntelliJ IDEA 2018.3.3/lib/netty-transport-4.1.30.Final.jar;C:/Me/JetBrains/IntelliJ IDEA 2018.3.3/lib/aether-transport-file-1.1.0.jar;C:/Me/JetBrains/IntelliJ IDEA 2018.3.3/lib/jna.jar;C:/Me/JetBrains/IntelliJ IDEA 2018.3.3/lib/netty-codec-4.1.30.Final.jar;C:/Me/JetBrains/IntelliJ IDEA 2018.3.3/lib/httpclient-4.5.6.jar;C:/Me/JetBrains/IntelliJ IDEA 2018.3.3/lib/lz4-1.3.0.jar;C:/Me/JetBrains/IntelliJ IDEA 2018.3.3/lib/platform-api.jar;C:/Me/JetBrains/IntelliJ IDEA 2018.3.3/lib/maven-artifact-3.3.9.jar;C:/Me/JetBrains/IntelliJ IDEA 2018.3.3/lib/jdom.jar;C:/Me/JetBrains/IntelliJ IDEA 2018.3.3/lib/maven-model-3.3.9.jar;C:/Me/JetBrains/IntelliJ IDEA 2018.3.3/lib/forms-1.1-preview.jar;C:/Me/JetBrains/IntelliJ IDEA 2018.3.3/lib/jps-builders-6.jar;C:/Me/JetBrains/IntelliJ IDEA 2018.3.3/lib/javac2.jar;C:/Me/JetBrains/IntelliJ IDEA 2018.3.3/lib/plexus-utils-3.0.22.jar;;C:/Me/JetBrains/IntelliJ IDEA 2018.3.3/lib/gson-2.8.5.jar;C:/Me/JetBrains/IntelliJ IDEA 2018.3.3/plugins/android/lib/jarutils.jar;C:/Me/JetBrains/IntelliJ IDEA 2018.3.3/lib/guava-25.1-jre.jar;C:/Me/JetBrains/IntelliJ IDEA 2018.3.3/plugins/android/lib/common-26.1.2.jar;C:/Me/JetBrains/IntelliJ IDEA 2018.3.3/plugins/android/lib/manifest-merger-26.1.2.jar;C:/Me/JetBrains/IntelliJ IDEA 2018.3.3/plugins/android/lib/sdk-common-26.1.2.jar;C:/Me/JetBrains/IntelliJ IDEA 2018.3.3/plugins/android/lib/builder-model-3.1.2.jar;C:/Me/JetBrains/IntelliJ IDEA 2018.3.3/plugins/android/lib/builder-test-api-3.1.2.jar;C:/Me/JetBrains/IntelliJ IDEA 2018.3.3/plugins/android/lib/ddmlib-26.1.2.jar;C:/Me/JetBrains/IntelliJ IDEA 2018.3.3/plugins/android/lib/repository-26.1.2.jar;C:/Me/JetBrains/IntelliJ IDEA 2018.3.3/plugins/gradle/lib/gradle-api-4.10.jar;C:/Me/JetBrains/IntelliJ IDEA 2018.3.3/lib/gson-2.8.5.jar;C:/Me/JetBrains/IntelliJ IDEA 2018.3.3/plugins/android/lib/jarutils.jar;C:/Me/JetBrains/IntelliJ IDEA 2018.3.3/lib/guava-25.1-jre.jar;C:/Me/JetBrains/IntelliJ IDEA 2018.3.3/plugins/android/lib/common-26.1.2.jar;C:/Me/JetBrains/IntelliJ IDEA 2018.3.3/plugins/android/lib/manifest-merger-26.1.2.jar;C:/Me/JetBrains/IntelliJ IDEA 2018.3.3/plugins/android/lib/sdk-common-26.1.2.jar;C:/Me/JetBrains/IntelliJ IDEA 2018.3.3/plugins/android/lib/builder-model-3.1.2.jar;C:/Me/JetBrains/IntelliJ IDEA 2018.3.3/plugins/android/lib/builder-test-api-3.1.2.jar;C:/Me/JetBrains/IntelliJ IDEA 2018.3.3/plugins/android/lib/ddmlib-26.1.2.jar;C:/Me/JetBrains/IntelliJ IDEA 2018.3.3/plugins/android/lib/repository-26.1.2.jar;C:/Me/JetBrains/IntelliJ IDEA 2018.3.3/plugins/gradle/lib/gradle-api-4.10.jar;C:/Me/JetBrains/IntelliJ IDEA 2018.3.3/plugins/ant/lib/ant-jps-plugin.jar;C:/Me/JetBrains/IntelliJ IDEA 2018.3.3/plugins/uiDesigner/lib/jps/ui-designer-jps-plugin.jar;C:/Me/JetBrains/IntelliJ IDEA 2018.3.3/plugins/IntelliLang/lib/intellilang-jps-plugin.jar;C:/Me/JetBrains/IntelliJ IDEA 2018.3.3/plugins/Groovy/lib/groovy-jps-plugin.jar;C:/Me/JetBrains/IntelliJ IDEA 2018.3.3/plugins/Groovy/lib/groovy-rt-constants.jar;C:/Me/JetBrains/IntelliJ IDEA 2018.3.3/plugins/eclipse/lib/eclipse-jps-plugin.jar;C:/Me/JetBrains/IntelliJ IDEA 2018.3.3/plugins/eclipse/lib/common-eclipse-util.jar;C:/Me/JetBrains/IntelliJ IDEA 2018.3.3/plugins/maven/lib/maven-jps-plugin.jar;C:/Me/JetBrains/IntelliJ IDEA 2018.3.3/plugins/osmorc/lib/osmorc-jps-plugin.jar;C:/Me/JetBrains/IntelliJ IDEA 2018.3.3/plugins/osmorc/lib/biz.aQute.bndlib-4.0.0.jar;C:/Me/JetBrains/IntelliJ IDEA 2018.3.3/plugins/osmorc/lib/biz.aQute.repository-4.0.0.jar;C:/Me/JetBrains/IntelliJ IDEA 2018.3.3/plugins/osmorc/lib/biz.aQute.resolve-4.0.0.jar;C:/Me/JetBrains/IntelliJ IDEA 2018.3.3/plugins/osmorc/lib/bundlor-all.jar;C:/Me/JetBrains/IntelliJ IDEA 2018.3.3/plugins/aspectj/lib/aspectj-jps-plugin.jar;C:/Me/JetBrains/IntelliJ IDEA 2018.3.3/plugins/gradle/lib/gradle-jps-plugin.jar;C:/Me/JetBrains/IntelliJ IDEA 2018.3.3/plugins/devkit/lib/devkit-jps-plugin.jar;C:/Me/JetBrains/IntelliJ IDEA 2018.3.3/plugins/JavaEE/lib/javaee-jps-plugin.jar;C:/Me/JetBrains/IntelliJ IDEA 2018.3.3/plugins/JavaEE/lib/jps/jpa-jps-plugin.jar;C:/Me/JetBrains/IntelliJ IDEA 2018.3.3/plugins/webSphereIntegration/lib/jps/webSphere-jps-plugin.jar;C:/Me/JetBrains/IntelliJ IDEA 2018.3.3/plugins/weblogicIntegration/lib/jps/weblogic-jps-plugin.jar;C:/Me/JetBrains/IntelliJ IDEA 2018.3.3/plugins/android/lib/jps/android-jps-plugin.jar;C:/Me/JetBrains/IntelliJ IDEA 2018.3.3/plugins/android/lib/android-common.jar;C:/Me/JetBrains/IntelliJ IDEA 2018.3.3/plugins/android/lib/build-common.jar;C:/Me/JetBrains/IntelliJ IDEA 2018.3.3/plugins/android/lib/android-rt.jar;C:/Me/JetBrains/IntelliJ IDEA 2018.3.3/plugins/android/lib/sdklib.jar;C:/Me/JetBrains/IntelliJ IDEA 2018.3.3/plugins/android/lib/common-26.1.2.jar;C:/Me/JetBrains/IntelliJ IDEA 2018.3.3/plugins/android/lib/jarutils.jar;C:/Me/JetBrains/IntelliJ IDEA 2018.3.3/plugins/android/lib/layoutlib-api.jar;C:/Me/JetBrains/IntelliJ IDEA 2018.3.3/plugins/javaFX/lib/javaFX-jps-plugin.jar;C:/Me/JetBrains/IntelliJ IDEA 2018.3.3/plugins/javaFX/lib/common-javaFX-plugin.jar;C:/Me/JetBrains/IntelliJ IDEA 2018.3.3/plugins/Kotlin/lib/jps/kotlin-jps-plugin.jar;C:/Me/JetBrains/IntelliJ IDEA 2018.3.3/plugins/Kotlin/lib/kotlin-stdlib.jar;C:/Me/JetBrains/IntelliJ IDEA 2018.3.3/plugins/Kotlin/lib/kotlin-reflect.jar;C:/Me/JetBrains/IntelliJ IDEA 2018.3.3/plugins/Kotlin/lib/kotlin-plugin.jar;C:/Me/JetBrains/IntelliJ IDEA 2018.3.3/plugins/Kotlin/lib/android-extensions-ide.jar;C:/Me/JetBrains/IntelliJ IDEA 2018.3.3/plugins/Kotlin/lib/android-extensions-compiler.jar;C:/Me/JetBrains/IntelliJ IDEA 2018.3.3/plugins/flex/lib/flex-jps-plugin.jar;C:/Me/JetBrains/IntelliJ IDEA 2018.3.3/plugins/flex/lib/flex-shared.jar;C:/Me/JetBrains/IntelliJ IDEA 2018.3.3/plugins/dmServer/lib/dmServer-jps-plugin.jar;C:/Me/JetBrains/IntelliJ IDEA 2018.3.3/plugins/GwtStudio/lib/gwt-jps-plugin.jar;C:/Me/JetBrains/IntelliJ IDEA 2018.3.3/plugins/GoogleAppEngine/lib/google-app-engine-jps-plugin.jar;C:/Me/JetBrains/IntelliJ IDEA 2018.3.3/plugins/GoogleAppEngine/lib/appEngine-runtime.jar;C:/Me/JetBrains/IntelliJ IDEA 2018.3.3/plugins/Grails/lib/grails-jps-plugin.jar;C:/Me/JetBrains/IntelliJ IDEA 2018.3.3/plugins/Grails/lib/grails-compiler-patch.jar" org.jetbrains.jps.cmdline.BuildMain 127.0.0.1 49669 1e1dfc85-eb4c-4dc1-b38c-ed6896c49276 C:/Users/Brazen/.IntelliJIdea2018.3/system/compile-server

android报错Could not determine the class-path ...

Android Studio导入Eclipse项目报错: `Error:Could not determine the class-path for interface com.android.builder.model.AndroidProject.` 项目的build.gradle文件如下: ```Gradle buildscript { repositories { jcenter() } dependencies { classpath 'com.android.tools.build:gradle:2.3.0' } } apply plugin: 'com.android.application' dependencies { compile fileTree(dir: 'libs', include: '*.jar') } android { compileSdkVersion 22 buildToolsVersion "25.0.2" sourceSets { main { manifest.srcFile 'AndroidManifest.xml' java.srcDirs = ['src'] resources.srcDirs = ['src'] aidl.srcDirs = ['src'] renderscript.srcDirs = ['src'] res.srcDirs = ['res'] assets.srcDirs = ['assets'] } // Move the tests to tests/java, tests/res, etc... instrumentTest.setRoot('tests') // Move the build types to build-types/<type> // For instance, build-types/debug/java, build-types/debug/AndroidManifest.xml, ... // This moves them out of them default location under src/<type>/... which would // conflict with src/ being used by the main source set. // Adding new build types or product flavors should be accompanied // by a similar customization. debug.setRoot('build-types/debug') release.setRoot('build-types/release') } } ``` 请问一下该怎么解决?

技术大佬:我去,你写的 switch 语句也太老土了吧

昨天早上通过远程的方式 review 了两名新来同事的代码,大部分代码都写得很漂亮,严谨的同时注释也很到位,这令我非常满意。但当我看到他们当中有一个人写的 switch 语句时,还是忍不住破口大骂:“我擦,小王,你丫写的 switch 语句也太老土了吧!” 来看看小王写的代码吧,看完不要骂我装逼啊。 private static String createPlayer(PlayerTypes p...

你连存活到JDK8中著名的Bug都不知道,我怎么敢给你加薪

CopyOnWriteArrayList.java和ArrayList.java,这2个类的构造函数,注释中有一句话 1 2 3 4 5 6 7 8 9 10 11 12 13 14 15 public ArrayList(Collection&lt;? ...

副业收入是我做程序媛的3倍,工作外的B面人生是怎样的?

提到“程序员”,多数人脑海里首先想到的大约是:为人木讷、薪水超高、工作枯燥…… 然而,当离开工作岗位,撕去层层标签,脱下“程序员”这身外套,有的人生动又有趣,马上展现出了完全不同的A/B面人生! 不论是简单的爱好,还是正经的副业,他们都干得同样出色。偶尔,还能和程序员的特质结合,产生奇妙的“化学反应”。 @Charlotte:平日素颜示人,周末美妆博主 大家都以为程序媛也个个不修边幅,但我们也许...

记录下入职中软一个月(外包华为)

我在年前从上一家公司离职,没想到过年期间疫情爆发,我也被困在家里,在家呆着的日子让人很焦躁,于是我疯狂的投简历,看面试题,希望可以进大公司去看看。 我也有幸面试了我觉得还挺大的公司的(虽然不是bat之类的大厂,但是作为一名二本计算机专业刚毕业的大学生bat那些大厂我连投简历的勇气都没有),最后选择了中软,我知道这是一家外包公司,待遇各方面甚至不如我的上一家公司,但是对我而言这可是外包华为,能...

无代码时代来临,程序员如何保住饭碗?

编程语言层出不穷,从最初的机器语言到如今2500种以上的高级语言,程序员们大呼“学到头秃”。程序员一边面临编程语言不断推陈出新,一边面临由于许多代码已存在,程序员编写新应用程序时存在重复“搬砖”的现象。 无代码/低代码编程应运而生。无代码/低代码是一种创建应用的方法,它可以让开发者使用最少的编码知识来快速开发应用程序。开发者通过图形界面中,可视化建模来组装和配置应用程序。这样一来,开发者直...

培训班出来的人后来都怎么样了?(二)

接着上回说,培训班学习生涯结束了。后面每天就是无休止的背面试题,不是没有头脑的背,培训公司还是有方法的,现在回想当时背的面试题好像都用上了,也被问到了。回头找找面试题,当时都是打印下来天天看,天天背。 不理解呢也要背,面试造飞机,上班拧螺丝。班里的同学开始四处投简历面试了,很快就有面试成功的,刚开始一个,然后越来越多。不知道是什么原因,尝到胜利果实的童鞋,不满足于自己通过的公司,嫌薪水要少了,选择...

面试了一个 31 岁程序员,让我有所触动,30岁以上的程序员该何去何从?

最近面试了一个31岁8年经验的程序猿,让我有点感慨,大龄程序猿该何去何从。

6年开发经验女程序员,面试京东Java岗要求薪资28K

写在开头: 上周面试了一位女程序员,上午10::30来我们部门面试,2B哥接待了她.来看看她的简历: 个人简历 个人技能: ● 熟悉spring mvc 、spring、mybatis 等框架 ● 熟悉 redis 、rocketmq、dubbo、zookeeper、netty 、nginx、tomcat、mysql。 ● 阅读过juc 中的线程池、锁的源...

大三实习生,字节跳动面经分享,已拿Offer

说实话,自己的算法,我一个不会,太难了吧

程序员垃圾简历长什么样?

已经连续五年参加大厂校招、社招的技术面试工作,简历看的不下于万份 这篇文章会用实例告诉你,什么是差的程序员简历! 疫情快要结束了,各个公司也都开始春招了,作为即将红遍大江南北的新晋UP主,那当然要为小伙伴们做点事(手动狗头)。 就在公众号里公开征简历,义务帮大家看,并一一点评。《启舰:春招在即,义务帮大家看看简历吧》 一石激起千层浪,三天收到两百多封简历。 花光了两个星期的所有空闲时...

SpringBoot系列之Redis缓存使用详细教程

Spring的缓存抽象 Spring从3.1开始定义了一系列抽象接口来统一不同的缓存技术;并支持使用Java Caching(JSR-107)注解简化我们进行缓存开发。Spring Cache 只负责维护抽象层,具体的实现由你的技术选型来决定。将缓存处理和缓存技术解除耦合。 JSR107 Java Caching(JSR-107)定义了5个核心接口,分别是CachingProvider, Cach...

推荐9个能让你看一天的网站

分享的这9个保证另你意外的网站,每个都非常实用!非常干货!毫不客气的说,这些网站最少值10万块钱。 利用好这些网站,会让你各方面的技能都得到成长,不说让你走上人生巅峰,但对比现在的你,在眼界、学识、技能方面都有质的飞跃。 一、AIRPANO 传送门:https://www.airpano.com/360photo_list.php 这是一个可以躺在家里,就能环游世界的神奇网站。 世界那么大,绝大多...

大牛都会用的IDEA调试技巧!!!

导读 前天面试了一个985高校的实习生,问了他平时用什么开发工具,他想也没想的说IDEA,于是我抛砖引玉的问了一下IDEA的调试用过吧,你说说怎么设置断点...

都前后端分离了,咱就别做页面跳转了!统统 JSON 交互

文章目录1. 无状态登录1.1 什么是有状态1.2 什么是无状态1.3 如何实现无状态1.4 各自优缺点2. 登录交互2.1 前后端分离的数据交互2.2 登录成功2.3 登录失败3. 未认证处理方案4. 注销登录 这是本系列的第四篇,有小伙伴找不到之前文章,松哥给大家列一个索引出来: 挖一个大坑,Spring Security 开搞! 松哥手把手带你入门 Spring Security,别再问密...

月薪22K程序员,打卡迟到10次,收到工资短信一脸懵逼

每家公司为了保证公司员工每天的工作时间,一般都会采用上下班打卡的工作制度,这其实是一个很常见的是,本身也没有什么问题的。正所谓无规矩不成方圆,公司肯定是有公司的规矩,虽然每个员工都很不喜欢这些规矩来束缚我们,但是公司也只是为了能更好的管理员工。但是一家公司如果一成不变的使用打卡制度,而不会去变通管理,也真不一定是好事。 打卡制度特别对于销售部门来说,不但会让公司发展不起来,还很容易丢失员工。但如...

97年世界黑客编程大赛冠军作品(大小仅为16KB),惊艳世界的编程巨作

这是世界编程大赛第一名作品(97年Mekka ’97 4K Intro比赛)汇编语言所写。 整个文件只有4095个字节, 大小仅仅为16KB! 不仅实现了3D动画的效果!还有一段震撼人心的背景音乐!!! 内容无法以言语形容,实在太强大! 下面是代码,具体操作看最后! @echo off more +1 %~s0|debug e100 33 f6 bf 0 20 b5 10 f3 a5...

程序员是做全栈工程师好?还是专注一个领域好?

昨天,有位大一的同学私信我,说他要做全栈工程师。 我一听,这不害了孩子么,必须制止啊。 谁知,讲到最后,更确定了他做全栈程序员的梦想。 但凡做全栈工程师的,要么很惨,要么很牛! 但凡很牛的,绝不是一开始就是做全栈的! 全栈工程师听起来好听,但绝没有你想象的那么简单。 今天听我来给你唠,记得帮我点赞哦。 一、全栈工程师的职责 如果你学习编程的目的只是玩玩,那随意,想怎么学怎么学。...

不要再到处使用 === 了

我们知道现在的开发人员都使用 === 来代替 ==,为什么呢?我在网上看到的大多数教程都认为,要预测 JavaScript 强制转换是如何工作这太复杂了,因此建议总是使用===。这些都...

什么是a站、b站、c站、d站、e站、f站、g站、h站、i站、j站、k站、l站、m站、n站?00后的世界我不懂!

A站 AcFun弹幕视频网,简称“A站”,成立于2007年6月,取意于Anime Comic Fun,是中国大陆第一家弹幕视频网站。A站以视频为载体,逐步发展出基于原生内容二次创作的完整生态,拥有高质量互动弹幕,是中国弹幕文化的发源地;拥有大量超粘性的用户群体,产生输出了金坷垃、鬼畜全明星、我的滑板鞋、小苹果等大量网络流行文化,也是中国二次元文化的发源地。 B站 全称“哔哩哔哩(bilibili...

十个摸鱼,哦,不对,是炫酷(可以玩一整天)的网站!!!

文章目录前言正文**1、Kaspersky Cyberthreat real-time map****2、Finding Home****3、Silk – Interactive Generative Art****4、Liquid Particles 3D****5、WINDOWS93****6、Staggering Beauty****7、Ostagram图片生成器网址****8、全历史网址*...

终于,月薪过5万了!

来看几个问题想不想月薪超过5万?想不想进入公司架构组?想不想成为项目组的负责人?想不想成为spring的高手,超越99%的对手?那么本文内容是你必须要掌握的。本文主要详解bean的生命...

​能让德国人放弃现金支付​,也没谁了

在新冠疫情中,德国人越来越多地选择在超市,加油站或其他商店付款时使用非接触式付款方式。德国信贷协会Deutschen Kreditwirtschaft (DK) 的一位发言人告诉德国新...

大厂的 404 页面都长啥样?最后一个笑了...

每天浏览各大网站,难免会碰到404页面啊。你注意过404页面么?猿妹搜罗来了下面这些知名网站的404页面,以供大家欣赏,看看哪个网站更有创意: 正在上传…重新上传取消 腾讯 正在上传…重新上传取消 网易 淘宝 百度 新浪微博 正在上传…重新上传取消 新浪 京东 优酷 腾讯视频 搜...

自从喜欢上了B站这12个UP主,我越来越觉得自己是个废柴了!

不怕告诉你,我自从喜欢上了这12个UP主,哔哩哔哩成为了我手机上最耗电的软件,几乎每天都会看,可是吧,看的越多,我就越觉得自己是个废柴,唉,老天不公啊,不信你看看…… 间接性踌躇满志,持续性混吃等死,都是因为你们……但是,自己的学习力在慢慢变强,这是不容忽视的,推荐给你们! 都说B站是个宝,可是有人不会挖啊,没事,今天咱挖好的送你一箩筐,首先啊,我在B站上最喜欢看这个家伙的视频了,为啥 ,咱撇...

代码注释如此沙雕,会玩还是你们程序员!

某站后端代码被“开源”,同时刷遍全网的,还有代码里的那些神注释。 我们这才知道,原来程序员个个都是段子手;这么多年来,我们也走过了他们的无数套路… 首先,产品经理,是永远永远吐槽不完的!网友的评论也非常扎心,说看这些代码就像在阅读程序员的日记,每一页都写满了对产品经理的恨。 然后,也要发出直击灵魂的质问:你是尊贵的付费大会员吗? 这不禁让人想起之前某音乐app的穷逼Vip,果然,穷逼在哪里都是...

原来实现钉钉自动签到如此简单,每天准时上下班不是梦

本文主要介绍了如何利用现成软件快速实现钉钉自动签到功能,核心思路非常简单,甚至无任何编程基础的小白也能轻松实现定时自动打卡功能.

前端还能这么玩?(女朋友生日,用前端写了一个好玩的送给了她,高兴坏了)

前端还能这么玩?(女朋友生日,用前端写了一个好玩的送给了她,高兴坏了)

爬虫(101)爬点重口味的

小弟最近在学校无聊的很哪,浏览网页突然看到一张图片,都快流鼻血。。。然后小弟冥思苦想,得干一点有趣的事情python 爬虫库安装https://s.taobao.com/api?_ks...

讲真,这两款idea插件,能治愈你英语不好的病

时不时就有小伙伴问我,“二哥,能推荐一款 IDE 吗?”你看这话问的,现在搞 Java 的不都在用 Intellij IDEA 吗,还用得着推荐(我已经和 Eclipse 分手了)。然后小伙伴又说,“二哥,IDEA 支持中文吗?我英语不太好。”你看这话问的,搞编程的,英语不好是硬伤啊! 不过,随着 IDEA 最新版(版本号是 2020.1)的发布,英语不好的病可以彻底治愈了。为什么这么说呢?因为 ...

面试官给我挖坑:a[i][j] 和 a[j][i] 有什么区别?

点击上方“朱小厮的博客”,选择“设为星标”后台回复&#34;1024&#34;领取公众号专属资料本文以一个简单的程序开头——数组赋值:int LEN = 10000; int[][] ...

相关热词 c# cad插入影像 c#设计思想 c#正则表达式 转换 c#form复制 c#写web c# 柱形图 c# wcf 服务库 c#应用程序管理器 c#数组如何赋值给数组 c#序列化应用目的博客园
立即提问