关于gcc g++的安装问题

我在ubuntu 系统上编译android4.0.1源代码,其中要安装gcc和g++,我的系统各版本如下:
ubuntu版本:16.04LTS

Android源代码版本:4.01

gcc版本我下的是4.4.3的版本,gcc文件夹打开如下图片说明
下好之后,因为系统自带的版本太高(编译android4.01要的gcc版本要求为4.4左右),所以我把系统/usr/bin目录下的gcc和g++两个链接文件改为了我下的gcc,只改了gcc,g++这两个链接,链接的文件为图片说明这里的gcc和g++(不知道是不是改链接这两个文件),
另外我也不清楚gcc是不是就包含g++,还是说我改再下个g++?
然后在终端输入gcc -v和g++ -v都是显示只gcc的版本号,
编译android源代码时爆出一个ccl找不到的错误,网上说是gcc和g++的版本不同造成的,有谁能帮帮我吗?

2个回答

 sudo apt-get udpate //先将系统配置文件全部更新下;
 sudo apt-get install gcc g++
shuang1994
太上无情 更新似乎没用,我需要的gcc版本太低,很多源都下不了,今天试了你的方法,没成功
接近 3 年之前 回复

直接联网下载 切换root. 输入 yum install gcc

Csdn user default icon
上传中...
上传图片
插入图片
抄袭、复制答案,以达到刷声望分或其他目的的行为,在CSDN问答是严格禁止的,一经发现立刻封号。是时候展现真正的技术了!
其他相关推荐
关于gcc g++的安装问题
我在ubuntu 系统上编译android4.0.1源代码,其中要安装gcc和g++,我的系统各版本如下: ubuntu版本:16.04LTS Android源代码版本:4.01 gcc版本我下的是4.4.3的版本,gcc文件夹打开如下![图片说明](https://img-ask.csdn.net/upload/201704/20/1492694321_557527.png) 下好之后,因为系统自带的版本太高(编译android4.01要的gcc版本要求为4.4左右),所以我把系统/usr/bin目录下的gcc和g++两个链接文件改为了我下的gcc,只改了gcc,g++这两个链接,链接的文件为![图片说明](https://img-ask.csdn.net/upload/201704/20/1492694769_538358.png)这里的gcc和g++(不知道是不是改链接这两个文件), 另外我也不清楚gcc是不是就包含g++,还是说我改再下个g++? 然后在终端输入gcc -v和g++ -v都是显示只gcc的版本号, 编译android源代码时爆出一个ccl找不到的错误,网上说是gcc和g++的版本不同造成的,有谁能帮帮我吗?
关于gcc安装问题,求教
刚安装GCC,出现如下问题 g++.exe -x c++ -c C:\unknown1.c -o C:\unknown1.o -Wall -fpermissive -Wno-sign-compare -g g++.exe: installation problem, cannot exec `cc1plus': No such file or directory Failure 语法是没有问题,就编了一个简单的helloworld程序 求教如何解决!!
关于gcc和g++编译c文件时的一点疑惑
普遍观点,gcc把c文件当做c处理,把c++当做c++处理;而g++把二者都当做c++处理。这里的处理是指语法分析那一步。 但g++在编译过程中调用了gcc。我疑惑了,语法分析是编译的第二步吧,既然g++调用了gcc,那么它是怎么让gcc把c文件当做c++处理的。 还有一点,就是对于c文件编译出来的符号,使用gcc和g++到底一不一样。比如在c文件里定义int add(int a,int b);用gcc和g++最后编译出来的符号到底是什么?是c风格的,还是c++风格的。 希望高人指点一下!
怎样在64位的linux环境中使用gcc/g++运行32位的程序,求大神解答
怎样在64位的linux环境中使用gcc/g++运行32位的程序,求大神解答
安装gcc4.9.0之后找不到include目录
[root@ptb habi]# g++ -v ccc.cpp 使用内建 specs。 COLLECT_GCC=g++ 目标:i686-pc-linux-gnu 配置为:../configure --prefix=/usr/local/gcc-4.9.0 --mandir=/usr/share/man --infodir=/usr/share/info --enable-shared --enable-threads=posix --enable-checking=release --with-system-zlib --enable-__cxa_atexit --disable-libunwind-exceptions --enable-libgcj-multifile --enable-languages=c,c++ 线程模型:posix gcc 版本 4.9.0 (GCC) COLLECT_GCC_OPTIONS='-v' '-shared-libgcc' '-mtune=generic' '-march=pentiumpro' cc1plus -quiet -v -iprefix /usr/bin/../lib/gcc/i686-pc-linux-gnu/4.9.0/ -D_GNU_SOURCE ccc.cpp -quiet -dumpbase ccc.cpp -mtune=generic -march=pentiumpro -auxbase ccc -version -o /tmp/ccpjzXOC.s GNU C++ (GCC) 版本 4.9.0 (i686-pc-linux-gnu) 由 GNU C 版本 4.9.0 编译,GMP 版本 4.3.2,MPFR 版本 2.4.2,MPC 版本 0.8.1 GGC 准则:--param ggc-min-expand=100 --param ggc-min-heapsize=131072 忽略不存在的目录“/usr/bin/../lib/gcc/i686-pc-linux-gnu/4.9.0/../../../../include/c++/4.9.0” 忽略不存在的目录“/usr/bin/../lib/gcc/i686-pc-linux-gnu/4.9.0/../../../../include/c++/4.9.0/i686-pc-linux-gnu” 忽略不存在的目录“/usr/bin/../lib/gcc/i686-pc-linux-gnu/4.9.0/../../../../include/c++/4.9.0/backward” 忽略不存在的目录“/usr/bin/../lib/gcc/i686-pc-linux-gnu/4.9.0/include” 忽略不存在的目录“/usr/bin/../lib/gcc/i686-pc-linux-gnu/4.9.0/include-fixed” 忽略不存在的目录“/usr/bin/../lib/gcc/i686-pc-linux-gnu/4.9.0/../../../../i686-pc-linux-gnu/include” 忽略不存在的目录“/usr/bin/../lib/gcc/../../lib/gcc/i686-pc-linux-gnu/4.9.0/../../../../include/c++/4.9.0” 忽略不存在的目录“/usr/bin/../lib/gcc/../../lib/gcc/i686-pc-linux-gnu/4.9.0/../../../../include/c++/4.9.0/i686-pc-linux-gnu” 忽略不存在的目录“/usr/bin/../lib/gcc/../../lib/gcc/i686-pc-linux-gnu/4.9.0/../../../../include/c++/4.9.0/backward” 忽略不存在的目录“/usr/bin/../lib/gcc/../../lib/gcc/i686-pc-linux-gnu/4.9.0/include” 忽略不存在的目录“/usr/local/include” 忽略不存在的目录“/usr/bin/../lib/gcc/../../lib/gcc/i686-pc-linux-gnu/4.9.0/include-fixed” 忽略不存在的目录“/usr/bin/../lib/gcc/../../lib/gcc/i686-pc-linux-gnu/4.9.0/../../../../i686-pc-linux-gnu/include” 忽略重复的目录“/usr/include” #include "..." 搜索从这里开始: #include <...> 搜索从这里开始: /usr/bin/../lib/gcc/../../include 搜索列表结束。 GNU C++ (GCC) 版本 4.9.0 (i686-pc-linux-gnu) 由 GNU C 版本 4.9.0 编译,GMP 版本 4.3.2,MPFR 版本 2.4.2,MPC 版本 0.8.1 GGC 准则:--param ggc-min-expand=100 --param ggc-min-heapsize=131072 Compiler executable checksum: 3c13c9968389e205e0f7e12bfe79e4e8 ccc.cpp:1:20: 致命错误:iostream:没有那个文件或目录 #include <iostream> ^ 编译中断。
同样一段代码,但是用gcc编译是通过的,用g++编译是不通过的?
![图片说明](https://img-ask.csdn.net/upload/201801/22/1516584467_659214.png) 如图所示,同样一段代码我并没有#include <stdio.h> ,但是用gcc编译是通过的,用g++是编译是不通过的?
关于cvxopt在C语言中使用的问题?
最近想用C语言进行凸优化,凸优化工具箱用的是python中的cvxopt(因为官网上有using from C的example)。 但是将cvxopt安装到python后,打开官网的测试代码还是报错无法打开cvxopt.h 提问:安装到python后,是否已生成cvxopt.h?如果有,路径一般在哪里?如果没有,应该怎么生成? 编译环境:vs2019+python3.7(64bits)+boost1.72.0 附官网代码: ``` /* A modified version of the example in the Python documentation: http://docs.python.org/ext/pure-embedding.html Solves the LP: minimize -4*x1 -5*x2 subject 2*x1 + x2 <= 3 x1 + 2*x2 <= 3 x1 >= 0, x2 >= 0 and prints the solution from C. On Ubuntu Linux compile with: gcc -o embed_cvxopt embed_cvxopt.c \ -I${CVXOPT_SRC}/C \ -I/usr/include/python2.4 -lpython2.4 */ #include "cvxopt.h" int main(int argc, char *argv[]) { Py_Initialize(); if (import_cvxopt() < 0) { fprintf(stderr, "error importing cvxopt"); return 1; } /* import cvxopt.solvers */ PyObject *solvers = PyImport_ImportModule("cvxopt.solvers"); if (!solvers) { fprintf(stderr, "error importing cvxopt.solvers"); return 1; } /* get reference to solvers.solvelp */ PyObject *lp = PyObject_GetAttrString(solvers, "lp"); if (!lp) { fprintf(stderr, "error referencing cvxopt.solvers.lp"); Py_DECREF(solvers); return 1; } /* create matrices */ PyObject *c = (PyObject *)Matrix_New(2, 1, DOUBLE); PyObject *G = (PyObject *)Matrix_New(4, 2, DOUBLE); PyObject *h = (PyObject *)Matrix_New(4, 1, DOUBLE); PyObject *pArgs = PyTuple_New(3); if (!c || !G || !h || !pArgs) { fprintf(stderr, "error creating matrices"); Py_DECREF(solvers); Py_DECREF(lp); Py_XDECREF(c); Py_XDECREF(G); Py_XDECREF(h); Py_XDECREF(pArgs); return 1; } MAT_BUFD(c)[0] = -4; MAT_BUFD(c)[1] = -5; MAT_BUFD(G)[0] = 2; MAT_BUFD(G)[1] = 1; MAT_BUFD(G)[2] = -1; MAT_BUFD(G)[4] = 1; MAT_BUFD(G)[5] = 2; MAT_BUFD(G)[7] = -1; MAT_BUFD(h)[0] = 3; MAT_BUFD(h)[1] = 3; /* pack matrices into an argument tuple - references are stolen*/ PyTuple_SetItem(pArgs, 0, c); PyTuple_SetItem(pArgs, 1, G); PyTuple_SetItem(pArgs, 2, h); PyObject *sol = PyObject_CallObject(lp, pArgs); if (!sol) { PyErr_Print(); Py_DECREF(solvers); Py_DECREF(lp); Py_DECREF(pArgs); return 1; } PyObject *x = PyDict_GetItemString(sol, "x"); fprintf(stdout, "\n\nx = (%5.4e, %5.4e)\n", MAT_BUFD(x)[0], MAT_BUFD(x)[1]); Py_DECREF(solvers); Py_DECREF(lp); Py_DECREF(pArgs); Py_DECREF(sol); Py_Finalize(); return 0; } ```
VScode在设置C语言环境时gcc报错
我的gcc -v和gdb-v都可以在terminal里成功执行, **我的launch.json是这样的: { "version": "0.2.0", "configurations": [ { "name": "(gdb) Launch", // 配置名称,将会在启动配置的下拉菜单中显示 "type": "cppdbg", // 配置类型,这里只能为cppdbg "request": "launch", // 请求配置类型,可以为launch(启动)或attach(附加) "program": "${workspaceFolder}/${fileBasenameNoExtension}.exe",// 将要进行调试的程序的路径 "args": [], // 程序调试时传递给程序的命令行参数,一般设为空即可 "stopAtEntry": false, // 设为true时程序将暂停在程序入口处,一般设置为false "cwd": "${workspaceFolder}", // 调试程序时的工作目录,一般为${workspaceFolder}即代码所在目录 "environment": [], "externalConsole": true, // 调试时是否显示控制台窗口,一般设置为true显示控制台 "MIMode": "gdb", "miDebuggerPath": "D:\\C#\\GCC\\bin\\gdb.exe", // miDebugger的路径,注意这里要与MinGw的路径对应 "preLaunchTask": "gcc", // 调试会话开始前执行的任务,一般为编译程序,c++为g++, c为gcc "setupCommands": [ { "description": "Enable pretty-printing for gdb", "text": "-enable-pretty-printing", "ignoreFailures": true } ] } ] } **我的task.json是这样的: { "version": "2.0.0", "command": "g++", "args": ["-g","${file}","-o","${fileBasenameNoExtension}.exe"], // 编译命令参数 "problemMatcher": { "owner": "cpp", "fileLocation": ["relative", "${workspaceFolder}"], "pattern": { "regexp": "^(.*):(\\d+):(\\d+):\\s+(warning|error):\\s+(.*)$", "file": 1, "line": 2, "column": 3, "severity": 4, "message": 5 } } } 然后我F5调试的时候报错为: 下图找不到gcc??? 请问一下广大网友如何解决
关于const中指针及其操作在gcc与g++编译器下的解释?
int main() { const int x=5; printf("转换前:x=%d\n",x); int *p=(int*)&x; *p=10; printf("转换后:x=%d\n",x); printf("转换后:*p=%d\n",*p); const int* q = &x; * q = 10; printf("x= %d\n",x); printf("q= %d\n",*q); return 0; ![图片说明](https://img-ask.csdn.net/upload/201911/18/1574078258_253344.jpg)![图片说明](https://img-ask.csdn.net/upload/201911/18/1574078269_205044.jpg) 两种情况都不理解 发现其中所有变量的地址都一样 请大佬详解
gcc和g++版本已经升级但是gnu版本显示没有升级
我在用cmake执行的时候出现如下图所示! ![图片说明](https://img-ask.csdn.net/upload/201712/04/1512381344_640177.png) 但是我的gcc和g++版本都是升级过的了, ![图片说明](https://img-ask.csdn.net/upload/201712/04/1512381385_516354.png) 这不知道是什么原因,希望大神解决一下
codeblocks for Mac编译出现问题提示GUN GCC什么的,小白一个,希望大佬指教!
-------------- Build: Debug in 1 (compiler: GNU GCC Compiler)--------------- gcc -Wall -g -c /Users/jackwang/Documents/codeblocks/1/main.c -o obj/Debug/main.o xcrun: error: invalid active developer path (/Library/Developer/CommandLineTools), missing xcrun at: /Library/Developer/CommandLineTools/usr/bin/xcrun Process terminated with status 1 (0 minute(s), 0 second(s)) 0 error(s), 0 warning(s) (0 minute(s), 0 second(s)) 提示信息如上。
已安装的Nginx追加自带模块始终报错
* Centos7系统下已安装的nginx需要追加http_limit_req_module模块。按照网上的方法,下载了对应版本的源码, 1. 在配置参数后追加--with-http_limit_req_module,出现以下报错 ``` ./configure: error: invalid option "--with-http_limit_req_module" ``` 2. 使用--add-module=http_limit_req_module报找不到config文件 ``` adding module in http_limit_req_module ./configure: error: no http_limit_req_module/config was found ``` 3. 将模块名改成ngx_http_limit_req_module报的也是类似的错误 # 求大神看看应该怎么添加 下面是完整配置参数,nginx版本是1.17.8,--with-http_limit_req_module前的参数是用nginx -V查出来的 ``` ./configure --prefix=/etc/nginx --sbin-path=/usr/sbin/nginx --modules-path=/usr/lib64/nginx/modules --conf-path=/etc/nginx/nginx.conf --error-log-path=/var/log/nginx/error.log --http-log-path=/var/log/nginx/access.log --pid-path=/var/run/nginx.pid --lock-path=/var/run/nginx.lock --http-client-body-temp-path=/var/cache/nginx/client_temp --http-proxy-temp-path=/var/cache/nginx/proxy_temp --http-fastcgi-temp-path=/var/cache/nginx/fastcgi_temp --http-uwsgi-temp-path=/var/cache/nginx/uwsgi_temp --http-scgi-temp-path=/var/cache/nginx/scgi_temp --user=nginx --group=nginx --with-compat --with-file-aio --with-threads --with-http_addition_module --with-http_auth_request_module --with-http_dav_module --with-http_flv_module --with-http_gunzip_module --with-http_gzip_static_module --with-http_mp4_module --with-http_random_index_module --with-http_realip_module --with-http_secure_link_module --with-http_slice_module --with-http_ssl_module --with-http_stub_status_module --with-http_sub_module --with-http_v2_module --with-mail --with-mail_ssl_module --with-stream --with-stream_realip_module --with-stream_ssl_module --with-stream_ssl_preread_module --with-cc-opt='-O2 -g -pipe -Wall -Wp,-D_FORTIFY_SOURCE=2 -fexceptions -fstack-protector-strong --param=ssp-buffer-size=4 -grecord-gcc-switches -m64 -mtune=generic -fPIC' --with-ld-opt='-Wl,-z,relro -Wl,-z,now -pie' --with-http_limit_req_module ```
怎么安装C4driod及其插件Gcc和sdl
怎么安装C 4 driod及其插件G c c和s d l ,总是不对,不能使用插件
求解,gcc编译C++代码为intel样式错误
c++代码 ``` int g_arr[10]; int main() { g_arr[0] = 1; g_arr[1] = 2; g_arr[2] = 3; } ``` 使用g++编译为intel样式的汇编代码 g++ -S -o main.s main.cpp -masm=intel 然后汇编为目标文件时报错 g++ -c -o main.o main.s ![图片说明](https://img-ask.csdn.net/upload/201704/27/1493278872_986757.jpg) 查看编译后的汇编代码确实有问题,不知道是不是编译参数写错了还是gcc使用intel样式汇编时本身就有bug
ubuntu18.04.1文件打开显示错误,重叠显示
![打开了一个.c文件,然而并没有正确显示文件里的代码](https://img-ask.csdn.net/upload/201909/24/1569332767_17678.png) 系统刚安装好时打开没问题,后面装好了gcc g++ cmake后再打开时就出现问题了,系统的gcc没有装全。 在终端用指令sudo gedit bits.c打开文件显示正常。
Ubuntu14.04升级gcc版本到5出错
我主要按照博客[Ubuntu 14.04 LTS 下升级 gcc 到 gcc-4.9、gcc-5 版本](http://www.cnblogs.com/BlackStorm/p/5183490.html "")的步骤升级gcc。 ``` sudo add-apt-repository ppa:ubuntu-toolchain-r/test sudo apt-get update sudo apt-get install software-properties-common sudo apt-get upgrade sudo apt-get install gcc-5 g++-5 ``` 之后出现问题: ``` gph@gph-pc:~$ sudo apt-get install gcc-5 Reading package lists... Done Building dependency tree Reading state information... Done Some packages could not be installed. This may mean that you have requested an impossible situation or if you are using the unstable distribution that some required packages have not yet been created or been moved out of Incoming. The following information may help to resolve the situation: The following packages have unmet dependencies: gcc-5:i386 : Depends: cpp-5:i386 (= 5.4.1-2ubuntu1~14.04) but it is not going to be installed Depends: libcc1-0:i386 (>= 5.4.1-2ubuntu1~14.04) but it is not going to be installed Depends: binutils:i386 (>= 2.24) but it is not going to be installed Depends: libgcc-5-dev:i386 (= 5.4.1-2ubuntu1~14.04) but it is not going to be installed Depends: libc6:i386 (>= 2.15) but it is not going to be installed Depends: libgcc1:i386 (>= 1:3.0) but it is not going to be installed Depends: libgmp10:i386 but it is not going to be installed Depends: libisl15:i386 (>= 0.15) but it is not going to be installed Depends: libmpc3:i386 but it is not going to be installed Depends: libmpfr4:i386 (>= 3.1.3) but it is not going to be installed Depends: libstdc++6:i386 (>= 4.1.1) but it is not going to be installed Depends: zlib1g:i386 (>= 1:1.1.4) but it is not going to be installed Recommends: libc6-dev:i386 (>= 2.13-0ubuntu6) but it is not going to be installed E: Unable to correct problems, you have held broken packages. ``` 请问有人知道如何解决吗? 已经百度和Google过相关的问题了,还是没有解决,请各位提供帮助,谢谢! =================================================================== 最后通过本地编译安装的方式安装了gcc5.3.0,但是在编译一个代码的时候出现如下错误: ``` .build_release/lib/libcaffe.so: undefined reference to `boost::match_results<__gnu_cxx::__normal_iterator<char const*, std::__cxx11::basic_string<char.build_release/lib, std/libcaffe.so: undefined reference to `boost::match_results<__gnu_cxx::__normal_iterator<char const*, std:::__cxx11:::basic_string<charchar_traits, std<::char_traits<charchar>, std::allocator<char> > >, std::allocator<boost::sub_match<>__gnu_cxx::__normal_iterator<, .build_release/tools/get_image_size.o: In function `std::__cxx11::basic_string<char, std::char_traits<char>, std::allocator<char> >* google::MakeCheckOpString<unsigned long, unsigned long>(unsigned long const&, unsigned long const&, char const*)': get_image_size.cpp:(.text._ZN6google17MakeCheckOpStringImmEEPNSt7__cxx1112basic_stringIcSt11char_traitsIcESaIcEEERKT_RKT0_PKc[_ZN6google17MakeCheckOpStringImmEEPNSt7__cxx1112basic_stringIcSt11char_traitsIcESaIcEEERKT_RKT0_PKc]+0x41): undefined reference to `google::base::CheckOpMessageBuilder::NewString[abi:cxx11]()' .build_release/tools/get_image_size.o: In function `main': get_image_size.cpp:(.text.startup+0x66): undefined reference to `google::SetUsageMessage(std::__cxx11::basic_string<char, std::char_traits<char>, std::allocator<char> > const&)' get_image_size.cpp:(.text.startup+0x722): undefined reference to `caffe::GetImageSize(std::__cxx11::basic_string<char, std::char_traits<char>, std::allocator<char> > const&, int*, int*)' 。 。 。 。 。 。 .build_release/lib/libcaffe.so: undefined reference to `google::base::CheckOpMessageBuilder::NewString[abi:cxx11]()' collect2: error: ld returned 1 exit status make: *** [.build_release/tools/device_query.bin] Error 1 ``` 这又是什么问题。。。?
gcc: error: lstdc++:
在ubuntu上编译一个c++文件的时候, ![图片说明](https://img-ask.csdn.net/upload/201611/29/1480417346_128707.jpg) 在sudo apt-get install g++-multilib之后任然是gcc: error: lstdc++: No such file or directory 求大神指点
Linux下gcc编译C代码出现段错误,提示没有strcmp.S文件,原因何在?
# ## 这套代码在Windows的Cygwin64环境下运行正常,拿到VMware下的ubuntu时,编译OK,运行时出现段错误提示缺少strcmp.S文件。截图如下: ![图片说明](https://img-ask.csdn.net/upload/201904/19/1555653313_232479.png) ## ubuntu的gcc版本信息如下: ![图片说明](https://img-ask.csdn.net/upload/201904/19/1555653378_838962.png) ## 在Windows的Cygwin64上gcc的版本为:6.3.0 (MinGW.org GCC-6.3.0-1) 现在的ubuntu版本是16.04.6,之前在ubuntu14.04上尝试升级gcc到6.0,结果,要安装的依赖太多。。。没有成功,后直接安装了16.04.6,但看起来版本比Windows上的还是低。 实在是不知道什么原因导致的,感觉还是环境哪里不对导致的,还请大家帮忙看看,先谢过! 另外,makefile里的gcc编译参数是下面这些,换到Linux下后需要修改什么吗? CFLAGS = -c -g -Wall -Wswitch-enum -ansi -pedantic -DDEBUG 关于那个找不到的strcmp.S,用whereis命令查找,结果如下: lichunxia@lichunxia-virtual-machine:~/Work/new_crowbar$ whereis strcmp.S strcmp: /usr/share/man/man3/strcmp.3.gz
求解内置宏C/C++_LIN_(gcc/g++)
#include<iostream> using namespace std; void main() { cout<<_LINE_<<endl; } error: ‘_LINE_’ was not declared in this scope std::cout<<_LINE_<<std::endl;
报错 :error: command 'gcc' failed with exit status 1
系统: CentOS6.5 ,Python3.6 安装 mysqlclient 时候 报错:error: command 'gcc' failed with exit status 1 以下是错误信息: Collecting mysqlclient Using cached mysqlclient-1.3.10.tar.gz Installing collected packages: mysqlclient Running setup.py install for mysqlclient ... error Complete output from command /usr/local/python3/bin/python3.6 -u -c "import setuptools, tokenize;__file__='/tmp/pip-build-t3olsi0s/mysqlclient/setup.py';f=getattr(tokenize, 'open', open)(__file__);code=f.read().replace('\r\n', '\n');f.close();exec(compile(code, __file__, 'exec'))" install --record /tmp/pip-oqq8k4wv-record/install-record.txt --single-version-externally-managed --compile: running install running build running build_py creating build creating build/lib.linux-x86_64-3.6 copying _mysql_exceptions.py -> build/lib.linux-x86_64-3.6 creating build/lib.linux-x86_64-3.6/MySQLdb copying MySQLdb/__init__.py -> build/lib.linux-x86_64-3.6/MySQLdb copying MySQLdb/compat.py -> build/lib.linux-x86_64-3.6/MySQLdb copying MySQLdb/connections.py -> build/lib.linux-x86_64-3.6/MySQLdb copying MySQLdb/converters.py -> build/lib.linux-x86_64-3.6/MySQLdb copying MySQLdb/cursors.py -> build/lib.linux-x86_64-3.6/MySQLdb copying MySQLdb/release.py -> build/lib.linux-x86_64-3.6/MySQLdb copying MySQLdb/times.py -> build/lib.linux-x86_64-3.6/MySQLdb creating build/lib.linux-x86_64-3.6/MySQLdb/constants copying MySQLdb/constants/__init__.py -> build/lib.linux-x86_64-3.6/MySQLdb/constants copying MySQLdb/constants/CLIENT.py -> build/lib.linux-x86_64-3.6/MySQLdb/constants copying MySQLdb/constants/CR.py -> build/lib.linux-x86_64-3.6/MySQLdb/constants copying MySQLdb/constants/ER.py -> build/lib.linux-x86_64-3.6/MySQLdb/constants copying MySQLdb/constants/FIELD_TYPE.py -> build/lib.linux-x86_64-3.6/MySQLdb/constants copying MySQLdb/constants/FLAG.py -> build/lib.linux-x86_64-3.6/MySQLdb/constants copying MySQLdb/constants/REFRESH.py -> build/lib.linux-x86_64-3.6/MySQLdb/constants running build_ext building '_mysql' extension creating build/temp.linux-x86_64-3.6 gcc -pthread -Wsign-compare -DNDEBUG -g -fwrapv -O3 -Wall -Wstrict-prototypes -fPIC -Dversion_info=(1,3,10,'final',0) -D__version__=1.3.10 -I/usr/include/mysql -I/usr/local/python3/include/python3.6m -c _mysql.c -o build/temp.linux-x86_64-3.6/_mysql.o -g -fstack-protector -m64 -fPIC -g -fabi-version=2 -fno-omit-frame-pointer -fno-strict-aliasing In file included from /usr/local/python3/include/python3.6m/Python.h:8, from _mysql.c:40: /usr/local/python3/include/python3.6m/pyconfig.h:600:1: warning: "HAVE_MBRTOWC" redefined In file included from _mysql.c:29: /usr/include/mysql/my_config.h:439:1: warning: this is the location of the previous definition gcc -pthread -shared build/temp.linux-x86_64-3.6/_mysql.o -L/usr/lib64 -lmysqlclient -lpthread -lm -lrt -ldl -o build/lib.linux-x86_64-3.6/_mysql.cpython-36m-x86_64-linux-gnu.so /usr/bin/ld: cannot find -lmysqlclient collect2: ld returned 1 exit status error: command 'gcc' failed with exit status 1 ---------------------------------------- Command "/usr/local/python3/bin/python3.6 -u -c "import setuptools, tokenize;__file__='/tmp/pip-build-t3olsi0s/mysqlclient/setup.py';f=getattr(tokenize, 'open', open)(__file__);code=f.read().replace('\r\n', '\n');f.close();exec(compile(code, __file__, 'exec'))" install --record /tmp/pip-oqq8k4wv-record/install-record.txt --single-version-externally-managed --compile" failed with error code 1 in /tmp/pip-build-t3olsi0s/mysqlclient/ 按照别的帖子 yum install 了 python-devel了还是一样..而且 安装的python-devel的version 是2.6.6的 跟我的Python版本不符,但是yum仓库里又没有 3.6的 python-devel 如何解决?菜鸡求助...
《奇巧淫技》系列-python!!每天早上八点自动发送天气预报邮件到QQ邮箱
将代码部署服务器,每日早上定时获取到天气数据,并发送到邮箱。 也可以说是一个小人工智障。 思路可以运用在不同地方,主要介绍的是思路。
Linux(服务器编程):15---两种高效的事件处理模式(reactor模式、proactor模式)
前言 同步I/O模型通常用于实现Reactor模式 异步I/O模型则用于实现Proactor模式 最后我们会使用同步I/O方式模拟出Proactor模式 一、Reactor模式 Reactor模式特点 它要求主线程(I/O处理单元)只负责监听文件描述符上是否有事件发生,有的话就立即将时间通知工作线程(逻辑单元)。除此之外,主线程不做任何其他实质性的工作 读写数据,接受新的连接,以及处...
为什么要学数据结构?
一、前言 在可视化化程序设计的今天,借助于集成开发环境可以很快地生成程序,程序设计不再是计算机专业人员的专利。很多人认为,只要掌握几种开发工具就可以成为编程高手,其实,这是一种误解。要想成为一个专业的开发人员,至少需要以下三个条件: 1) 能够熟练地选择和设计各种数据结构和算法 2) 至少要能够熟练地掌握一门程序设计语言 3) 熟知所涉及的相关应用领域的知识 其中,后两个条件比较容易实现,而第一个...
C语言魔塔游戏
很早就很想写这个,今天终于写完了。 游戏截图: 编译环境: VS2017 游戏需要一些图片,如果有想要的或者对游戏有什么看法的可以加我的QQ 2985486630 讨论,如果暂时没有回应,可以在博客下方留言,到时候我会看到。 下面我来介绍一下游戏的主要功能和实现方式 首先是玩家的定义,使用结构体,这个名字是可以自己改变的 struct gamerole { char n
进程通信方式总结与盘点
​ 进程通信是指进程之间的信息交换。这里需要和进程同步做一下区分,进程同步控制多个进程按一定顺序执行,进程通信是一种手段,而进程同步是目标。从某方面来讲,进程通信可以解决进程同步问题。 ​ 首先回顾下我们前面博文中讲到的信号量机制,为了实现进程的互斥与同步,需要在进程间交换一定的信息,因此信号量机制也可以被归为进程通信的一种方式,但是也被称为低级进程通信,主要原因为: 效率低:一次只可操作少量的...
究竟你适不适合买Mac?
我清晰的记得,刚买的macbook pro回到家,开机后第一件事情,就是上了淘宝网,花了500元钱,找了一个上门维修电脑的师傅,上门给我装了一个windows系统。。。。。。 表砍我。。。 当时买mac的初衷,只是想要个固态硬盘的笔记本,用来运行一些复杂的扑克软件。而看了当时所有的SSD笔记本后,最终决定,还是买个好(xiong)看(da)的。 已经有好几个朋友问我mba怎么样了,所以今天尽量客观
听说了吗?阿里双11作战室竟1根网线都没有
双11不光是购物狂欢节,更是对技术的一次“大考”,对于阿里巴巴企业内部运营的基础保障技术而言,亦是如此。 回溯双11历史,这背后也经历过“小米加步枪”的阶段:作战室从随处是网线,交换机放地上的“一地狼藉”;到如今媲美5G的wifi网速,到现场却看不到一根网线;从当年使用商用AP(无线路由器),让光明顶双11当天断网一分钟,到全部使用阿里自研AP……阿里巴巴企业智能事业部工程师们提供的基础保障...
在阿里,40岁的奋斗姿势
在阿里,40岁的奋斗姿势 在阿里,什么样的年纪可以称为老呢?35岁? 在云网络,有这样一群人,他们的平均年龄接近40,却刚刚开辟职业生涯的第二战场。 他们的奋斗姿势是什么样的呢? 洛神赋 “翩若惊鸿,婉若游龙。荣曜秋菊,华茂春松。髣髴兮若轻云之蔽月,飘飖兮若流风之回雪。远而望之,皎若太阳升朝霞;迫而察之,灼若芙蕖出渌波。” 爱洛神,爱阿里云 2018年,阿里云网络产品部门启动洛神2.0升...
关于研发效能提升的思考
研发效能提升是最近比较热门的一个话题,本人根据这几年的工作心得,做了一些思考总结,由于个人深度有限,暂且抛转引入。 三要素 任何生产力的提升都离不开这三个因素:人、流程和工具,少了其中任何一个因素都无法实现。 人,即思想,也就是古人说的“道”,道不同不相为谋,是制高点,也是高层建筑的基石。 流程,即方法,也是古人说的“法”。研发效能的提升,也就是要提高投入产出比,既要增加产出,也要减...
Python爬虫爬取淘宝,京东商品信息
小编是一个理科生,不善长说一些废话。简单介绍下原理然后直接上代码。 使用的工具(Python+pycharm2019.3+selenium+xpath+chromedriver)其中要使用pycharm也可以私聊我selenium是一个框架可以通过pip下载 pip install selenium -i https://pypi.tuna.tsinghua.edu.cn/simple/ 
阿里程序员写了一个新手都写不出的低级bug,被骂惨了。
这种新手都不会范的错,居然被一个工作好几年的小伙子写出来,差点被当场开除了。
Java工作4年来应聘要16K最后没要,细节如下。。。
前奏: 今天2B哥和大家分享一位前几天面试的一位应聘者,工作4年26岁,统招本科。 以下就是他的简历和面试情况。 基本情况: 专业技能: 1、&nbsp;熟悉Sping了解SpringMVC、SpringBoot、Mybatis等框架、了解SpringCloud微服务 2、&nbsp;熟悉常用项目管理工具:SVN、GIT、MAVEN、Jenkins 3、&nbsp;熟悉Nginx、tomca
2020年,冯唐49岁:我给20、30岁IT职场年轻人的建议
点击“技术领导力”关注∆  每天早上8:30推送 作者| Mr.K   编辑| Emma 来源| 技术领导力(ID:jishulingdaoli) 前天的推文《冯唐:职场人35岁以后,方法论比经验重要》,收到了不少读者的反馈,觉得挺受启发。其实,冯唐写了不少关于职场方面的文章,都挺不错的。可惜大家只记住了“春风十里不如你”、“如何避免成为油腻腻的中年人”等不那么正经的文章。 本文整理了冯
程序员该看的几部电影
##1、骇客帝国(1999) 概念:在线/离线,递归,循环,矩阵等 剧情简介: 不久的将来,网络黑客尼奥对这个看似正常的现实世界产生了怀疑。 他结识了黑客崔妮蒂,并见到了黑客组织的首领墨菲斯。 墨菲斯告诉他,现实世界其实是由一个名叫“母体”的计算机人工智能系统控制,人们就像他们饲养的动物,没有自由和思想,而尼奥就是能够拯救人类的救世主。 可是,救赎之路从来都不会一帆风顺,到底哪里才是真实的世界?
入职阿里5年,他如何破解“技术债”?
简介: 作者 | 都铎 作为一名技术人,你常常会听到这样的话: “先快速上线” “没时间改” “再缓一缓吧” “以后再解决” “先用临时方案处理” …… 当你埋下的坑越来越多,不知道哪天哪位同学就会踩上一颗雷。特别赞同“人最大的恐惧就是未知,当技术债可说不可见的时候,才是最让人不想解决的时候。” 作为一个程序员,我们反对复制粘贴,但是我们经常会见到相似的代码,相同的二方包,甚至整个代码...
Python绘图,圣诞树,花,爱心 | Turtle篇
每周每日,分享Python实战代码,入门资料,进阶资料,基础语法,爬虫,数据分析,web网站,机器学习,深度学习等等。 公众号回复【进群】沟通交流吧,QQ扫码进群学习吧 微信群 QQ群 1.画圣诞树 import turtle screen = turtle.Screen() screen.setup(800,600) circle = turtle.Turtle()...
作为一个程序员,CPU的这些硬核知识你必须会!
CPU对每个程序员来说,是个既熟悉又陌生的东西? 如果你只知道CPU是中央处理器的话,那可能对你并没有什么用,那么作为程序员的我们,必须要搞懂的就是CPU这家伙是如何运行的,尤其要搞懂它里面的寄存器是怎么一回事,因为这将让你从底层明白程序的运行机制。 随我一起,来好好认识下CPU这货吧 把CPU掰开来看 对于CPU来说,我们首先就要搞明白它是怎么回事,也就是它的内部构造,当然,CPU那么牛的一个东
破14亿,Python分析我国存在哪些人口危机!
2020年1月17日,国家统计局发布了2019年国民经济报告,报告中指出我国人口突破14亿。 猪哥的朋友圈被14亿人口刷屏,但是很多人并没有看到我国复杂的人口问题:老龄化、男女比例失衡、生育率下降、人口红利下降等。 今天我们就来分析一下我们国家的人口数据吧! 一、背景 1.人口突破14亿 2020年1月17日,国家统计局发布了 2019年国民经济报告 ,报告中指出:年末中国大陆总人口(包括31个
在家远程办公效率低?那你一定要收好这个「在家办公」神器!
相信大家都已经收到国务院延长春节假期的消息,接下来,在家远程办公可能将会持续一段时间。 但是问题来了。远程办公不是人在电脑前就当坐班了,相反,对于沟通效率,文件协作,以及信息安全都有着极高的要求。有着非常多的挑战,比如: 1在异地互相不见面的会议上,如何提高沟通效率? 2文件之间的来往反馈如何做到及时性?如何保证信息安全? 3如何规划安排每天工作,以及如何进行成果验收? ......
作为一个程序员,内存和磁盘的这些事情,你不得不知道啊!!!
截止目前,我已经分享了如下几篇文章: 一个程序在计算机中是如何运行的?超级干货!!! 作为一个程序员,CPU的这些硬核知识你必须会! 作为一个程序员,内存的这些硬核知识你必须懂! 这些知识可以说是我们之前都不太重视的基础知识,可能大家在上大学的时候都学习过了,但是嘞,当时由于老师讲解的没那么有趣,又加上这些知识本身就比较枯燥,所以嘞,大家当初几乎等于没学。 再说啦,学习这些,也看不出来有什么用啊!
2020年的1月,我辞掉了我的第一份工作
其实,这篇文章,我应该早点写的,毕竟现在已经2月份了。不过一些其它原因,或者是我的惰性、还有一些迷茫的念头,让自己迟迟没有试着写一点东西,记录下,或者说是总结下自己前3年的工作上的经历、学习的过程。 我自己知道的,在写自己的博客方面,我的文笔很一般,非技术类的文章不想去写;另外我又是一个还比较热衷于技术的人,而平常复杂一点的东西,如果想写文章写的清楚点,是需要足够...
别低估自己的直觉,也别高估自己的智商
所有群全部吵翻天,朋友圈全部沦陷,公众号疯狂转发。这两周没怎么发原创,只发新闻,可能有人注意到了。我不是懒,是文章写了却没发,因为大家的关注力始终在这次的疫情上面,发了也没人看。当然,我...
Java坑人面试题系列: 包装类(中级难度)
Java Magazine上面有一个专门坑人的面试题系列: https://blogs.oracle.com/javamagazine/quiz-2。 这些问题的设计宗旨,主要是测试面试者对Java语言的了解程度,而不是为了用弯弯绕绕的手段把面试者搞蒙。 如果你看过往期的问题,就会发现每一个都不简单。 这些试题模拟了认证考试中的一些难题。 而 “中级(intermediate)” 和 “高级(ad
深度学习入门笔记(十八):卷积神经网络(一)
欢迎关注WX公众号:【程序员管小亮】 专栏——深度学习入门笔记 声明 1)该文章整理自网上的大牛和机器学习专家无私奉献的资料,具体引用的资料请看参考文献。 2)本文仅供学术交流,非商用。所以每一部分具体的参考资料并没有详细对应。如果某部分不小心侵犯了大家的利益,还望海涵,并联系博主删除。 3)博主才疏学浅,文中如有不当之处,请各位指出,共同进步,谢谢。 4)此属于第一版本,若有错误,还需继续修正与...
这个世界上人真的分三六九等,你信吗?
偶然间,在知乎上看到一个问题 一时间,勾起了我深深的回忆。 以前在厂里打过两次工,做过家教,干过辅导班,做过中介。零下几度的晚上,贴过广告,满脸、满手地长冻疮。 再回首那段岁月,虽然苦,但让我学会了坚持和忍耐。让我明白了,在这个世界上,无论环境多么的恶劣,只要心存希望,星星之火,亦可燎原。 下文是原回答,希望能对你能有所启发。 如果我说,这个世界上人真的分三六九等,...
节后首个工作日,企业们集体开晨会让钉钉挂了
By 超神经场景描述:昨天 2 月 3 日,是大部分城市号召远程工作的第一天,全国有接近 2 亿人在家开始远程办公,钉钉上也有超过 1000 万家企业活跃起来。关键词:十一出行 人脸...
Java基础知识点梳理
Java基础知识点梳理 摘要: 虽然已经在实际工作中经常与java打交道,但是一直没系统地对java这门语言进行梳理和总结,掌握的知识也比较零散。恰好利用这段时间重新认识下java,并对一些常见的语法和知识点做个总结与回顾,一方面为了加深印象,方便后面查阅,一方面为了学好java打下基础。 Java简介 java语言于1995年正式推出,最开始被命名为Oak语言,由James Gosling(詹姆
2020年全新Java学习路线图,含配套视频,学完即为中级Java程序员!!
新的一年来临,突如其来的疫情打破了平静的生活! 在家的你是否很无聊,如果无聊就来学习吧! 世上只有一种投资只赚不赔,那就是学习!!! 传智播客于2020年升级了Java学习线路图,硬核升级,免费放送! 学完你就是中级程序员,能更快一步找到工作! 一、Java基础 JavaSE基础是Java中级程序员的起点,是帮助你从小白到懂得编程的必经之路。 在Java基础板块中有6个子模块的学
B 站上有哪些很好的学习资源?
哇说起B站,在小九眼里就是宝藏般的存在,放年假宅在家时一天刷6、7个小时不在话下,更别提今年的跨年晚会,我简直是跪着看完的!! 最早大家聚在在B站是为了追番,再后来我在上面刷欧美新歌和漂亮小姐姐的舞蹈视频,最近两年我和周围的朋友们已经把B站当作学习教室了,而且学习成本还免费,真是个励志的好平台ヽ(.◕ฺˇд ˇ◕ฺ;)ノ 下面我们就来盘点一下B站上优质的学习资源: 综合类 Oeasy: 综合
你也能看懂的:蒙特卡罗方法
蒙特卡罗方法,也称统计模拟方法,是1940年代中期由于科学技术的发展和电子计算机的发明,而提出的一种以概率统计理论为指导的数值计算方法。是指使用随机数(或更常见的伪随机数)来解决很多计算问题的方法 蒙特卡罗方法可以粗略地分成两类:一类是所求解的问题本身具有内在的随机性,借助计算机的运算能力可以直接模拟这种随机的过程。另一种类型是所求解问题可以转化为某种随机分布的特征数,比如随机事件出现的概率,或...
相关热词 c#导入fbx c#中屏蔽键盘某个键 c#正态概率密度 c#和数据库登陆界面设计 c# 高斯消去法 c# codedom c#读取cad文件文本 c# 控制全局鼠标移动 c# temp 目录 bytes初始化 c#
立即提问