STS 运行报错(sts-3.8.3.RELEASE)

Exception in thread "main" java.lang.NoClassDefFoundError: ch/qos/logback/classic/turbo/TurboFilter
at java.lang.Class.getDeclaredConstructors0(Native Method)
at java.lang.Class.privateGetDeclaredConstructors(Class.java:2671)
at java.lang.Class.getConstructor0(Class.java:3075)
at java.lang.Class.getConstructor(Class.java:1825)
at org.springframework.boot.logging.LoggingSystem.get(LoggingSystem.java:169)
at org.springframework.boot.logging.LoggingSystem.get(LoggingSystem.java:160)
at org.springframework.boot.logging.LoggingApplicationListener.onApplicationStartingEvent(LoggingApplicationListener.java:229)
at org.springframework.boot.logging.LoggingApplicationListener.onApplicationEvent(LoggingApplicationListener.java:209)
at org.springframework.context.event.SimpleApplicationEventMulticaster.invokeListener(SimpleApplicationEventMulticaster.java:167)
at org.springframework.context.event.SimpleApplicationEventMulticaster.multicastEvent(SimpleApplicationEventMulticaster.java:139)
at org.springframework.context.event.SimpleApplicationEventMulticaster.multicastEvent(SimpleApplicationEventMulticaster.java:122)
at org.springframework.boot.context.event.EventPublishingRunListener.starting(EventPublishingRunListener.java:68)
at org.springframework.boot.SpringApplicationRunListeners.starting(SpringApplicationRunListeners.java:48)
at org.springframework.boot.SpringApplication.run(SpringApplication.java:303)
at org.springframework.boot.SpringApplication.run(SpringApplication.java:1162)
at org.springframework.boot.SpringApplication.run(SpringApplication.java:1151)
at com.bill.firstapplication.DemoApplication.main(DemoApplication.java:9)
Caused by: java.lang.ClassNotFoundException: ch.qos.logback.classic.turbo.TurboFilter
at java.net.URLClassLoader.findClass(URLClassLoader.java:381)
at java.lang.ClassLoader.loadClass(ClassLoader.java:424)
at sun.misc.Launcher$AppClassLoader.loadClass(Launcher.java:335)
at java.lang.ClassLoader.loadClass(ClassLoader.java:357)
... 17 more

2个回答

应该少包ch/qos/logback/classic/turbo/TurboFilter

Csdn user default icon
上传中...
上传图片
插入图片
抄袭、复制答案,以达到刷声望分或其他目的的行为,在CSDN问答是严格禁止的,一经发现立刻封号。是时候展现真正的技术了!
其他相关推荐
使用STS-3.7.2怎么声明一个interceptor
使用STS-3.7.2,想在dispatchor的相应文件添加一个interceptor,但是不知道interceptor在这个版本里的格式,很无奈。。。。
springboot +shiro项目打成jar或war包后shiroFilter报错,无法创建bean shiroFilter
在STS上正常运行,mvnclean 和install后打成的jar包和war包都报错,报错内容如下: ``` org.springframework.beans.factory.BeanCreationException: Error creating bean with name 'shiroFilter' defined in class path resource [com/livinglibrary/config/ShiroConfig.class]: BeanPostProcessor before instantiation of bean failed; nested exception is org.springframework.beans.factory.UnsatisfiedDependencyException: Error creating bean with name 'authorizationAttributeSourceAdvisor' defined in class path resource [com/livinglibrary/config/ShiroConfig.class]: Unsatisfied dependency expressed through method 'authorizationAttributeSourceAdvisor' parameter 0; nested exception is org.springframework.beans.factory.BeanCreationException: Error creating bean with name 'securityManager' defined in class path resource [com/livinglibrary/config/ShiroConfig.class]: Bean instantiation via factory method failed; nested exception is org.springframework.beans.BeanInstantiationException: Failed to instantiate [org.apache.shiro.mgt.SecurityManager]: Factory method 'securityManager' threw exception; nested exception is org.springframework.beans.factory.BeanCreationException: Error creating bean with name 'myShiroRealm': Injection of resource dependencies failed; nested exception is org.springframework.beans.factory.BeanCreationException: Error creating bean with name 'shiroService': Injection of resource dependencies failed; nested exception is org.springframework.beans.factory.UnsatisfiedDependencyException: Error creating bean with name 'userMapper' defined in URL [jar:file:/F:/SpringBootProjects/livinglibrary/target/livinglibrary-0.0.1-SNAPSHOT.jar!/BOOT-INF/classes!/com/livinglibrary/mapper/UserMapper.class]: Unsatisfied dependency expressed through bean property 'sqlSessionFactory'; nested exception is org.springframework.beans.factory.UnsatisfiedDependencyException: Error creating bean with name 'org.mybatis.spring.boot.autoconfigure.MybatisAutoConfiguration': Unsatisfied dependency expressed through constructor parameter 0; nested exception is org.springframework.beans.factory.BeanCreationException: Error creating bean with name 'mybatis-org.mybatis.spring.boot.autoconfigure.MybatisProperties': Initialization of bean failed; nested exception is java.lang.NoClassDefFoundError: javax/xml/bind/ValidationException at org.springframework.beans.factory.support.AbstractAutowireCapableBeanFactory.createBean(AbstractAutowireCapableBeanFactory.java:478) ~[spring-beans-4.3.3.RELEASE.jar!/:4.3.3.RELEASE] at org.springframework.beans.factory.support.AbstractBeanFactory$1.getObject(AbstractBeanFactory.java:306) ~[spring-beans-4.3.3.RELEASE.jar!/:4.3.3.RELEASE] at org.springframework.beans.factory.support.DefaultSingletonBeanRegistry.getSingleton(DefaultSingletonBeanRegistry.java:230) ~[spring-beans-4.3.3.RELEASE.jar!/:4.3.3.RELEASE] at org.springframework.beans.factory.support.AbstractBeanFactory.doGetBean(AbstractBeanFactory.java:302) ~[spring-beans-4.3.3.RELEASE.jar!/:4.3.3.RELEASE] at org.springframework.beans.factory.support.AbstractBeanFactory.getBean(AbstractBeanFactory.java:202) ~[spring-beans-4.3.3.RELEASE.jar!/:4.3.3.RELEASE] at org.springframework.context.support.PostProcessorRegistrationDelegate.registerBeanPostProcessors(PostProcessorRegistrationDelegate.java:240) ~[spring-context-4.3.3.RELEASE.jar!/:4.3.3.RELEASE] at org.springframework.context.support.AbstractApplicationContext.registerBeanPostProcessors(AbstractApplicationContext.java:697) ~[spring-context-4.3.3.RELEASE.jar!/:4.3.3.RELEASE] at org.springframework.context.support.AbstractApplicationContext.refresh(AbstractApplicationContext.java:526) ~[spring-context-4.3.3.RELEASE.jar!/:4.3.3.RELEASE] at org.springframework.boot.context.embedded.EmbeddedWebApplicationContext.refresh(EmbeddedWebApplicationContext.java:122) ~[spring-boot-1.4.1.RELEASE.jar!/:1.4.1.RELEASE] at org.springframework.boot.SpringApplication.refresh(SpringApplication.java:761) [spring-boot-1.4.1.RELEASE.jar!/:1.4.1.RELEASE] at org.springframework.boot.SpringApplication.refreshContext(SpringApplication.java:371) [spring-boot-1.4.1.RELEASE.jar!/:1.4.1.RELEASE] at org.springframework.boot.SpringApplication.run(SpringApplication.java:315) [spring-boot-1.4.1.RELEASE.jar!/:1.4.1.RELEASE] at org.springframework.boot.SpringApplication.run(SpringApplication.java:1186) [spring-boot-1.4.1.RELEASE.jar!/:1.4.1.RELEASE] at org.springframework.boot.SpringApplication.run(SpringApplication.java:1175) [spring-boot-1.4.1.RELEASE.jar!/:1.4.1.RELEASE] at com.livinglibrary.App.main(App.java:65) [classes!/:0.0.1-SNAPSHOT] at java.base/jdk.internal.reflect.NativeMethodAccessorImpl.invoke0(Native Method) ~[na:na] at java.base/jdk.internal.reflect.NativeMethodAccessorImpl.invoke(Unknown Source) ~[na:na] at java.base/jdk.internal.reflect.DelegatingMethodAccessorImpl.invoke(Unknown Source) ~[na:na] at java.base/java.lang.reflect.Method.invoke(Unknown Source) ~[na:na] at org.springframework.boot.loader.MainMethodRunner.run(MainMethodRunner.java:48) [livinglibrary-0.0.1-SNAPSHOT.jar:0.0.1-SNAPSHOT] at org.springframework.boot.loader.Launcher.launch(Launcher.java:87) [livinglibrary-0.0.1-SNAPSHOT.jar:0.0.1-SNAPSHOT] at org.springframework.boot.loader.Launcher.launch(Launcher.java:50) [livinglibrary-0.0.1-SNAPSHOT.jar:0.0.1-SNAPSHOT] at org.springframework.boot.loader.JarLauncher.main(JarLauncher.java:58) [livinglibrary-0.0.1-SNAPSHOT.jar:0.0.1-SNAPSHOT] Caused by: org.springframework.beans.factory.UnsatisfiedDependencyException: Error creating bean with name 'authorizationAttributeSourceAdvisor' defined in class path resource [com/livinglibrary/config/ShiroConfig.class]: Unsatisfied dependency expressed through method 'authorizationAttributeSourceAdvisor' parameter 0; nested exception is org.springframework.beans.factory.BeanCreationException: Error creating bean with name 'securityManager' defined in class path resource [com/livinglibrary/config/ShiroConfig.class]: Bean instantiation via factory method failed; nested exception is org.springframework.beans.BeanInstantiationException: Failed to instantiate [org.apache.shiro.mgt.SecurityManager]: Factory method 'securityManager' threw exception; nested exception is org.springframework.beans.factory.BeanCreationException: Error creating bean with name 'myShiroRealm': Injection of resource dependencies failed; nested exception is org.springframework.beans.factory.BeanCreationException: Error creating bean with name 'shiroService': Injection of resource dependencies failed; nested exception is org.springframework.beans.factory.UnsatisfiedDependencyException: Error creating bean with name 'userMapper' defined in URL [jar:file:/F:/SpringBootProjects/livinglibrary/target/livinglibrary-0.0.1-SNAPSHOT.jar!/BOOT-INF/classes!/com/livinglibrary/mapper/UserMapper.class]: Unsatisfied dependency expressed through bean property 'sqlSessionFactory'; nested exception is org.springframework.beans.factory.UnsatisfiedDependencyException: Error creating bean with name 'org.mybatis.spring.boot.autoconfigure.MybatisAutoConfiguration': Unsatisfied dependency expressed through constructor parameter 0; nested exception is org.springframework.beans.factory.BeanCreationException: Error creating bean with name 'mybatis-org.mybatis.spring.boot.autoconfigure.MybatisProperties': Initialization of bean failed; nested exception is java.lang.NoClassDefFoundError: javax/xml/bind/ValidationException at org.springframework.beans.factory.support.ConstructorResolver.createArgumentArray(ConstructorResolver.java:749) ~[spring-beans-4.3.3.RELEASE.jar!/:4.3.3.RELEASE] at org.springframework.beans.factory.support.ConstructorResolver.instantiateUsingFactoryMethod(ConstructorResolver.java:467) ~[spring-beans-4.3.3.RELEASE.jar!/:4.3.3.RELEASE] at org.springframework.beans.factory.support.AbstractAutowireCapableBeanFactory.instantiateUsingFactoryMethod(AbstractAutowireCapableBeanFactory.java:1128) ~[spring-beans-4.3.3.RELEASE.jar!/:4.3.3.RELEASE] at org.springframework.beans.factory.support.AbstractAutowireCapableBeanFactory.createBeanInstance(AbstractAutowireCapableBeanFactory.java:1023) ~[spring-beans-4.3.3.RELEASE.jar!/:4.3.3.RELEASE] at org.springframework.beans.factory.support.AbstractAutowireCapableBeanFactory.doCreateBean(AbstractAutowireCapableBeanFactory.java:510) ~[spring-beans-4.3.3.RELEASE.jar!/:4.3.3.RELEASE] at org.springframework.beans.factory.support.AbstractAutowireCapableBeanFactory.createBean(AbstractAutowireCapableBeanFactory.java:482) ~[spring-beans-4.3.3.RELEASE.jar!/:4.3.3.RELEASE] at org.springframework.beans.factory.support.AbstractBeanFactory$1.getObject(AbstractBeanFactory.java:306) ~[spring-beans-4.3.3.RELEASE.jar!/:4.3.3.RELEASE] at org.springframework.beans.factory.support.DefaultSingletonBeanRegistry.getSingleton(DefaultSingletonBeanRegistry.java:230) ~[spring-beans-4.3.3.RELEASE.jar!/:4.3.3.RELEASE] at org.springframework.beans.factory.support.AbstractBeanFactory.doGetBean(AbstractBeanFactory.java:302) ~[spring-beans-4.3.3.RELEASE.jar!/:4.3.3.RELEASE] at org.springframework.beans.factory.support.AbstractBeanFactory.getBean(AbstractBeanFactory.java:202) ~[spring-beans-4.3.3.RELEASE.jar!/:4.3.3.RELEASE] at org.springframework.aop.framework.autoproxy.BeanFactoryAdvisorRetrievalHelper.findAdvisorBeans(BeanFactoryAdvisorRetrievalHelper.java:92) ~[spring-aop-4.3.3.RELEASE.jar!/:4.3.3.RELEASE] at org.springframework.aop.framework.autoproxy.AbstractAdvisorAutoProxyCreator.findCandidateAdvisors(AbstractAdvisorAutoProxyCreator.java:101) ~[spring-aop-4.3.3.RELEASE.jar!/:4.3.3.RELEASE] at org.springframework.aop.aspectj.annotation.AnnotationAwareAspectJAutoProxyCreator.findCandidateAdvisors(AnnotationAwareAspectJAutoProxyCreator.java:85) ~[spring-aop-4.3.3.RELEASE.jar!/:4.3.3.RELEASE] at org.springframework.aop.aspectj.autoproxy.AspectJAwareAdvisorAutoProxyCreator.shouldSkip(AspectJAwareAdvisorAutoProxyCreator.java:103) ~[spring-aop-4.3.3.RELEASE.jar!/:4.3.3.RELEASE] at org.springframework.aop.framework.autoproxy.AbstractAutoProxyCreator.postProcessBeforeInstantiation(AbstractAutoProxyCreator.java:249) ~[spring-aop-4.3.3.RELEASE.jar!/:4.3.3.RELEASE] at org.springframework.beans.factory.support.AbstractAutowireCapableBeanFactory.applyBeanPostProcessorsBeforeInstantiation(AbstractAutowireCapableBeanFactory.java:993) ~[spring-beans-4.3.3.RELEASE.jar!/:4.3.3.RELEASE] at org.springframework.beans.factory.support.AbstractAutowireCapableBeanFactory.resolveBeforeInstantiation(AbstractAutowireCapableBeanFactory.java:964) ~[spring-beans-4.3.3.RELEASE.jar!/:4.3.3.RELEASE] at org.springframework.beans.factory.support.AbstractAutowireCapableBeanFactory.createBean(AbstractAutowireCapableBeanFactory.java:472) ~[spring-beans-4.3.3.RELEASE.jar!/:4.3.3.RELEASE] ... 22 common frames omitted Caused by: org.springframework.beans.factory.BeanCreationException: Error creating bean with name 'securityManager' defined in class path resource [com/livinglibrary/config/ShiroConfig.class]: Bean instantiation via factory method failed; nested exception is org.springframework.beans.BeanInstantiationException: Failed to instantiate [org.apache.shiro.mgt.SecurityManager]: Factory method 'securityManager' threw exception; nested exception is org.springframework.beans.factory.BeanCreationException: Error creating bean with name 'myShiroRealm': Injection of resource dependencies failed; nested exception is org.springframework.beans.factory.BeanCreationException: Error creating bean with name 'shiroService': Injection of resource dependencies failed; nested exception is org.springframework.beans.factory.UnsatisfiedDependencyException: Error creating bean with name 'userMapper' defined in URL [jar:file:/F:/SpringBootProjects/livinglibrary/target/livinglibrary-0.0.1-SNAPSHOT.jar!/BOOT-INF/classes!/com/livinglibrary/mapper/UserMapper.class]: Unsatisfied dependency expressed through bean property 'sqlSessionFactory'; nested exception is org.springframework.beans.factory.UnsatisfiedDependencyException: Error creating bean with name 'org.mybatis.spring.boot.autoconfigure.MybatisAutoConfiguration': Unsatisfied dependency expressed through constructor parameter 0; nested exception is org.springframework.beans.factory.BeanCreationException: Error creating bean with name 'mybatis-org.mybatis.spring.boot.autoconfigure.MybatisProperties': Initialization of bean failed; nested exception is java.lang.NoClassDefFoundError: javax/xml/bind/ValidationException at org.springframework.beans.factory.support.ConstructorResolver.instantiateUsingFactoryMethod(ConstructorResolver.java:599) ~[spring-beans-4.3.3.RELEASE.jar!/:4.3.3.RELEASE] at org.springframework.beans.factory.support.AbstractAutowireCapableBeanFactory.instantiateUsingFactoryMethod(AbstractAutowireCapableBeanFactory.java:1128) ~[spring-beans-4.3.3.RELEASE.jar!/:4.3.3.RELEASE] at org.springframework.beans.factory.support.AbstractAutowireCapableBeanFactory.createBeanInstance(AbstractAutowireCapableBeanFactory.java:1023) ~[spring-beans-4.3.3.RELEASE.jar!/:4.3.3.RELEASE] at org.springframework.beans.factory.support.AbstractAutowireCapableBeanFactory.doCreateBean(AbstractAutowireCapableBeanFactory.java:510) ~[spring-beans-4.3.3.RELEASE.jar!/:4.3.3.RELEASE] at org.springframework.beans.factory.support.AbstractAutowireCapableBeanFactory.createBean(AbstractAutowireCapableBeanFactory.java:482) ~[spring-beans-4.3.3.RELEASE.jar!/:4.3.3.RELEASE] at org.springframework.beans.factory.support.AbstractBeanFactory$1.getObject(AbstractBeanFactory.java:306) ~[spring-beans-4.3.3.RELEASE.jar!/:4.3.3.RELEASE] at org.springframework.beans.factory.support.DefaultSingletonBeanRegistry.getSingleton(DefaultSingletonBeanRegistry.java:230) ~[spring-beans-4.3.3.RELEASE.jar!/:4.3.3.RELEASE] at org.springframework.beans.factory.support.AbstractBeanFactory.doGetBean(AbstractBeanFactory.java:302) ~[spring-beans-4.3.3.RELEASE.jar!/:4.3.3.RELEASE] at org.springframework.beans.factory.support.AbstractBeanFactory.getBean(AbstractBeanFactory.java:202) ~[spring-beans-4.3.3.RELEASE.jar!/:4.3.3.RELEASE] at org.springframework.beans.factory.config.DependencyDescriptor.resolveCandidate(DependencyDescriptor.java:207) ~[spring-beans-4.3.3.RELEASE.jar!/:4.3.3.RELEASE] at org.springframework.beans.factory.support.DefaultListableBeanFactory.doResolveDependency(DefaultListableBeanFactory.java:1128) ~[spring-beans-4.3.3.RELEASE.jar!/:4.3.3.RELEASE] at org.springframework.beans.factory.support.DefaultListableBeanFactory.resolveDependency(DefaultListableBeanFactory.java:1056) ~[spring-beans-4.3.3.RELEASE.jar!/:4.3.3.RELEASE] at org.springframework.beans.factory.support.ConstructorResolver.resolveAutowiredArgument(ConstructorResolver.java:835) ~[spring-beans-4.3.3.RELEASE.jar!/:4.3.3.RELEASE] at org.springframework.beans.factory.support.ConstructorResolver.createArgumentArray(ConstructorResolver.java:741) ~[spring-beans-4.3.3.RELEASE.jar!/:4.3.3.RELEASE] ... 39 common frames omitted Caused by: org.springframework.beans.BeanInstantiationException: Failed to instantiate [org.apache.shiro.mgt.SecurityManager]: Factory method 'securityManager' threw exception; nested exception is org.springframework.beans.factory.BeanCreationException: Error creating bean with name 'myShiroRealm': Injection of resource dependencies failed; nested exception is org.springframework.beans.factory.BeanCreationException: Error creating bean with name 'shiroService': Injection of resource dependencies failed; nested exception is org.springframework.beans.factory.UnsatisfiedDependencyException: Error creating bean with name 'userMapper' defined in URL [jar:file:/F:/SpringBootProjects/livinglibrary/target/livinglibrary-0.0.1-SNAPSHOT.jar!/BOOT-INF/classes!/com/livinglibrary/mapper/UserMapper.class]: Unsatisfied dependency expressed through bean property 'sqlSessionFactory'; nested exception is org.springframework.beans.factory.UnsatisfiedDependencyException: Error creating bean with name 'org.mybatis.spring.boot.autoconfigure.MybatisAutoConfiguration': Unsatisfied dependency expressed through constructor parameter 0; nested exception is org.springframework.beans.factory.BeanCreationException: Error creating bean with name 'mybatis-org.mybatis.spring.boot.autoconfigure.MybatisProperties': Initialization of bean failed; nested exception is java.lang.NoClassDefFoundError: javax/xml/bind/ValidationException at org.springframework.beans.factory.support.SimpleInstantiationStrategy.instantiate(SimpleInstantiationStrategy.java:189) ~[spring-beans-4.3.3.RELEASE.jar!/:4.3.3.RELEASE] at org.springframework.beans.factory.support.ConstructorResolver.instantiateUsingFactoryMethod(ConstructorResolver.java:588) ~[spring-beans-4.3.3.RELEASE.jar!/:4.3.3.RELEASE] ... 52 common frames omitted Caused by: org.springframework.beans.factory.BeanCreationException: Error creating bean with name 'myShiroRealm': Injection of resource dependencies failed; nested exception is org.springframework.beans.factory.BeanCreationException: Error creating bean with name 'shiroService': Injection of resource dependencies failed; nested exception is org.springframework.beans.factory.UnsatisfiedDependencyException: Error creating bean with name 'userMapper' defined in URL [jar:file:/F:/SpringBootProjects/livinglibrary/target/livinglibrary-0.0.1-SNAPSHOT.jar!/BOOT-INF/classes!/com/livinglibrary/mapper/UserMapper.class]: Unsatisfied dependency expressed through bean property 'sqlSessionFactory'; nested exception is org.springframework.beans.factory.UnsatisfiedDependencyException: Error creating bean with name 'org.mybatis.spring.boot.autoconfigure.MybatisAutoConfiguration': Unsatisfied dependency expressed through constructor parameter 0; nested exception is org.springframework.beans.factory.BeanCreationException: Error creating bean with name 'mybatis-org.mybatis.spring.boot.autoconfigure.MybatisProperties': Initialization of bean failed; nested exception is java.lang.NoClassDefFoundError: javax/xml/bind/ValidationException at org.springframework.context.annotation.CommonAnnotationBeanPostProcessor.postProcessPropertyValues(CommonAnnotationBeanPostProcessor.java:321) ~[spring-context-4.3.3.RELEASE.jar!/:4.3.3.RELEASE] at org.springframework.beans.factory.support.AbstractAutowireCapableBeanFactory.populateBean(AbstractAutowireCapableBeanFactory.java:1219) ~[spring-beans-4.3.3.RELEASE.jar!/:4.3.3.RELEASE] at org.springframework.beans.factory.support.AbstractAutowireCapableBeanFactory.doCreateBean(AbstractAutowireCapableBeanFactory.java:543) ~[spring-beans-4.3.3.RELEASE.jar!/:4.3.3.RELEASE] at org.springframework.beans.factory.support.AbstractAutowireCapableBeanFactory.createBean(AbstractAutowireCapableBeanFactory.java:482) ~[spring-beans-4.3.3.RELEASE.jar!/:4.3.3.RELEASE] at org.springframework.beans.factory.support.AbstractBeanFactory$1.getObject(AbstractBeanFactory.java:306) ~[spring-beans-4.3.3.RELEASE.jar!/:4.3.3.RELEASE] at org.springframework.beans.factory.support.DefaultSingletonBeanRegistry.getSingleton(DefaultSingletonBeanRegistry.java:230) ~[spring-beans-4.3.3.RELEASE.jar!/:4.3.3.RELEASE] at org.springframework.beans.factory.support.AbstractBeanFactory.doGetBean(AbstractBeanFactory.java:302) ~[spring-beans-4.3.3.RELEASE.jar!/:4.3.3.RELEASE] at org.springframework.beans.factory.support.AbstractBeanFactory.getBean(AbstractBeanFactory.java:197) ~[spring-beans-4.3.3.RELEASE.jar!/:4.3.3.RELEASE] at org.springframework.context.annotation.ConfigurationClassEnhancer$BeanMethodInterceptor.intercept(ConfigurationClassEnhancer.java:381) ~[spring-context-4.3.3.RELEASE.jar!/:4.3.3.RELEASE] at com.livinglibrary.config.ShiroConfig$$EnhancerBySpringCGLIB$$6346f6e4.myShiroRealm(<generated>) ~[classes!/:0.0.1-SNAPSHOT] at com.livinglibrary.config.ShiroConfig.securityManager(ShiroConfig.java:89) ~[classes!/:0.0.1-SNAPSHOT] at com.livinglibrary.config.ShiroConfig$$EnhancerBySpringCGLIB$$6346f6e4.CGLIB$securityManager$0(<generated>) ~[classes!/:0.0.1-SNAPSHOT] at com.livinglibrary.config.ShiroConfig$$EnhancerBySpringCGLIB$$6346f6e4$$FastClassBySpringCGLIB$$5d683da7.invoke(<generated>) ~[classes!/:0.0.1-SNAPSHOT] at org.springframework.cglib.proxy.MethodProxy.invokeSuper(MethodProxy.java:228) ~[spring-core-4.3.3.RELEASE.jar!/:4.3.3.RELEASE] at org.springframework.context.annotation.ConfigurationClassEnhancer$BeanMethodInterceptor.intercept(ConfigurationClassEnhancer.java:356) ~[spring-context-4.3.3.RELEASE.jar!/:4.3.3.RELEASE] at com.livinglibrary.config.ShiroConfig$$EnhancerBySpringCGLIB$$6346f6e4.securityManager(<generated>) ~[classes!/:0.0.1-SNAPSHOT] at java.base/jdk.internal.reflect.NativeMethodAccessorImpl.invoke0(Native Method) ~[na:na] at java.base/jdk.internal.reflect.NativeMethodAccessorImpl.invoke(Unknown Source) ~[na:na] at java.base/jdk.internal.reflect.DelegatingMethodAccessorImpl.invoke(Unknown Source) ~[na:na] at java.base/java.lang.reflect.Method.invoke(Unknown Source) ~[na:na] at org.springframework.beans.factory.support.SimpleInstantiationStrategy.instantiate(SimpleInstantiationStrategy.java:162) ~[spring-beans-4.3.3.RELEASE.jar!/:4.3.3.RELEASE] ... 53 common frames omitted Caused by: org.springframework.beans.factory.BeanCreationException: Error creating bean with name 'shiroService': Injection of resource dependencies failed; nested exception is org.springframework.beans.factory.UnsatisfiedDependencyException: Error creating bean with name 'userMapper' defined in URL [jar:file:/F:/SpringBootProjects/livinglibrary/target/livinglibrary-0.0.1-SNAPSHOT.jar!/BOOT-INF/classes!/com/livinglibrary/mapper/UserMapper.class]: Unsatisfied dependency expressed through bean property 'sqlSessionFactory'; nested exception is org.springframework.beans.factory.UnsatisfiedDependencyException: Error creating bean with name 'org.mybatis.spring.boot.autoconfigure.MybatisAutoConfiguration': Unsatisfied dependency expressed through constructor parameter 0; nested exception is org.springframework.beans.factory.BeanCreationException: Error creating bean with name 'mybatis-org.mybatis.spring.boot.autoconfigure.MybatisProperties': Initialization of bean failed; nested exception is java.lang.NoClassDefFoundError: javax/xml/bind/ValidationException at org.springframework.context.annotation.CommonAnnotationBeanPostProcessor.postProcessPropertyValues(CommonAnnotationBeanPostProcessor.java:321) ~[spring-context-4.3.3.RELEASE.jar!/:4.3.3.RELEASE] at org.springframework.beans.factory.support.AbstractAutowireCapableBeanFactory.populateBean(AbstractAutowireCapableBeanFactory.java:1219) ~[spring-beans-4.3.3.RELEASE.jar!/:4.3.3.RELEASE] at org.springframework.beans.factory.support.AbstractAutowireCapableBeanFactory.doCreateBean(AbstractAutowireCapableBeanFactory.java:543) ~[spring-beans-4.3.3.RELEASE.jar!/:4.3.3.RELEASE] at org.springframework.beans.factory.support.AbstractAutowireCapableBeanFactory.createBean(AbstractAutowireCapableBeanFactory.java:482) ~[spring-beans-4.3.3.RELEASE.jar!/:4.3.3.RELEASE] at org.springframework.beans.factory.support.AbstractBeanFactory$1.getObject(AbstractBeanFactory.java:306) ~[spring-beans-4.3.3.RELEASE.jar!/:4.3.3.RELEASE] at org.springframework.beans.factory.support.DefaultSingletonBeanRegistry.getSingleton(DefaultSingletonBeanRegistry.java:230) ~[spring-beans-4.3.3.RELEASE.jar!/:4.3.3.RELEASE] at org.springframework.beans.factory.support.AbstractBeanFactory.doGetBean(AbstractBeanFactory.java:302) ~[spring-beans-4.3.3.RELEASE.jar!/:4.3.3.RELEASE] at org.springframework.beans.factory.support.AbstractBeanFactory.getBean(AbstractBeanFactory.java:202) ~[spring-beans-4.3.3.RELEASE.jar!/:4.3.3.RELEASE] at org.springframework.context.annotation.CommonAnnotationBeanPostProcessor.autowireResource(CommonAnnotationBeanPostProcessor.java:522) ~[spring-context-4.3.3.RELEASE.jar!/:4.3.3.RELEASE] at org.springframework.context.annotation.CommonAnnotationBeanPostProcessor.getResource(CommonAnnotationBeanPostProcessor.java:496) ~[spring-context-4.3.3.RELEASE.jar!/:4.3.3.RELEASE] at org.springframework.context.annotation.CommonAnnotationBeanPostProcessor$ResourceElement.getResourceToInject(CommonAnnotationBeanPostProcessor.java:627) ~[spring-context-4.3.3.RELEASE.jar!/:4.3.3.RELEASE] at org.springframework.beans.factory.annotation.InjectionMetadata$InjectedElement.inject(InjectionMetadata.java:169) ~[spring-beans-4.3.3.RELEASE.jar!/:4.3.3.RELEASE] at org.springframework.beans.factory.annotation.InjectionMetadata.inject(InjectionMetadata.java:88) ~[spring-beans-4.3.3.RELEASE.jar!/:4.3.3.RELEASE] at org.springframework.context.annotation.CommonAnnotationBeanPostProcessor.postProcessPropertyValues(CommonAnnotationBeanPostProcessor.java:318) ~[spring-context-4.3.3.RELEASE.jar!/:4.3.3.RELEASE] ... 73 common frames omitted Caused by: org.springframework.beans.factory.UnsatisfiedDependencyException: Error creating bean with name 'userMapper' defined in URL [jar:file:/F:/SpringBootProjects/livinglibrary/target/livinglibrary-0.0.1-SNAPSHOT.jar!/BOOT-INF/classes!/com/livinglibrary/mapper/UserMapper.class]: Unsatisfied dependency expressed through bean property 'sqlSessionFactory'; nested exception is org.springframework.beans.factory.UnsatisfiedDependencyException: Error creating bean with name 'org.mybatis.spring.boot.autoconfigure.MybatisAutoConfiguration': Unsatisfied dependency expressed through constructor parameter 0; nested exception is org.springframework.beans.factory.BeanCreationException: Error creating bean with name 'mybatis-org.mybatis.spring.boot.autoconfigure.MybatisProperties': Initialization of bean failed; nested exception is java.lang.NoClassDefFoundError: javax/xml/bind/ValidationException at org.springframework.beans.factory.support.AbstractAutowireCapableBeanFactory.autowireByType(AbstractAutowireCapableBeanFactory.java:1312) ~[spring-beans-4.3.3.RELEASE.jar!/:4.3.3.RELEASE] at org.springframework.beans.factory.support.AbstractAutowireCapableBeanFactory.populateBean(AbstractAutowireCapableBeanFactory.java:1204) ~[spring-beans-4.3.3.RELEASE.jar!/:4.3.3.RELEASE] at org.springframework.beans.factory.support.AbstractAutowireCapableBeanFactory.doCreateBean(AbstractAutowireCapableBeanFactory.java:543) ~[spring-beans-4.3.3.RELEASE.jar!/:4.3.3.RELEASE] at org.springframework.beans.factory.support.AbstractAutowireCapableBeanFactory.createBean(AbstractAutowireCapableBeanFactory.java:482) ~[spring-beans-4.3.3.RELEASE.jar!/:4.3.3.RELEASE] at org.springframework.beans.factory.support.AbstractBeanFactory$1.getObject(AbstractBeanFactory.java:306) ~[spring-beans-4.3.3.RELEASE.jar!/:4.3.3.RELEASE] at org.springframework.beans.factory.support.DefaultSingletonBeanRegistry.getSingleton(DefaultSingletonBeanRegistry.java:230) ~[spring-beans-4.3.3.RELEASE.jar!/:4.3.3.RELEASE] at org.springframework.beans.factory.support.AbstractBeanFactory.doGetBean(AbstractBeanFactory.java:302) ~[spring-beans-4.3.3.RELEASE.jar!/:4.3.3.RELEASE] at org.springframework.beans.factory.support.AbstractBeanFactory.getBean(AbstractBeanFactory.java:202) ~[spring-beans-4.3.3.RELEASE.jar!/:4.3.3.RELEASE] at org.springframework.context.annotation.CommonAnnotationBeanPostProcessor.autowireResource(CommonAnnotationBeanPostProcessor.java:522) ~[spring-context-4.3.3.RELEASE.jar!/:4.3.3.RELEASE] at org.springframework.context.annotation.CommonAnnotationBeanPostProcessor.getResource(CommonAnnotationBeanPostProcessor.java:496) ~[spring-context-4.3.3.RELEASE.jar!/:4.3.3.RELEASE] at org.springframework.context.annotation.CommonAnnotationBeanPostProcessor$ResourceElement.getResourceToInject(CommonAnnotationBeanPostProcessor.java:627) ~[spring-context-4.3.3.RELEASE.jar!/:4.3.3.RELEASE] at org.springframework.beans.factory.annotation.InjectionMetadata$InjectedElement.inject(InjectionMetadata.java:169) ~[spring-beans-4.3.3.RELEASE.jar!/:4.3.3.RELEASE] at org.springframework.beans.factory.annotation.InjectionMetadata.inject(InjectionMetadata.java:88) ~[spring-beans-4.3.3.RELEASE.jar!/:4.3.3.RELEASE] at org.springframework.context.annotation.CommonAnnotationBeanPostProcessor.postProcessPropertyValues(CommonAnnotationBeanPostProcessor.java:318) ~[spring-context-4.3.3.RELEASE.jar!/:4.3.3.RELEASE] ... 86 common frames omitted Caused by: org.springframework.beans.factory.UnsatisfiedDependencyException: Error creating bean with name 'org.mybatis.spring.boot.autoconfigure.MybatisAutoConfiguration': Unsatisfied dependency expressed through constructor parameter 0; nested exception is org.springframework.beans.factory.BeanCreationException: Error creating bean with name 'mybatis-org.mybatis.spring.boot.autoconfigure.MybatisProperties': Initialization of bean failed; nested exception is java.lang.NoClassDefFoundError: javax/xml/bind/ValidationException at org.springframework.beans.factory.support.ConstructorResolver.createArgumentArray(ConstructorResolver.java:749) ~[spring-beans-4.3.3.RELEASE.jar!/:4.3.3.RELEASE] at org.springframework.beans.factory.support.ConstructorResolver.autowireConstructor(ConstructorResolver.java:189) ~[spring-beans-4.3.3.RELEASE.jar!/:4.3.3.RELEASE] at org.springframework.beans.factory.support.AbstractAutowireCapableBeanFactory.autowireConstructor(AbstractAutowireCapableBeanFactory.java:1148) ~[spring-beans-4.3.3.RELEASE.jar!/:4.3.3.RELEASE] at org.springframework.beans.factory.support.AbstractAutowireCapableBeanFactory.createBeanInstance(AbstractAutowireCapableBeanFactory.java:1051) ~[spring-beans-4.3.3.RELEASE.jar!/:4.3.3.RELEASE] at org.springframework.beans.factory.support.AbstractAutowireCapableBeanFactory.doCreateBean(AbstractAutowireCapableBeanFactory.java:510) ~[spring-beans-4.3.3.RELEASE.jar!/:4.3.3.RELEASE] at org.springframework.beans.factory.support.AbstractAutowireCapableBeanFactory.createBean(AbstractAutowireCapableBeanFactory.java:482) ~[spring-beans-4.3.3.RELEASE.jar!/:4.3.3.RELEASE] at org.springframework.beans.factory.support.AbstractBeanFactory$1.getObject(AbstractBeanFactory.java:306) ~[spring-beans-4.3.3.RELEASE.jar!/:4.3.3.RELEASE] at org.springframework.beans.factory.support.DefaultSingletonBeanRegistry.getSingleton(DefaultSingletonBeanRegistry.java:230) ~[spring-beans-4.3.3.RELEASE.jar!/:4.3.3.RELEASE] at org.springframework.beans.factory.support.AbstractBeanFactory.doGetBean(AbstractBeanFactory.java:302) ~[spring-beans-4.3.3.RELEASE.jar!/:4.3.3.RELEASE] at org.springframework.beans.factory.support.AbstractBeanFactory.getBean(AbstractBeanFactory.java:197) ~[spring-beans-4.3.3.RELEASE.jar!/:4.3.3.RELEASE] at org.springframework.beans.factory.support.ConstructorResolver.instantiateUsingFactoryMethod(ConstructorResolver.java:372) ~[spring-beans-4.3.3.RELEASE.jar!/:4.3.3.RELEASE] at org.springframework.beans.factory.support.AbstractAutowireCapableBeanFactory.instantiateUsingFactoryMethod(AbstractAutowireCapableBeanFactory.java:1128) ~[spring-beans-4.3.3.RELEASE.jar!/:4.3.3.RELEASE] at org.springframework.beans.factory.support.AbstractAutowireCapableBeanFactory.createBeanInstance(AbstractAutowireCapableBeanFactory.java:1023) ~[spring-beans-4.3.3.RELEASE.jar!/:4.3.3.RELEASE] at org.springframework.beans.factory.support.AbstractAutowireCapableBeanFactory.doCreateBean(AbstractAutowireCapableBeanFactory.java:510) ~[spring-beans-4.3.3.RELEASE.jar!/:4.3.3.RELEASE] at org.springframework.beans.factory.support.AbstractAutowireCapableBeanFactory.createBean(AbstractAutowireCapableBeanFactory.java:482) ~[spring-beans-4.3.3.RELEASE.jar!/:4.3.3.RELEASE] at org.springframework.beans.factory.support.AbstractBeanFactory$1.getObject(AbstractBeanFactory.java:306) ~[spring-beans-4.3.3.RELEASE.jar!/:4.3.3.RELEASE] at org.springframework.beans.factory.support.DefaultSingletonBeanRegistry.getSingleton(DefaultSingletonBeanRegistry.java:230) ~[spring-beans-4.3.3.RELEASE.jar!/:4.3.3.RELEASE] at org.springframework.beans.factory.support.AbstractBeanFactory.doGetBean(AbstractBeanFactory.java:302) ~[spring-beans-4.3.3.RELEASE.jar!/:4.3.3.RELEASE] at org.springframework.beans.factory.support.AbstractBeanFactory.getBean(AbstractBeanFactory.java:202) ~[spring-beans-4.3.3.RELEASE.jar!/:4.3.3.RELEASE] at org.springframework.beans.factory.config.DependencyDescriptor.resolveCandidate(DependencyDescriptor.java:207) ~[spring-beans-4.3.3.RELEASE.jar!/:4.3.3.RELEASE] at org.springframework.beans.factory.support.DefaultListableBeanFactory.doResolveDependency(DefaultListableBeanFactory.java:1128) ~[spring-beans-4.3.3.RELEASE.jar!/:4.3.3.RELEASE] at org.springframework.beans.factory.support.DefaultListableBeanFactory.resolveDependency(DefaultListableBeanFactory.java:1056) ~[spring-beans-4.3.3.RELEASE.jar!/:4.3.3.RELEASE] at org.springframework.beans.factory.support.AbstractAutowireCapableBeanFactory.autowireByType(AbstractAutowireCapableBeanFactory.java:1297) ~[spring-beans-4.3.3.RELEASE.jar!/:4.3.3.RELEASE] ... 99 common frames omitted Caused by: org.springframework.beans.factory.BeanCreationException: Error creating bean with name 'mybatis-org.mybatis.spring.boot.autoconfigure.MybatisProperties': Initialization of bean failed; nested exception is java.lang.NoClassDefFoundError: javax/xml/bind/ValidationException at org.springframework.beans.factory.support.AbstractAutowireCapableBeanFactory.doCreateBean(AbstractAutowireCapableBeanFactory.java:553) ~[spring-beans-4.3.3.RELEASE.jar!/:4.3.3.RELEASE] at org.springframework.beans.factory.support.AbstractAutowireCapableBeanFactory.createBean(AbstractAutowireCapableBeanFactory.java:482) ~[spring-beans-4.3.3.RELEASE.jar!/:4.3.3.RELEASE] at org.springframework.beans.factory.support.AbstractBeanFactory$1.getObject(AbstractBeanFactory.java:306) ~[spring-beans-4.3.3.RELEASE.jar!/:4.3.3.RELEASE] at org.springframework.beans.factory.support.DefaultSingletonBeanRegistry.getSingleton(DefaultSingletonBeanRegistry.java:230) ~[spring-beans-4.3.3.RELEASE.jar!/:4.3.3.RELEASE] at org.springframework.beans.factory.support.AbstractBeanFactory.doGetBean(AbstractBeanFactory.java:302) ~[spring-beans-4.3.3.RELEASE.jar!/:4.3.3.RELEASE] at org.springframework.beans.factory.support.AbstractBeanFactory.getBean(AbstractBeanFactory.java:202) ~[spring-beans-4.3.3.RELEASE.jar!/:4.3.3.RELEASE] at org.springframework.beans.factory.config.DependencyDescriptor.resolveCandidate(DependencyDescriptor.java:207) ~[spring-beans-4.3.3.RELEASE.jar!/:4.3.3.RELEASE] at org.springframework.beans.factory.support.DefaultListableBeanFactory.doResolveDependency(DefaultListableBeanFactory.java:1128) ~[spring-beans-4.3.3.RELEASE.jar!/:4.3.3.RELEASE] at org.springframework.beans.factory.support.DefaultListableBeanFactory.resolveDependency(DefaultListableBeanFactory.java:1056) ~[spring-beans-4.3.3.RELEASE.jar!/:4.3.3.RELEASE] at org.springframework.beans.factory.support.ConstructorResolver.resolveAutowiredArgument(ConstructorResolver.java:835) ~[spring-beans-4.3.3.RELEASE.jar!/:4.3.3.RELEASE] at org.springframework.beans.factory.support.ConstructorResolver.createArgumentArray(ConstructorResolver.java:741) ~[spring-beans-4.3.3.RELEASE.jar!/:4.3.3.RELEASE] ... 121 common frames omitted Caused by: java.lang.NoClassDefFoundError: javax/xml/bind/ValidationException at org.hibernate.validator.internal.engine.ConfigurationImpl.<init>(ConfigurationImpl.java:129) ~[hibernate-validator-5.2.4.Final.jar!/:5.2.4.Final] at org.hibernate.validator.internal.engine.ConfigurationImpl.<init>(ConfigurationImpl.java:96) ~[hibernate-validator-5.2.4.Final.jar!/:5.2.4.Final] at org.hibernate.validator.HibernateValidator.createGenericConfiguration(HibernateValidator.java:31) ~[hibernate-validator-5.2.4.Final.jar!/:5.2.4.Final] at javax.validation.Validation$GenericBootstrapImpl.configure(Validation.java:276) ~[validation-api-1.1.0.Final.jar!/:na] at org.springframework.validation.beanvalidation.LocalValidatorFactoryBean.afterPropertiesSet(LocalValidatorFactoryBean.java:248) ~[spring-context-4.3.3.RELEASE.jar!/:4.3.3.RELEASE] at org.springframework.boot.context.properties.ConfigurationPropertiesBindingPostProcessor$LocalValidatorFactory.run(ConfigurationPropertiesBindingPostProcessor.java:452) ~[spring-boot-1.4.1.RELEASE.jar!/:1.4.1.RELEASE] at org.springframework.boot.context.properties.ConfigurationPropertiesBindingPostProcessor.getValidator(ConfigurationPropertiesBindingPostProcessor.java:386) ~[spring-boot-1.4.1.RELEASE.jar!/:1.4.1.RELEASE] at org.springframework.boot.context.properties.ConfigurationPropertiesBindingPostProcessor.determineValidator(ConfigurationPropertiesBindingPostProcessor.java:369) ~[spring-boot-1.4.1.RELEASE.jar!/:1.4.1.RELEASE] at org.springframework.boot.context.properties.ConfigurationPropertiesBindingPostProcessor.postProcessBeforeInitialization(ConfigurationPropertiesBindingPostProcessor.java:331) ~[spring-boot-1.4.1.RELEASE.jar!/:1.4.1.RELEASE] at org.springframework.boot.context.properties.ConfigurationPropertiesBindingPostProcessor.postProcessBeforeInitialization(ConfigurationPropertiesBindingPostProcessor.java:302) ~[spring-boot-1.4.1.RELEASE.jar!/:1.4.1.RELEASE] at org.springframework.beans.factory.support.AbstractAutowireCapableBeanFactory.applyBeanPostProcessorsBeforeInitialization(AbstractAutowireCapableBeanFactory.java:408) ~[spring-beans-4.3.3.RELEASE.jar!/:4.3.3.RELEASE] at org.springframework.beans.factory.support.AbstractAutowireCapableBeanFactory.initializeBean(AbstractAutowireCapableBeanFactory.java:1575) ~[spring-beans-4.3.3.RELEASE.jar!/:4.3.3.RELEASE] at org.springframework.beans.factory.support.AbstractAutowireCapableBeanFactory.doCreateBean(AbstractAutowireCapableBeanFactory.java:545) ~[spring-beans-4.3.3.RELEASE.jar!/:4.3.3.RELEASE] ... 131 common frames omitted Caused by: java.lang.ClassNotFoundException: javax.xml.bind.ValidationException at java.base/java.net.URLClassLoader.findClass(Unknown Source) ~[na:na] at java.base/java.lang.ClassLoader.loadClass(Unknown Source) ~[na:na] at org.springframework.boot.loader.LaunchedURLClassLoader.loadClass(LaunchedURLClassLoader.java:89) ~[livinglibrary-0.0.1-SNAPSHOT.jar:0.0.1-SNAPSHOT] at java.base/java.lang.ClassLoader.loadClass(Unknown Source) ~[na:na] ... 144 common frames omitted ``` 困扰了好几天了,这几天急着要,求救!!!
eclipse 4.5.2安装STS想用spring boot,过程显示成功却找不到spring boot,求解惑
如题如图,我的是e4.5.2 ![图片说明](https://img-ask.csdn.net/upload/201912/30/1577709816_444690.png) Java版本1.8 ![图片说明](https://img-ask.csdn.net/upload/201912/30/1577709882_329709.png) 一开始是打算在Eclipse Marketplace上下载STS,可是居然找不到 ![图片说明](https://img-ask.csdn.net/upload/201912/30/1577710005_823329.png) 没办法,只能下载资源包,本地安装,看了攻略,我下的是: springsource-tool-suite-3.7.3.RELEASE-e4.5.2-updatesite.zip 然后就Help --> Install New Software,填入自定名字和包位置 --> OK ![图片说明](https://img-ask.csdn.net/upload/201912/30/1577710222_416913.png) 又点击Available Software Site --> 去掉所有http的打勾项,只留下sts(jar)--> OK ![图片说明](https://img-ask.csdn.net/upload/201912/30/1577710536_847507.png) 主选项页面只勾选IDE结尾的 ![图片说明](https://img-ask.csdn.net/upload/201912/30/1577710696_543382.png) 而后一路next ![图片说明](https://img-ask.csdn.net/upload/201912/30/1577710797_896059.png) ![图片说明](https://img-ask.csdn.net/upload/201912/30/1577710807_458473.png) ![图片说明](https://img-ask.csdn.net/upload/201912/30/1577710823_769628.png) ![图片说明](https://img-ask.csdn.net/upload/201912/30/1577710836_143795.png) ![图片说明](https://img-ask.csdn.net/upload/201912/30/1577710875_962257.png) 发现File --> New --> Other找不到spring和spring boot选项 ![图片说明](https://img-ask.csdn.net/upload/201912/30/1577710975_99435.png) preference里头也没有spring和spring boot选项 ![图片说明](https://img-ask.csdn.net/upload/201912/30/1577711049_522090.png) 该怎么做,求解
SpringBoot中@Autowired注入bean失败:Error creating bean with name“XXXController”?
# 报错信息: ``` org.springframework.beans.factory.UnsatisfiedDependencyException: Error creating bean with name 'authorizeController': Unsatisfied dependency expressed through field 'userMapper'; nested exception is org.springframework.beans.factory.BeanCreationException: Error creating bean with name 'userMapper' defined in file [E:\STS-WorkSpace\Forum\target\classes\com\Forum\mapper\UserMapper.class]: Invocation of init method failed; nested exception is java.lang.IllegalArgumentException: Property 'sqlSessionFactory' or 'sqlSessionTemplate' are required at org.springframework.beans.factory.annotation.AutowiredAnnotationBeanPostProcessor$AutowiredFieldElement.inject(AutowiredAnnotationBeanPostProcessor.java:643) ~[spring-beans-5.2.2.RELEASE.jar:5.2.2.RELEASE] at org.springframework.beans.factory.annotation.InjectionMetadata.inject(InjectionMetadata.java:116) ~[spring-beans-5.2.2.RELEASE.jar:5.2.2.RELEASE] at org.springframework.beans.factory.annotation.AutowiredAnnotationBeanPostProcessor.postProcessProperties(AutowiredAnnotationBeanPostProcessor.java:399) ~[spring-beans-5.2.2.RELEASE.jar:5.2.2.RELEASE] at org.springframework.beans.factory.support.AbstractAutowireCapableBeanFactory.populateBean(AbstractAutowireCapableBeanFactory.java:1422) ~[spring-beans-5.2.2.RELEASE.jar:5.2.2.RELEASE] at org.springframework.beans.factory.support.AbstractAutowireCapableBeanFactory.doCreateBean(AbstractAutowireCapableBeanFactory.java:594) ~[spring-beans-5.2.2.RELEASE.jar:5.2.2.RELEASE] at org.springframework.beans.factory.support.AbstractAutowireCapableBeanFactory.createBean(AbstractAutowireCapableBeanFactory.java:517) ~[spring-beans-5.2.2.RELEASE.jar:5.2.2.RELEASE] at org.springframework.beans.factory.support.AbstractBeanFactory.lambda$doGetBean$0(AbstractBeanFactory.java:323) ~[spring-beans-5.2.2.RELEASE.jar:5.2.2.RELEASE] at org.springframework.beans.factory.support.AbstractBeanFactory$$Lambda$141/1866850137.getObject(Unknown Source) ~[na:na] at org.springframework.beans.factory.support.DefaultSingletonBeanRegistry.getSingleton(DefaultSingletonBeanRegistry.java:222) ~[spring-beans-5.2.2.RELEASE.jar:5.2.2.RELEASE] at org.springframework.beans.factory.support.AbstractBeanFactory.doGetBean(AbstractBeanFactory.java:321) ~[spring-beans-5.2.2.RELEASE.jar:5.2.2.RELEASE] at org.springframework.beans.factory.support.AbstractBeanFactory.getBean(AbstractBeanFactory.java:202) ~[spring-beans-5.2.2.RELEASE.jar:5.2.2.RELEASE] at org.springframework.beans.factory.support.DefaultListableBeanFactory.preInstantiateSingletons(DefaultListableBeanFactory.java:879) ~[spring-beans-5.2.2.RELEASE.jar:5.2.2.RELEASE] at org.springframework.context.support.AbstractApplicationContext.finishBeanFactoryInitialization(AbstractApplicationContext.java:878) ~[spring-context-5.2.2.RELEASE.jar:5.2.2.RELEASE] at org.springframework.context.support.AbstractApplicationContext.refresh(AbstractApplicationContext.java:550) ~[spring-context-5.2.2.RELEASE.jar:5.2.2.RELEASE] at org.springframework.boot.web.servlet.context.ServletWebServerApplicationContext.refresh(ServletWebServerApplicationContext.java:141) ~[spring-boot-2.2.2.RELEASE.jar:2.2.2.RELEASE] at org.springframework.boot.SpringApplication.refresh(SpringApplication.java:747) [spring-boot-2.2.2.RELEASE.jar:2.2.2.RELEASE] at org.springframework.boot.SpringApplication.refreshContext(SpringApplication.java:397) [spring-boot-2.2.2.RELEASE.jar:2.2.2.RELEASE] at org.springframework.boot.SpringApplication.run(SpringApplication.java:315) [spring-boot-2.2.2.RELEASE.jar:2.2.2.RELEASE] at org.springframework.boot.SpringApplication.run(SpringApplication.java:1226) [spring-boot-2.2.2.RELEASE.jar:2.2.2.RELEASE] at org.springframework.boot.SpringApplication.run(SpringApplication.java:1215) [spring-boot-2.2.2.RELEASE.jar:2.2.2.RELEASE] at com.Forum.ForumApplication.main(ForumApplication.java:19) [classes/:na] Caused by: org.springframework.beans.factory.BeanCreationException: Error creating bean with name 'userMapper' defined in file [E:\STS-WorkSpace\Forum\target\classes\com\Forum\mapper\UserMapper.class]: Invocation of init method failed; nested exception is java.lang.IllegalArgumentException: Property 'sqlSessionFactory' or 'sqlSessionTemplate' are required at org.springframework.beans.factory.support.AbstractAutowireCapableBeanFactory.initializeBean(AbstractAutowireCapableBeanFactory.java:1796) ~[spring-beans-5.2.2.RELEASE.jar:5.2.2.RELEASE] at org.springframework.beans.factory.support.AbstractAutowireCapableBeanFactory.doCreateBean(AbstractAutowireCapableBeanFactory.java:595) ~[spring-beans-5.2.2.RELEASE.jar:5.2.2.RELEASE] at org.springframework.beans.factory.support.AbstractAutowireCapableBeanFactory.createBean(AbstractAutowireCapableBeanFactory.java:517) ~[spring-beans-5.2.2.RELEASE.jar:5.2.2.RELEASE] at org.springframework.beans.factory.support.AbstractBeanFactory.lambda$doGetBean$0(AbstractBeanFactory.java:323) ~[spring-beans-5.2.2.RELEASE.jar:5.2.2.RELEASE] at org.springframework.beans.factory.support.AbstractBeanFactory$$Lambda$141/1866850137.getObject(Unknown Source) ~[na:na] at org.springframework.beans.factory.support.DefaultSingletonBeanRegistry.getSingleton(DefaultSingletonBeanRegistry.java:222) ~[spring-beans-5.2.2.RELEASE.jar:5.2.2.RELEASE] at org.springframework.beans.factory.support.AbstractBeanFactory.doGetBean(AbstractBeanFactory.java:321) ~[spring-beans-5.2.2.RELEASE.jar:5.2.2.RELEASE] at org.springframework.beans.factory.support.AbstractBeanFactory.getBean(AbstractBeanFactory.java:202) ~[spring-beans-5.2.2.RELEASE.jar:5.2.2.RELEASE] at org.springframework.beans.factory.config.DependencyDescriptor.resolveCandidate(DependencyDescriptor.java:276) ~[spring-beans-5.2.2.RELEASE.jar:5.2.2.RELEASE] at org.springframework.beans.factory.support.DefaultListableBeanFactory.doResolveDependency(DefaultListableBeanFactory.java:1287) ~[spring-beans-5.2.2.RELEASE.jar:5.2.2.RELEASE] at org.springframework.beans.factory.support.DefaultListableBeanFactory.resolveDependency(DefaultListableBeanFactory.java:1207) ~[spring-beans-5.2.2.RELEASE.jar:5.2.2.RELEASE] at org.springframework.beans.factory.annotation.AutowiredAnnotationBeanPostProcessor$AutowiredFieldElement.inject(AutowiredAnnotationBeanPostProcessor.java:640) ~[spring-beans-5.2.2.RELEASE.jar:5.2.2.RELEASE] ... 20 common frames omitted Caused by: java.lang.IllegalArgumentException: Property 'sqlSessionFactory' or 'sqlSessionTemplate' are required at org.springframework.util.Assert.notNull(Assert.java:198) ~[spring-core-5.2.2.RELEASE.jar:5.2.2.RELEASE] at org.mybatis.spring.support.SqlSessionDaoSupport.checkDaoConfig(SqlSessionDaoSupport.java:123) ~[mybatis-spring-2.0.1.jar:2.0.1] at org.mybatis.spring.mapper.MapperFactoryBean.checkDaoConfig(MapperFactoryBean.java:73) ~[mybatis-spring-2.0.1.jar:2.0.1] at org.springframework.dao.support.DaoSupport.afterPropertiesSet(DaoSupport.java:44) ~[spring-tx-5.2.2.RELEASE.jar:5.2.2.RELEASE] at org.springframework.beans.factory.support.AbstractAutowireCapableBeanFactory.invokeInitMethods(AbstractAutowireCapableBeanFactory.java:1855) ~[spring-beans-5.2.2.RELEASE.jar:5.2.2.RELEASE] at org.springframework.beans.factory.support.AbstractAutowireCapableBeanFactory.initializeBean(AbstractAutowireCapableBeanFactory.java:1792) ~[spring-beans-5.2.2.RELEASE.jar:5.2.2.RELEASE] ... 31 common frames omitted ``` # Mapper代码: ``` package com.Forum.mapper; import org.apache.ibatis.annotations.Insert; import org.apache.ibatis.annotations.Mapper; import com.Forum.Model.User; @Mapper public interface UserMapper{ @Insert("insert into user (name,account_id,token,gmt_create,gmt_modified) values (#{name},#{accountId}),#{token},#{gmtCreate},#{gmtModified}") public void insert(User user); } ``` # 启动代码: ``` package com.Forum; import org.mybatis.spring.annotation.MapperScan; import org.springframework.boot.SpringApplication; import org.springframework.boot.autoconfigure.SpringBootApplication; import org.springframework.boot.autoconfigure.jdbc.DataSourceAutoConfiguration; import org.springframework.context.annotation.ComponentScan; @SpringBootApplication(exclude = {DataSourceAutoConfiguration.class}) @ComponentScan(basePackages = {"com.Forum.*"}) @MapperScan(basePackages = {"com.Forum.mapper"}) public class ForumApplication { public static void main(String[] args) { SpringApplication.run(ForumApplication.class, args); } } ``` # Controller代码: ```package com.Forum.Controller; import java.util.UUID; import javax.servlet.http.HttpServletRequest; import org.springframework.beans.factory.annotation.Autowired; import org.springframework.beans.factory.annotation.Value; import org.springframework.stereotype.Controller; import org.springframework.web.bind.annotation.GetMapping; import org.springframework.web.bind.annotation.RequestParam; import com.Forum.Dto.AccesstokenDTO; import com.Forum.Dto.GitHubUser; import com.Forum.Model.User; import com.Forum.Provider.GitHubProvider; import com.Forum.mapper.UserMapper; @Controller public class AuthorizeController{ @Autowired private GitHubProvider gitHubProvider; @Value("${github.client.id}") private String clientId; @Value("${github.client.secret}") private String clientSecret; @Value("${github.redirect.uri}") private String redirectUri; @Autowired public UserMapper userMapper; @GetMapping("/callback") public String callback(@RequestParam(name="code") String code, @RequestParam(name="state") String state, HttpServletRequest request ) { AccesstokenDTO accesstokenDTO = new AccesstokenDTO(); accesstokenDTO.setCode(code); accesstokenDTO.setRedirect_uri("redirectUri"); accesstokenDTO.setClient_id(clientId); accesstokenDTO.setClient_secret(clientSecret); accesstokenDTO.setState(state); String accessToken = gitHubProvider.getAccessToken(accesstokenDTO); GitHubUser githubUser = gitHubProvider.getUser(accessToken); if(githubUser != null) { // 登录成功,写cookie和session User user = new User(); user.setToken(UUID.randomUUID().toString()); user.setName(githubUser.getName()); user.setAccountId(String.valueOf(githubUser.getId())); user.setQmtCreate(System.currentTimeMillis()); user.setQmtModified(user.getQmtCreate()); userMapper.insert(user); request.getSession().setAttribute("user", githubUser); return "redirect:/"; // 去掉地址后缀 }else { // 登录失败,重新登录 return "redirect:/"; } } } ```
关于一个dubbo项目,zookeeper和spring-boot的bean的问题,详细情况下面说明
是这样的:一开始运行的好好的,但是中途我安装了一个wifi共享精灵,就会报出如下错误,之后卸载掉又会恢复正常,这是为什呢? 异常情况如下: org.springframework.beans.factory.BeanCreationException: Error creating bean with name 'orderController' defined in file [C:\Users\shengcl\Documents\workspace-sts-3.7.3.RELEASE\P160309\ouyeel\ouyeel-web-protal\target\classes\com\ouyeel\controller\OrderController.class]: Initialization of bean failed; nested exception is org.springframework.beans.factory.BeanInitializationException: Failed to init remote service reference at filed cmsOrderService in class com.ouyeel.controller.OrderController; nested exception is java.lang.IllegalStateException: Failed to check the status of the service com.ouyeel.order.service.CmsOrderService. No provider available for the service com.ouyeel.order.service.CmsOrderService from the url zookeeper://127.0.0.1:2181/com.alibaba.dubbo.registry.RegistryService?anyhost=true&application=xplat-seed-consumer&check=false&dubbo=2.8.4&generic=false&interface=com.ouyeel.order.service.CmsOrderService&methods=create,findAll&organization=dubbox&owner=kk580kk&pid=5624&revision=0.0.1-SNAPSHOT&side=consumer&timestamp=1461047607234 to the consumer 192.168.23.1 use dubbo version 2.8.4 at org.springframework.beans.factory.support.AbstractAutowireCapableBeanFactory.doCreateBean(AbstractAutowireCapableBeanFactory.java:553) ~[spring-beans-4.2.5.RELEASE.jar:4.2.5.RELEASE] at org.springframework.beans.factory.support.AbstractAutowireCapableBeanFactory.createBean(AbstractAutowireCapableBeanFactory.java:482) ~[spring-beans-4.2.5.RELEASE.jar:4.2.5.RELEASE] at org.springframework.beans.factory.support.AbstractBeanFactory$1.getObject(AbstractBeanFactory.java:306) ~[spring-beans-4.2.5.RELEASE.jar:4.2.5.RELEASE] at org.springframework.beans.factory.support.DefaultSingletonBeanRegistry.getSingleton(DefaultSingletonBeanRegistry.java:230) ~[spring-beans-4.2.5.RELEASE.jar:4.2.5.RELEASE] at org.springframework.beans.factory.support.AbstractBeanFactory.doGetBean(AbstractBeanFactory.java:302) ~[spring-beans-4.2.5.RELEASE.jar:4.2.5.RELEASE] at org.springframework.beans.factory.support.AbstractBeanFactory.getBean(AbstractBeanFactory.java:197) ~[spring-beans-4.2.5.RELEASE.jar:4.2.5.RELEASE] at org.springframework.beans.factory.support.DefaultListableBeanFactory.preInstantiateSingletons(DefaultListableBeanFactory.java:772) ~[spring-beans-4.2.5.RELEASE.jar:4.2.5.RELEASE] at org.springframework.context.support.AbstractApplicationContext.finishBeanFactoryInitialization(AbstractApplicationContext.java:839) ~[spring-context-4.2.5.RELEASE.jar:4.2.5.RELEASE] at org.springframework.context.support.AbstractApplicationContext.refresh(AbstractApplicationContext.java:538) ~[spring-context-4.2.5.RELEASE.jar:4.2.5.RELEASE] at org.springframework.boot.context.embedded.EmbeddedWebApplicationContext.refresh(EmbeddedWebApplicationContext.java:118) ~[spring-boot-1.3.3.RELEASE.jar:1.3.3.RELEASE] at org.springframework.boot.SpringApplication.refresh(SpringApplication.java:766) [spring-boot-1.3.3.RELEASE.jar:1.3.3.RELEASE] at org.springframework.boot.SpringApplication.createAndRefreshContext(SpringApplication.java:361) [spring-boot-1.3.3.RELEASE.jar:1.3.3.RELEASE] at org.springframework.boot.SpringApplication.run(SpringApplication.java:307) [spring-boot-1.3.3.RELEASE.jar:1.3.3.RELEASE] at org.springframework.boot.SpringApplication.run(SpringApplication.java:11
sts创建JAVA项目里JRE system Library不见了
我的电脑默认jdk8,因为学习需要jdk11,今天下载了jdk11,在sts里面创建一个jdk11项目后,我所有的项目里面的JRE System Library不见了,请问怎么把它显示出来 我的图片: ![图片说明](https://img-ask.csdn.net/upload/202002/13/1581579512_73758.png) 网络上找的图片: ![图片说明](https://img-ask.csdn.net/upload/202002/13/1581579545_320060.png) 我的项目里面的库都在 ![图片说明](https://img-ask.csdn.net/upload/202002/13/1581579667_743304.png) ![图片说明](https://img-ask.csdn.net/upload/202002/13/1581579725_47986.png)
java项目于将Maven迁移成Gradle
java项目于将Maven迁移成Gradle报错 [sts] ----------------------------------------------------- [sts] Starting Gradle build for the following tasks: [sts] init [sts] --type [sts] pom [sts] ----------------------------------------------------- [sts] Build failed org.gradle.tooling.GradleConnectionException: Could not install Gradle distribution from 'https://services.gradle.org/distributions/gradle-2.2.1-bin.zip'. at org.gradle.tooling.internal.consumer.DistributionFactory$ZippedDistribution$1.call(DistributionFactory.java:125) at org.gradle.tooling.internal.consumer.DistributionFactory$ZippedDistribution$1.call(DistributionFactory.java:113)
Jmeter刚启动就报错,java.lang.StackOverflowError: null
* 刚启动就报错,反射错误?? ``` 2019-10-15 19:25:30,381 INFO o.j.r.JARSourceHTTP: Found cached repo 2019-10-15 19:25:30,490 INFO o.j.r.PluginManager: Plugins Status: [jpgc-graphs-basic=2.0, jpgc-graphs-additional=Extras, jpgc-autostop=Extras, jpgc-sense=Standard, jpgc-cmd=Standard, jpgc-graphs-composite=Standard, jpgc-csl=Standard, jpgc-functions=2.1, jpgc-casutg=2.7, jpgc-dbmon=Extras, jpgc-graphs-dist=Extras, jpgc-dummy=Standard, jpgc-filterresults=Standard, jpgc-ffw=Standard, jpgc-ggl=Extras, jpgc-httpraw=Extras, jpgc-sts=Extras, jpgc-fifo=Standard, jpgc-jmxmon=Extras, jpgc-graphs-vs=Extras, jpgc-lockfile=Extras, jpgc-mergeresults=Standard, jpgc-pde=Extras, jpgc-prmctl=Extras, jpgc-perfmon=Standard, jpgc-plugins-manager=1.3, jpgc-synthesis=Standard, jpgc-plancheck=Standard, jpgc-tst=Standard, jpgc-udp=Extras, jpgc-csvars=Extras, jpgc-wsc=Standard, jpgc-xml=Extras, jmeter-core=5.1, jmeter-ftp=5.1, jmeter-http=5.1, jmeter-jdbc=5.1, jmeter-jms=5.1, jmeter-junit=5.1, jmeter-java=5.1, jmeter-ldap=5.1, jmeter-mail=5.1, jmeter-mongodb=5.1, jmeter-native=5.1, jmeter-tcp=5.1, jmeter-components=5.1, jpgc-standard=2.0] 2019-10-15 19:25:30,490 INFO o.j.r.PluginManagerMenuItem: Plugins Manager has upgrades: [jpgc-casutg] 2019-10-15 19:25:30,928 WARN o.a.j.g.u.MenuFactory: Could not instantiate class: kg.apc.jmeter.reporters.LoadosophiaUploaderGui java.lang.reflect.InvocationTargetException: null at sun.reflect.NativeConstructorAccessorImpl.newInstance0(Native Method) ~[?:1.8.0_131] at sun.reflect.NativeConstructorAccessorImpl.newInstance(NativeConstructorAccessorImpl.java:62) ~[?:1.8.0_131] at sun.reflect.DelegatingConstructorAccessorImpl.newInstance(DelegatingConstructorAccessorImpl.java:45) ~[?:1.8.0_131] at java.lang.reflect.Constructor.newInstance(Constructor.java:423) ~[?:1.8.0_131] at org.apache.jmeter.gui.util.MenuFactory.getGUIComponent(MenuFactory.java:174) ~[ApacheJMeter_core.jar:5.1 r1853635] at org.apache.jmeter.gui.util.MenuFactory.initializeMenus(MenuFactory.java:141) ~[ApacheJMeter_core.jar:5.1 r1853635] at org.apache.jmeter.gui.util.MenuFactory.<clinit>(MenuFactory.java:106) ~[ApacheJMeter_core.jar:5.1 r1853635] at org.apache.jmeter.control.gui.TestPlanGui.createPopupMenu(TestPlanGui.java:92) ~[ApacheJMeter_core.jar:5.1 r1853635] at org.apache.jmeter.gui.tree.JMeterTreeNode.createPopupMenu(JMeterTreeNode.java:185) ~[ApacheJMeter_core.jar:5.1 r1853635] at org.apache.jmeter.gui.action.EditCommand.doAction(EditCommand.java:46) ~[ApacheJMeter_core.jar:5.1 r1853635] at org.apache.jmeter.gui.action.ActionRouter.performAction(ActionRouter.java:88) ~[ApacheJMeter_core.jar:5.1 r1853635] at org.apache.jmeter.gui.action.ActionRouter.lambda$actionPerformed$0(ActionRouter.java:70) ~[ApacheJMeter_core.jar:5.1 r1853635] at java.awt.event.InvocationEvent.dispatch(InvocationEvent.java:311) [?:1.8.0_131] at java.awt.EventQueue.dispatchEventImpl(EventQueue.java:756) [?:1.8.0_131] at java.awt.EventQueue.access$500(EventQueue.java:97) [?:1.8.0_131] at java.awt.EventQueue$3.run(EventQueue.java:709) [?:1.8.0_131] at java.awt.EventQueue$3.run(EventQueue.java:703) [?:1.8.0_131] at java.security.AccessController.doPrivileged(Native Method) [?:1.8.0_131] at java.security.ProtectionDomain$JavaSecurityAccessImpl.doIntersectionPrivilege(ProtectionDomain.java:80) [?:1.8.0_131] at java.awt.EventQueue.dispatchEvent(EventQueue.java:726) [?:1.8.0_131] at java.awt.EventDispatchThread.pumpOneEventForFilters(EventDispatchThread.java:201) [?:1.8.0_131] at java.awt.EventDispatchThread.pumpEventsForFilter(EventDispatchThread.java:116) [?:1.8.0_131] at java.awt.EventDispatchThread.pumpEventsForHierarchy(EventDispatchThread.java:105) [?:1.8.0_131] at java.awt.EventDispatchThread.pumpEvents(EventDispatchThread.java:101) [?:1.8.0_131] at java.awt.EventDispatchThread.pumpEvents(EventDispatchThread.java:93) [?:1.8.0_131] at java.awt.EventDispatchThread.run(EventDispatchThread.java:82) [?:1.8.0_131] Caused by: java.lang.NoClassDefFoundError: org/apache/commons/httpclient/methods/multipart/PartSource at kg.apc.jmeter.reporters.LoadosophiaUploaderGui.init(LoadosophiaUploaderGui.java:114) ~[JMeterPlugins-Standard.jar:?] at kg.apc.jmeter.reporters.LoadosophiaUploaderGui.<init>(LoadosophiaUploaderGui.java:28) ~[JMeterPlugins-Standard.jar:?] ... 26 more Caused by: java.lang.ClassNotFoundException: org.apache.commons.httpclient.methods.multipart.PartSource at java.net.URLClassLoader.findClass(URLClassLoader.java:381) ~[?:1.8.0_131] at java.lang.ClassLoader.loadClass(ClassLoader.java:424) ~[?:1.8.0_131] at java.lang.ClassLoader.loadClass(ClassLoader.java:357) ~[?:1.8.0_131] at kg.apc.jmeter.reporters.LoadosophiaUploaderGui.init(LoadosophiaUploaderGui.java:114) ~[JMeterPlugins-Standard.jar:?] at kg.apc.jmeter.reporters.LoadosophiaUploaderGui.<init>(LoadosophiaUploaderGui.java:28) ~[JMeterPlugins-Standard.jar:?] ... 26 more ```’ * 接着启动线程,又报错StackOverflowError, ``` 2019-10-15 19:25:44,875 INFO o.a.j.t.JMeterThread: Thread started: 线程组 2-1 2019-10-15 19:25:44,876 INFO o.a.j.t.JMeterThread: Thread is done: 线程组 2-1 2019-10-15 19:25:44,876 INFO o.a.j.t.JMeterThread: Thread finished: 线程组 2-1 2019-10-15 19:25:45,703 INFO o.a.j.t.JMeterThread: Thread started: jp@gc - Stepping Thread Group (deprecated) 1-2 2019-10-15 19:25:46,703 INFO o.a.j.t.JMeterThread: Thread started: jp@gc - Stepping Thread Group (deprecated) 1-3 2019-10-15 19:25:47,696 INFO o.a.j.t.JMeterThread: Thread started: jp@gc - Stepping Thread Group (deprecated) 1-4 2019-10-15 19:25:48,195 INFO o.a.j.t.JMeterThread: Thread finished: jp@gc - Stepping Thread Group (deprecated) 1-1 2019-10-15 19:25:48,196 ERROR o.a.j.JMeter: Uncaught exception: java.lang.StackOverflowError: null at org.apache.jmeter.testelement.AbstractTestElement.recoverRunningVersion(AbstractTestElement.java:514) ~[ApacheJMeter_core.jar:5.1 r1853635] at org.apache.jmeter.testelement.property.TestElementProperty.recoverRunningVersion(TestElementProperty.java:125) ~[ApacheJMeter_core.jar:5.1 r1853635] at org.apache.jmeter.testelement.property.MultiProperty.recoverRunningVersionOfSubElements(MultiProperty.java:75) ~[ApacheJMeter_core.jar:5.1 r1853635] at org.apache.jmeter.testelement.property.CollectionProperty.recoverRunningVersion(CollectionProperty.java:205) ~[ApacheJMeter_core.jar:5.1 r1853635] at org.apache.jmeter.testelement.AbstractTestElement.recoverRunningVersion(AbstractTestElement.java:514) ~[ApacheJMeter_core.jar:5.1 r1853635] at org.apache.jmeter.testelement.property.TestElementProperty.recoverRunningVersion(TestElementProperty.java:125) ~[ApacheJMeter_core.jar:5.1 r1853635] at org.apache.jmeter.testelement.AbstractTestElement.recoverRunningVersion(AbstractTestElement.java:514) ~[ApacheJMeter_core.jar:5.1 r1853635] at org.apache.jmeter.threads.JMeterThread.notifyTestListeners(JMeterThread.java:973) ~[ApacheJMeter_core.jar:5.1 r1853635] at org.apache.jmeter.threads.JMeterThread$IterationListener.iterationStart(JMeterThread.java:1054) ~[ApacheJMeter_core.jar:5.1 r1853635] at org.apache.jmeter.control.GenericController.fireIterationStart(GenericController.java:399) ~[ApacheJMeter_core.jar:5.1 r1853635] at org.apache.jmeter.control.GenericController.fireIterEvents(GenericController.java:391) ~[ApacheJMeter_core.jar:5.1 r1853635] at org.apache.jmeter.control.GenericController.next(GenericController.java:160) ~[ApacheJMeter_core.jar:5.1 r1853635] at org.apache.jmeter.control.LoopController.next(LoopController.java:135) ~[ApacheJMeter_core.jar:5.1 r1853635] at org.apache.jmeter.control.LoopController.nextIsNull(LoopController.java:167) ~[ApacheJMeter_core.jar:5.1 r1853635] at org.apache.jmeter.control.GenericController.next(GenericController.java:170) ~[ApacheJMeter_core.jar:5.1 r1853635] at org.apache.jmeter.control.LoopController.next(LoopController.java:135) ~[ApacheJMeter_core.jar:5.1 r1853635] at org.apache.jmeter.control.GenericController.nextIsAController(GenericController.java:225) ~[ApacheJMeter_core.jar:5.1 r1853635] at org.apache.jmeter.control.GenericController.next(GenericController.java:175) ~[ApacheJMeter_core.jar:5.1 r1853635] at org.apache.jmeter.control.LoopController.next(LoopController.java:135) ~[ApacheJMeter_core.jar:5.1 r1853635] at org.apache.jmeter.control.LoopController.nextIsNull(LoopController.java:167) ~[ApacheJMeter_core.jar:5.1 r1853635] at org.apache.jmeter.control.GenericController.next(GenericController.java:170) ~[ApacheJMeter_core.jar:5.1 r1853635] at org.apache.jmeter.control.LoopController.next(LoopController.java:135) ~[ApacheJMeter_core.jar:5.1 r1853635] at org.apache.jmeter.control.GenericController.nextIsAController(GenericController.java:225) ~[ApacheJMeter_core.jar:5.1 r1853635] at org.apache.jmeter.control.GenericController.next(GenericController.java:175) ~[ApacheJMeter_core.jar:5.1 r1853635] at org.apache.jmeter.control.LoopController.next(LoopController.java:135) ~[ApacheJMeter_core.jar:5.1 r1853635] at org.apache.jmeter.control.LoopController.nextIsNull(LoopController.java:167) ~[ApacheJMeter_core.jar:5.1 r1853635] at org.apache.jmeter.control.GenericController.next(GenericController.java:170) ~[ApacheJMeter_core.jar:5.1 r1853635] at org.apache.jmeter.control.LoopController.next(LoopController.java:135) ~[ApacheJMeter_core.jar:5.1 r1853635] at org.apache.jmeter.control.GenericController.nextIsAController(GenericController.java:225) ~[ApacheJMeter_core.jar:5.1 r1853635] at org.apache.jmeter.control.GenericController.next(GenericController.java:175) ~[ApacheJMeter_core.jar:5.1 r1853635] ``` 前辈们帮忙看看
STS安装SVN报错出不同错误
**按照安装步骤走:** ![图片说明](https://img-ask.csdn.net/upload/201609/05/1473072411_337578.png) *但是每次都会报出不同错误:** ![图片说明](https://img-ask.csdn.net/upload/201609/05/1473072522_287120.png) ![图片说明](https://img-ask.csdn.net/upload/201609/05/1473072535_842592.png) ![图片说明](https://img-ask.csdn.net/upload/201609/05/1473072545_439118.png) 求大神帮忙解决
eclipse-sts从svn检出项目时报错如下
![图片说明](https://img-ask.csdn.net/upload/201712/25/1514210122_85562.png) 首先确定不是权限问题,我本地安装了ecilpse和eclipse-sts两个版本软件。同一个svn在ecilpse可以检出,但在eclipse-sts就报错 ![图片说明](https://img-ask.csdn.net/upload/201712/25/1514213277_1509.png) 然后我卸载了svn,然后选择安装svn时,sts提示没有连接
eclipse sts插件创建spring start project springboot项目报错
初学springboot框架,用sts插件搭建了一个 springboot 项目测试一下是否成功。 直接执行main方法说找不到或无法加载主类,当然我的Application类都是自动生成的,注解都有,这个都没问题,但是就是说找不到或无法加载主类。 然后我用maven build启动,报了如下错: [INFO] Scanning for projects... [INFO] [INFO] ------------------------------------------------------------------------ [INFO] Building spring-boot-sample 0.0.1-SNAPSHOT [INFO] ------------------------------------------------------------------------ [INFO] [INFO] >>> spring-boot-maven-plugin:1.5.3.RELEASE:run (default-cli) > test-compile @ spring-boot-sample >>> [INFO] [INFO] --- maven-resources-plugin:2.6:resources (default-resources) @ spring-boot-sample --- [INFO] Using 'UTF-8' encoding to copy filtered resources. [INFO] Copying 1 resource [INFO] Copying 1 resource [INFO] [INFO] --- maven-compiler-plugin:3.1:compile (default-compile) @ spring-boot-sample --- [INFO] Changes detected - recompiling the module! [INFO] Compiling 2 source files to E:\Java learn\All workspacce\dev_springboot\spring-boot-sample\target\classes [INFO] ------------------------------------------------------------- [ERROR] COMPILATION ERROR : [INFO] ------------------------------------------------------------- [ERROR] 读取E:\Java learn\Maven\apache-maven\org\springframework\boot\spring-boot-autoconfigure\1.5.3.RELEASE\spring-boot-autoconfigure-1.5.3.RELEASE.jar时出错; error in opening zip file [ERROR] 读取E:\Java learn\Maven\apache-maven\org\springframework\boot\spring-boot-autoconfigure\1.5.3.RELEASE\spring-boot-autoconfigure-1.5.3.RELEASE.jar时出错; cannot read zip file [ERROR] /E:/Java learn/All workspacce/dev_springboot/spring-boot-sample/src/main/java/com/example/simple/SpringBootSampleApplication.java:[4,46] 程序包org.springframework.boot.autoconfigure不存在 [ERROR] /E:/Java learn/All workspacce/dev_springboot/spring-boot-sample/src/main/java/com/example/simple/SpringBootSampleApplication.java:[6,2] 找不到符号 符号: 类 SpringBootApplication [INFO] 4 errors [INFO] ------------------------------------------------------------- [INFO] ------------------------------------------------------------------------ [INFO] BUILD FAILURE [INFO] ------------------------------------------------------------------------ [INFO] Total time: 3.632 s [INFO] Finished at: 2017-05-07T22:06:15+08:00 [INFO] Final Memory: 22M/191M [INFO] ------------------------------------------------------------------------ [WARNING] The requested profile "pom.xml" could not be activated because it does not exist. [ERROR] Failed to execute goal org.apache.maven.plugins:maven-compiler-plugin:3.1:compile (default-compile) on project spring-boot-sample: Compilation failure: Compilation failure: [ERROR] 读取E:\Java learn\Maven\apache-maven\org\springframework\boot\spring-boot-autoconfigure\1.5.3.RELEASE\spring-boot-autoconfigure-1.5.3.RELEASE.jar时出错; error in opening zip file [ERROR] 读取E:\Java learn\Maven\apache-maven\org\springframework\boot\spring-boot-autoconfigure\1.5.3.RELEASE\spring-boot-autoconfigure-1.5.3.RELEASE.jar时出错; cannot read zip file [ERROR] /E:/Java learn/All workspacce/dev_springboot/spring-boot-sample/src/main/java/com/example/simple/SpringBootSampleApplication.java:[4,46] 程序包org.springframework.boot.autoconfigure不存在 [ERROR] /E:/Java learn/All workspacce/dev_springboot/spring-boot-sample/src/main/java/com/example/simple/SpringBootSampleApplication.java:[6,2] 找不到符号 [ERROR] 符号: 类 SpringBootApplication [ERROR] -> [Help 1] [ERROR] [ERROR] To see the full stack trace of the errors, re-run Maven with the -e switch. [ERROR] Re-run Maven using the -X switch to enable full debug logging. [ERROR] [ERROR] For more information about the errors and possible solutions, please read the following articles: [ERROR] [Help 1] http://cwiki.apache.org/confluence/display/MAVEN/MojoFailureException 不知道怎么解决,有大神能说下 这个springboot 环境到底怎么搭建吗?
JAVA 腾讯云利用STS临时凭证上传文件到COS的报错?
1、按照官方demo已可以正确获取到STS的临时凭证,具体代码如下: ![图片说明](https://img-ask.csdn.net/upload/201810/24/1540367763_703495.png) 2、利用凭证上传本地文件,也是按照官方demo写的,存疑处已在图上标注 ![图片说明](https://img-ask.csdn.net/upload/201810/24/1540367554_687407.png) 3、运行测试发现报错403,签名或者权限问题,但是子账号是对于cos是完全权限,签名是根据STS凭证获取来的,所以没看懂为什么会报错 ![图片说明](https://img-ask.csdn.net/upload/201810/24/1540367615_260582.png) 希望有这方面经验的朋友告知下,谢谢
sts创建gradle项目报错
![图片说明](https://img-ask.csdn.net/upload/201811/06/1541494810_833554.png) sts创建gradle项目报错
使用Spring Tool Suite (STS)创建application.yml文件创建失败
![图片说明](https://img-ask.csdn.net/upload/201912/04/1575421572_219370.png)
weblogic10.3.6 启动项目 报数组越界
我是用springboot 打成的war包 直接部署在了weblogic10.3.6 。然后报出数组越界的错误。打成war包的工具是sts4 ![图片说明](https://img-ask.csdn.net/upload/201902/28/1551336859_812828.png) ![图片说明](https://img-ask.csdn.net/upload/201902/28/1551336827_232790.png)![图片说明](https://img-ask.csdn.net/upload/201902/28/1551336836_594626.png) 请问 springboot 打成的war包 怎么部署在weblogic10.3.6
STS(Spring Tool Suite)中.yml文件的语法颜色怎么设置
STS(Spring Tool Suite)中.yml文件的语法颜色怎么设置 比如下图的 8080 是黑色的,在深色背景下看不清,想把字体设置成白色 ![图片说明](https://img-ask.csdn.net/upload/201812/31/1546234434_527544.png)
eclipse安装spring插件STS后就打不开了了
eclipse安装spring插件STS(spring tool suite)后就打不开了了,点击eclipse.exe后显示错误弹窗: the eclipse executable launcher was unable to locate its companion shared library ![图片说明](https://img-ask.csdn.net/upload/201808/28/1535461797_90357.png) 但是点击安装好的STS.exe可以打开,它的界面和eclipse几乎一样除了图标和版本介绍的信息 ![图片说明](https://img-ask.csdn.net/upload/201808/28/1535461836_451977.png) ![图片说明](https://img-ask.csdn.net/upload/201808/28/1535461851_359408.png) ![图片说明](https://img-ask.csdn.net/upload/201808/28/1535461863_956594.png) 而且之前eclipse中的项目在STS界面上都能运行,但是这还是让人看得很别扭,怎么才能恢复原来的eclipse界面同时也能继续用STS框架
为什么eclisep成功安装sts插件,spring的其他选项都有,唯独没有springboot starter poject这个选项
![图片说明](https://img-ask.csdn.net/upload/201910/03/1570071229_558251.png)![图片说明](https://img-ask.csdn.net/upload/201910/03/1570071261_360349.png)
spring怎么读取maven父工程根目录下的文件(非classpath)
![这个maven父子工程](https://img-ask.csdn.net/upload/201710/22/1508686255_901151.jpg) 暂时只能直接写死此工程绝对路径 applicationBeans.xml配置 locations里直接来 ``` <property name="locations"> <list> <value>file:/C:/Users/acerE5-573G/Documents/workspace-sts-3.7.0.RELEASE/dgt/build-${env}.properties</value> </list> </property> ``` 但是这么写肯定不靠谱 , 那应该怎么写获取路劲呢?
终于明白阿里百度这样的大公司,为什么面试经常拿ThreadLocal考验求职者了
点击上面↑「爱开发」关注我们每晚10点,捕获技术思考和创业资源洞察什么是ThreadLocalThreadLocal是一个本地线程副本变量工具类,各个线程都拥有一份线程私...
《奇巧淫技》系列-python!!每天早上八点自动发送天气预报邮件到QQ邮箱
将代码部署服务器,每日早上定时获取到天气数据,并发送到邮箱。 也可以说是一个小人工智障。 思路可以运用在不同地方,主要介绍的是思路。
面试官问我:什么是消息队列?什么场景需要他?用了会出现什么问题?
你知道的越多,你不知道的越多 点赞再看,养成习惯 GitHub上已经开源 https://github.com/JavaFamily 有一线大厂面试点脑图、个人联系方式和人才交流群,欢迎Star和完善 前言 消息队列在互联网技术存储方面使用如此广泛,几乎所有的后端技术面试官都要在消息队列的使用和原理方面对小伙伴们进行360°的刁难。 作为一个在互联网公司面一次拿一次Offer的面霸...
8年经验面试官详解 Java 面试秘诀
作者 |胡书敏 责编 | 刘静 出品 | CSDN(ID:CSDNnews) 本人目前在一家知名外企担任架构师,而且最近八年来,在多家外企和互联网公司担任Java技术面试官,前后累计面试了有两三百位候选人。在本文里,就将结合本人的面试经验,针对Java初学者、Java初级开发和Java开发,给出若干准备简历和准备面试的建议。 Java程序员准备和投递简历的实...
究竟你适不适合买Mac?
我清晰的记得,刚买的macbook pro回到家,开机后第一件事情,就是上了淘宝网,花了500元钱,找了一个上门维修电脑的师傅,上门给我装了一个windows系统。。。。。。 表砍我。。。 当时买mac的初衷,只是想要个固态硬盘的笔记本,用来运行一些复杂的扑克软件。而看了当时所有的SSD笔记本后,最终决定,还是买个好(xiong)看(da)的。 已经有好几个朋友问我mba怎么样了,所以今天尽量客观...
MyBatis研习录(01)——MyBatis概述与入门
MyBatis 是一款优秀的持久层框架,它支持定制化 SQL、存储过程以及高级映射。MyBatis原本是apache的一个开源项目iBatis, 2010年该项目由apache software foundation 迁移到了google code并改名为MyBatis 。2013年11月MyBatis又迁移到Github。
程序员一般通过什么途径接私活?
二哥,你好,我想知道一般程序猿都如何接私活,我也想接,能告诉我一些方法吗? 上面是一个读者“烦不烦”问我的一个问题。其实不止是“烦不烦”,还有很多读者问过我类似这样的问题。 我接的私活不算多,挣到的钱也没有多少,加起来不到 20W。说实话,这个数目说出来我是有点心虚的,毕竟太少了,大家轻喷。但我想,恰好配得上“一般程序员”这个称号啊。毕竟苍蝇再小也是肉,我也算是有经验的人了。 唾弃接私活、做外...
Python爬虫爬取淘宝,京东商品信息
小编是一个理科生,不善长说一些废话。简单介绍下原理然后直接上代码。 使用的工具(Python+pycharm2019.3+selenium+xpath+chromedriver)其中要使用pycharm也可以私聊我selenium是一个框架可以通过pip下载 pip installselenium -ihttps://pypi.tuna.tsinghua.edu.cn/simple/ ...
阿里程序员写了一个新手都写不出的低级bug,被骂惨了。
这种新手都不会范的错,居然被一个工作好几年的小伙子写出来,差点被当场开除了。
Java工作4年来应聘要16K最后没要,细节如下。。。
前奏: 今天2B哥和大家分享一位前几天面试的一位应聘者,工作4年26岁,统招本科。 以下就是他的简历和面试情况。 基本情况: 专业技能: 1、&nbsp;熟悉Sping了解SpringMVC、SpringBoot、Mybatis等框架、了解SpringCloud微服务 2、&nbsp;熟悉常用项目管理工具:SVN、GIT、MAVEN、Jenkins 3、&nbsp;熟悉Nginx、tomca...
Python爬虫精简步骤1 获取数据
爬虫,从本质上来说,就是利用程序在网上拿到对我们有价值的数据。 爬虫能做很多事,能做商业分析,也能做生活助手,比如:分析北京近两年二手房成交均价是多少?广州的Python工程师平均薪资是多少?北京哪家餐厅粤菜最好吃?等等。 这是个人利用爬虫所做到的事情,而公司,同样可以利用爬虫来实现巨大的商业价值。比如你所熟悉的搜索引擎——百度和谷歌,它们的核心技术之一也是爬虫,而且是超级爬虫。 从搜索巨头到人工...
Python绘图,圣诞树,花,爱心 | Turtle篇
每周每日,分享Python实战代码,入门资料,进阶资料,基础语法,爬虫,数据分析,web网站,机器学习,深度学习等等。 公众号回复【进群】沟通交流吧,QQ扫码进群学习吧 微信群 QQ群 1.画圣诞树 import turtle screen = turtle.Screen() screen.setup(800,600) circle = turtle.Turtle()...
作为一个程序员,CPU的这些硬核知识你必须会!
CPU对每个程序员来说,是个既熟悉又陌生的东西? 如果你只知道CPU是中央处理器的话,那可能对你并没有什么用,那么作为程序员的我们,必须要搞懂的就是CPU这家伙是如何运行的,尤其要搞懂它里面的寄存器是怎么一回事,因为这将让你从底层明白程序的运行机制。 随我一起,来好好认识下CPU这货吧 把CPU掰开来看 对于CPU来说,我们首先就要搞明白它是怎么回事,也就是它的内部构造,当然,CPU那么牛的一个东...
破14亿,Python分析我国存在哪些人口危机!
一、背景 二、爬取数据 三、数据分析 1、总人口 2、男女人口比例 3、人口城镇化 4、人口增长率 5、人口老化(抚养比) 6、各省人口 7、世界人口 四、遇到的问题 遇到的问题 1、数据分页,需要获取从1949-2018年数据,观察到有近20年参数:LAST20,由此推测获取近70年的参数可设置为:LAST70 2、2019年数据没有放上去,可以手动添加上去 3、将数据进行 行列转换 4、列名...
web前端javascript+jquery知识点总结
1.Javascript 语法.用途 javascript 在前端网页中占有非常重要的地位,可以用于验证表单,制作特效等功能,它是一种描述语言,也是一种基于对象(Object)和事件驱动并具有安全性的脚本语言 ...
Python实战:抓肺炎疫情实时数据,画2019-nCoV疫情地图
今天,群里白垩老师问如何用python画武汉肺炎疫情地图。白垩老师是研究海洋生态与地球生物的学者,国家重点实验室成员,于不惑之年学习python,实为我等学习楷模。先前我并没有关注武汉肺炎的具体数据,也没有画过类似的数据分布图。于是就拿了两个小时,专门研究了一下,遂成此文。
听说想当黑客的都玩过这个Monyer游戏(1~14攻略)
第零关 进入传送门开始第0关(游戏链接) 请点击链接进入第1关: 连接在左边→ ←连接在右边 看不到啊。。。。(只能看到一堆大佬做完的留名,也能看到菜鸡的我,在后面~~) 直接fn+f12吧 &lt;span&gt;连接在左边→&lt;/span&gt; &lt;a href="first.php"&gt;&lt;/a&gt; &lt;span&gt;←连接在右边&lt;/span&gt; o...
在家远程办公效率低?那你一定要收好这个「在家办公」神器!
相信大家都已经收到国务院延长春节假期的消息,接下来,在家远程办公可能将会持续一段时间。 但是问题来了。远程办公不是人在电脑前就当坐班了,相反,对于沟通效率,文件协作,以及信息安全都有着极高的要求。有着非常多的挑战,比如: 1在异地互相不见面的会议上,如何提高沟通效率? 2文件之间的来往反馈如何做到及时性?如何保证信息安全? 3如何规划安排每天工作,以及如何进行成果验收? ...... ...
作为一个程序员,内存和磁盘的这些事情,你不得不知道啊!!!
截止目前,我已经分享了如下几篇文章: 一个程序在计算机中是如何运行的?超级干货!!! 作为一个程序员,CPU的这些硬核知识你必须会! 作为一个程序员,内存的这些硬核知识你必须懂! 这些知识可以说是我们之前都不太重视的基础知识,可能大家在上大学的时候都学习过了,但是嘞,当时由于老师讲解的没那么有趣,又加上这些知识本身就比较枯燥,所以嘞,大家当初几乎等于没学。 再说啦,学习这些,也看不出来有什么用啊!...
渗透测试-灰鸽子远控木马
木马概述 灰鸽子( Huigezi),原本该软件适用于公司和家庭管理,其功能十分强大,不但能监视摄像头、键盘记录、监控桌面、文件操作等。还提供了黑客专用功能,如:伪装系统图标、随意更换启动项名称和表述、随意更换端口、运行后自删除、毫无提示安装等,并采用反弹链接这种缺陷设计,使得使用者拥有最高权限,一经破解即无法控制。最终导致被黑客恶意使用。原作者的灰鸽子被定义为是一款集多种控制方式于一体的木马程序...
Python:爬取疫情每日数据
前言 目前每天各大平台,如腾讯、今日头条都会更新疫情每日数据,他们的数据源都是一样的,主要都是通过各地的卫健委官网通报。 以全国、湖北和上海为例,分别为以下三个网站: 国家卫健委官网:http://www.nhc.gov.cn/xcs/yqtb/list_gzbd.shtml 湖北卫健委官网:http://wjw.hubei.gov.cn/bmdt/ztzl/fkxxgzbdgrfyyq/xxfb...
这个世界上人真的分三六九等,你信吗?
偶然间,在知乎上看到一个问题 一时间,勾起了我深深的回忆。 以前在厂里打过两次工,做过家教,干过辅导班,做过中介。零下几度的晚上,贴过广告,满脸、满手地长冻疮。 再回首那段岁月,虽然苦,但让我学会了坚持和忍耐。让我明白了,在这个世界上,无论环境多么的恶劣,只要心存希望,星星之火,亦可燎原。 下文是原回答,希望能对你能有所启发。 如果我说,这个世界上人真的分三六九等,...
B 站上有哪些很好的学习资源?
哇说起B站,在小九眼里就是宝藏般的存在,放年假宅在家时一天刷6、7个小时不在话下,更别提今年的跨年晚会,我简直是跪着看完的!! 最早大家聚在在B站是为了追番,再后来我在上面刷欧美新歌和漂亮小姐姐的舞蹈视频,最近两年我和周围的朋友们已经把B站当作学习教室了,而且学习成本还免费,真是个励志的好平台ヽ(.◕ฺˇд ˇ◕ฺ;)ノ 下面我们就来盘点一下B站上优质的学习资源: 综合类 Oeasy: 综合...
雷火神山直播超两亿,Web播放器事件监听是怎么实现的?
Web播放器解决了在手机浏览器和PC浏览器上播放音视频数据的问题,让视音频内容可以不依赖用户安装App,就能进行播放以及在社交平台进行传播。在视频业务大数据平台中,播放数据的统计分析非常重要,所以Web播放器在使用过程中,需要对其内部的数据进行收集并上报至服务端,此时,就需要对发生在其内部的一些播放行为进行事件监听。 那么Web播放器事件监听是怎么实现的呢? 01 监听事件明细表 名...
3万字总结,Mysql优化之精髓
本文知识点较多,篇幅较长,请耐心学习 MySQL已经成为时下关系型数据库产品的中坚力量,备受互联网大厂的青睐,出门面试想进BAT,想拿高工资,不会点MySQL优化知识,拿offer的成功率会大大下降。 为什么要优化 系统的吞吐量瓶颈往往出现在数据库的访问速度上 随着应用程序的运行,数据库的中的数据会越来越多,处理时间会相应变慢 数据是存放在磁盘上的,读写速度无法和内存相比 如何优化 设计...
Python新型冠状病毒疫情数据自动爬取+统计+发送报告+数据屏幕(三)发送篇
今天介绍的项目是使用 Itchat 发送统计报告 项目功能设计: 定时爬取疫情数据存入Mysql 进行数据分析制作疫情报告 使用itchat给亲人朋友发送分析报告 基于Django做数据屏幕 使用Tableau做数据分析 来看看最终效果 目前已经完成,预计2月12日前更新 使用 itchat 发送数据统计报告 itchat 是一个基于 web微信的一个框架,但微信官方并不允许使用这...
作为程序员的我,大学四年一直自学,全靠这些实用工具和学习网站!
我本人因为高中沉迷于爱情,导致学业荒废,后来高考,毫无疑问进入了一所普普通通的大学,实在惭愧???? 我又是那么好强,现在学历不行,没办法改变的事情了,所以,进入大学开始,我就下定决心,一定要让自己掌握更多的技能,尤其选择了计算机这个行业,一定要多学习技术。 在进入大学学习不久后,我就认清了一个现实:我这个大学的整体教学质量和学习风气,真的一言难尽,懂的人自然知道怎么回事? 怎么办?我该如何更好的提升自...
粒子群算法求解物流配送路线问题(python)
1.Matlab实现粒子群算法的程序代码:https://www.cnblogs.com/kexinxin/p/9858664.html matlab代码求解函数最优值:https://blog.csdn.net/zyqblog/article/details/80829043 讲解通俗易懂,有数学实例的博文:https://blog.csdn.net/daaikuaichuan/article/...
教你如何编写第一个简单的爬虫
很多人知道爬虫,也很想利用爬虫去爬取自己想要的数据,那么爬虫到底怎么用呢?今天就教大家编写一个简单的爬虫。 下面以爬取笔者的个人博客网站为例获取第一篇文章的标题名称,教大家学会一个简单的爬虫。 第一步:获取页面 #!/usr/bin/python # coding: utf-8 import requests #引入包requests link = "http://www.santostang....
前端JS初级面试题二 (。•ˇ‸ˇ•。)老铁们!快来瞧瞧自己都会了么
1. 传统事件绑定和符合W3C标准的事件绑定有什么区别? 传统事件绑定 &lt;div onclick=""&gt;123&lt;/div&gt; div1.onclick = function(){}; &lt;button onmouseover=""&gt;&lt;/button&gt; 注意: 如果给同一个元素绑定了两次或多次相同类型的事件,那么后面的绑定会覆盖前面的绑定 (不支持DOM事...
相关热词 c#如何定义数组列表 c#倒序读取txt文件 java代码生成c# c# tcp发送数据 c#解决时间格式带星期 c#类似hashmap c#设置istbox的值 c#获取多线程返回值 c# 包含数字 枚举 c# timespan
立即提问