Error:(16, 47) 错误: 不兼容的类型: View无法转换为Button

小白求助0.0
Error:(10, 36) 错误: 找不到符号
符号: 类 OnClickListener
位置: 类 Button
Error:(16, 47) 错误: 不兼容的类型: View无法转换为Button
Error:Execution failed for task ':app:compileDebugJavaWithJavac'.

Compilation failed; see the compiler error output for details.

以下是Android studio编写的activity

 package com.example.activitytest;

import android.support.v7.app.AppCompatActivity;
import android.os.Bundle;
import android.view.View;
import android.widget.Toast;

import static com.example.activitytest.R.*;

public class FirstActivity extends AppCompatActivity {

    @Override
    protected void onCreate(Bundle savedInstanceState) {
        super.onCreate(savedInstanceState);
        setContentView(layout.first_layout);
        Button button1 = (Button) findViewById(R.id.button_1);
        button1.setOnClickListener(new View.OnClickListener() {
            @Override
            public void onClick(View v) {
                Toast.makeText(FirstActivity.this, "You clicked Button 1",
                        Toast.LENGTH_SHORT).show();
            }
        });
    }
}

3个回答

我想应该是你的布局文件导入错了,应该写成:

setContentView(R.layout.first_layout);

qq_34760894
爱包子的鱼 就是这个原因,实在感谢!!
接近 3 年之前 回复

Linux 下没有导入API ~-~ ,图片说明,太赞了

图片说明 发错了。。

Csdn user default icon
上传中...
上传图片
插入图片
抄袭、复制答案,以达到刷声望分或其他目的的行为,在CSDN问答是严格禁止的,一经发现立刻封号。是时候展现真正的技术了!
其他相关推荐
Error:(16, 32) 错误: 不兼容的类型: View无法转换为TextView,这是怎么回事?
package com.example.lm.myapplication; import android.support.v7.app.ActionBarActivity; import android.os.Bundle; import android.util.Log; import android.widget.TextView; public class MainActivity extends ActionBarActivity { //String TAG ="myTag"; TextView textView; @Override protected void onCreate(Bundle savedInstanceState) { super.onCreate(savedInstanceState); setContentView(R.layout.activity_main); textView = findViewById(R.id.textView); //Log.d(TAG, "执行了onCreate()方法"); } @Override protected void onStart() { super.onStart(); //Log.d(TAG, "执行了onStart()方法"); } @Override protected void onResume() { super.onResume(); //Log.d(TAG, "执行了onResume()方法"); } @Override protected void onPause() { super.onPause(); //Log.d(TAG, "执行了onPause()方法"); textView.setText("pause"); } @Override protected void onStop() { super.onStop(); //Log.d(TAG, "执行了onStop()方法"); } @Override protected void onRestart() { super.onRestart(); //Log.d(TAG, "执行了onRestart()方法"); } @Override protected void onDestroy() { super.onDestroy(); //Log.d(TAG, "执行了onDestroy()方法"); } } ``` ```
Error:warning: Ignoring InnerClasses
Information:Gradle tasks [:app:clean, :app:generateDebugSources, :app:mockableAndroidJar, :app:prepareDebugUnitTestDependencies, :app:generateDebugAndroidTestSources, :app:assembleDebug] Error:warning: Ignoring InnerClasses attribute for an anonymous inner class Error:(com.tencent.mm.opensdk.diffdev.a.b) that doesn't come with an Error:associated EnclosingMethod attribute. This class was probably produced by a Error:compiler that did not target the modern .class file format. The recommended Error:solution is to recompile the class from source, using an up-to-date compiler Error:and without specifying any "-target" type options. The consequence of ignoring Error:this warning is that reflective operations on this class will incorrectly Error:indicate that it is *not* an inner class. Error:warning: Ignoring InnerClasses attribute for an anonymous inner class Error:(com.tencent.mm.opensdk.diffdev.a.c) that doesn't come with an Error:associated EnclosingMethod attribute. This class was probably produced by a Error:compiler that did not target the modern .class file format. The recommended Error:solution is to recompile the class from source, using an up-to-date compiler Error:and without specifying any "-target" type options. The consequence of ignoring Error:this warning is that reflective operations on this class will incorrectly Error:indicate that it is *not* an inner class. Error:warning: Ignoring InnerClasses attribute for an anonymous inner class Error:(com.tencent.mm.opensdk.openapi.WXApiImplV10$1) that doesn't come with an Error:associated EnclosingMethod attribute. This class was probably produced by a Error:compiler that did not target the modern .class file format. The recommended Error:solution is to recompile the class from source, using an up-to-date compiler Error:and without specifying any "-target" type options. The consequence of ignoring Error:this warning is that reflective operations on this class will incorrectly Error:indicate that it is *not* an inner class. Error:warning: Ignoring InnerClasses attribute for an anonymous inner class Error:(com.tencent.mm.opensdk.openapi.WXApiImplV10$ActivityLifecycleCb$1) that doesn't come with an Error:associated EnclosingMethod attribute. This class was probably produced by a Error:compiler that did not target the modern .class file format. The recommended Error:solution is to recompile the class from source, using an up-to-date compiler Error:and without specifying any "-target" type options. The consequence of ignoring Error:this warning is that reflective operations on this class will incorrectly Error:indicate that it is *not* an inner class. Error:warning: Ignoring InnerClasses attribute for an anonymous inner class Error:(com.tencent.mm.opensdk.openapi.WXApiImplV10$ActivityLifecycleCb$2) that doesn't come with an Error:associated EnclosingMethod attribute. This class was probably produced by a Error:compiler that did not target the modern .class file format. The recommended Error:solution is to recompile the class from source, using an up-to-date compiler Error:and without specifying any "-target" type options. The consequence of ignoring Error:this warning is that reflective operations on this class will incorrectly Error:indicate that it is *not* an inner class. Information:BUILD SUCCESSFUL Information:Total time: 36.571 secs Information:40 errors Information:0 warnings Information:See complete output in console 大神们看下这个怎么解决, multiDexEnabled true,这个我已经加上了,application也加上了,上面的错误有一个com.tencent.mm.opensdk.diffdev.a.b提示,我是之前做微信第三方登陆加了他们的库,不知道是不是这个原因
Error:(68, 39) java: 不兼容的类型: com.easy.demo.entity.User无法转换为int
``` @RequestMapping(value = {"/loginUser"},method = RequestMethod.GET) public ModelAndView login(User user, HttpServletRequest request, HttpSession session) throws UnsupportedEncodingException, NoSuchAlgorithmException { int i=0; String s=user.getPassword(); String md=HexUtil.getEncryptedPwd(s); //对比数据库密码 user.setPassword(md); try { i=userMapper.loginUser(user); }catch (Exception e){ e.printStackTrace(); } System.out.println(i); if (i==1){ System.out.println("账号或密码输入错误"); }else { System.out.println("登陆成功"); } return null; } ``` 要如何转换?为什么我的这里会无法转换,我看别人的就可以啊?附上链接:https://blog.csdn.net/nihaoa50/article/details/61415945
请问:客户端访问服务器,报:Error: 请求的名称有效,但是找不到请求的类型的数据
请问:客户端访问服务器,报:Error: 请求的名称有效,但是找不到请求的类型的数据,怎么回事
运行Java程序时报错Error:(3001, 19) java: ncCommonSvc.AsyncClient.microprobe_call不是抽象的
运行Java程序时报错Error:(3001, 19) java: ncCommonSvc.AsyncClient.microprobe_call不是抽象的, 并且未覆盖org.apache.thrift.async.TAsyncMethodCall中的抽象方法getResult();Error:(3013, 19) java: ncCommonSvc.AsyncClient.microprobe_call中的getResult()无法覆盖org.apache.thrift.async.TAsyncMethodCall中的getResult()返回类型void与java.lang.Object不兼容 报这个错误可能是什么原因呢,代码是由C++转成java测试thrift接口的,所以应该不是代码本身的问题,是代码里面实现的方法与引入的thrift库有冲突么 没有接触过Java的小白求教,要用Jmeter工具才用Java的
Error:(35, 30) 错误: 找不到符号
我自定义了一个Convert,代码如下 public final class MyConvert extends Converter.Factory { private final Gson gson; public static MyConvert create(Gson gson) { return new MyConvert(gson); } public static MyConvert create(){ return create(new Gson()); } public MyConvert(Gson gson) { this.gson = gson; } @Override public Converter<ResponseBody, ?> responseBodyConverter(Type type, Annotation[] annotations, Retrofit retrofit) { TypeAdapter<?> adapter=gson.getAdapter(TypeToken.get(type)); return super.responseBodyConverter(type, annotations, retrofit); } } TypeAdapter<?> adapter=gson.getAdapter(TypeToken.get(type)); 这句代码死活编译不过去,报错信息如下: Error:(35, 30) 错误: 找不到符号 符号: 方法 getAdapter(TypeToken<CAP#1>) 位置: 类型为Gson的变量 gson 其中, CAP#1是新类型变量: CAP#1从?的捕获扩展Object 困扰了好几天,求大神帮忙解答~~~~
改了一个指针就出现了cpp(49) : error C2146: syntax error : missing ';' before identifier 'malloc'的报错,?
改了一个指针就出现了cpp(49) : error C2146: syntax error : missing ';' before identifier 'malloc'的报错,?改了一个指针就出现了cpp(49) : error C2146: syntax error : missing ';' before identifier 'malloc'的报错,?改了一个指针就出现了cpp(49) : error C2146: syntax error : missing ';' before identifier 'malloc'的报错,?
C语言报错error C2143: syntax error : missing ')' before '['怎么办
题目是一个数组只有大小写字母,要求转换大小写字母,用子函数实现 我写的代码如下: #include<stdio.h> void main() { char a[26]; int i; char ZH(a[26]); for(i=0;i<26;i++) { a[i]=i+'a'; } a[i]=ZH(a[26]); for(i=0;i<26;i++) printf("%d",a[i]); } char ZH(a[26]) { int n; for(n=o;n<26;n++) { a[n]=n+'a'+32; } return(a[26]); } 报错如下: C:\Users\SN-crush\Desktop\6.c(6) : error C2143: syntax error : missing ')' before '[' C:\Users\SN-crush\Desktop\6.c(6) : error C2090: function returns array C:\Users\SN-crush\Desktop\6.c(6) : error C2059: syntax error : ')' C:\Users\SN-crush\Desktop\6.c(13) : warning C4047: '=' : 'char ' differs in levels of indirection from 'char *' C:\Users\SN-crush\Desktop\6.c(19) : error C2143: syntax error : missing ')' before '[' C:\Users\SN-crush\Desktop\6.c(19) : error C2090: function returns array C:\Users\SN-crush\Desktop\6.c(19) : error C2059: syntax error : ')' C:\Users\SN-crush\Desktop\6.c(23) : error C2065: 'o' : undeclared identifier C:\Users\SN-crush\Desktop\6.c(24) : error C2109: subscript requires array or pointer type C:\Users\SN-crush\Desktop\6.c(24) : error C2106: '=' : left operand must be l-value C:\Users\SN-crush\Desktop\6.c(26) : error C2109: subscript requires array or pointer type C:\Users\SN-crush\Desktop\6.c(26) : warning C4047: 'return' : 'char *' differs in levels of indirection from 'int ' Error executing cl.exe. 6.obj - 10 error(s), 2 warning(s) 看不懂,这咋改you
mysql 数据库update时出错,错误代码 SQL ERROR :1213
mysql 数据库update时出错,错误代码 SQL ERROR :1213 SQLSTATE: 40001
请大神解决一下这个问题 php curl error:35 error:140770FC
cURL error 35: error:1408F10B:SSL routines:SSL3_GET_RECORD:wrong version number (see http://curl.haxx.se/libcurl/c/libcurl-errors.html) ![图片说明](https://img-ask.csdn.net/upload/201803/05/1520246872_229017.png) 各位大佬帮帮忙
App自动化报错:Proxy error: Could not proxy command to remote server. Original error: 404 - undefined
    App启动参数如下(存放在Yaml文件中): ``` automationName: UiAutomator2 platformName: Android platformVersion: 7 deviceName: Android Emulator appPackage: com.ellabook appActivity: com.ellabook.startup.StartActivity noReset: False unicodeKeyboard: True # 将键盘给隐藏起来 resetKeyboard: True ```      其他信息:       Appium 1.15       模拟器: 雷电模拟器4.0.7       测试框架: pytest conftest.py内容如下: ``` def basedriver(port=4723, **kwargs): """ 根据设置的参数,启动会话,并返回会话对象 :param port: 会话启动端口号---int :param kwargs: 启动参数 :return: 会话对象 """ yamls = YAML(typ='safe') yaml_path = os.path.join(CAPS_PATH, "desire_caps.yaml") fs = open(yaml_path, encoding='UTF-8') desire_caps = yamls.load(fs) if kwargs: for key, value in kwargs.items(): desire_caps[key] = value driver = webdriver.Remote("http://localhost:{}/wd/hub".format(port), desire_caps) return driver @pytest.fixture(scope="class") def initdriver_first_start(): """App首次启动""" driver = basedriver(noReset=False) yield driver driver.close() ```     测试用例py文件内容: ``` @pytest.mark.usefixtures("initdriver_first_start") class TestAPPStart: """APP启动页测试: 是否进入启动页 、banner图正常滑动、点击"开始看书吧"进入登录界面 """ def test_0_into_start(self, initdriver_first_start): """APP首次启动,启动页是否展示“开始阅读吧”按钮 """ driver = initdriver_first_start AppStartPage(driver).check_read_book_is_exist() def test_banner_left_slip(self, initdriver_first_start): """APP首次启动,启动页广告图能够向左滑""" driver = initdriver_first_start AppStartPage(driver).slide_start_banner("left") # App首次启动,banner广告图正常切换 def test_banner_right_slip(self, initdriver_first_start): """APP首次启动,启动页广告图能够能够向右滑""" driver = initdriver_first_start AppStartPage(driver).slide_start_banner("right") # App首次启动,banner广告图正常切换 def test_click_button(self, initdriver_first_start): """APP首次启动,点击开始按钮,查看是否进入登录界面""" driver = initdriver_first_start AppStartPage(driver).click_start_read() # 点击“开始阅读” 按钮 LoginPage(driver).check_into_login_idle() # 查看是否进入登录界面 ```     APP启动页测试 测试类(pytest/py.test方式)运行,此时用例执行完成后,在进行测试类的teardown时,却报错: selenium.common.exceptions.WebDriverException: Message: An unknown server-side error occurred while processing the command. Original error: Could not proxy. Proxy error: Could not proxy command to remote server. Original error: 404 - undefined ![图片说明](https://img-ask.csdn.net/upload/201912/26/1577335992_418416.png)  网上百度了一堆资料,但依旧没有相关: 404 - undefined 的报错类型的解决方法(忧伤)
SpringMVC解析MP4文件时报APR error: -730054或APR error: -730053异常,Chrome和IE能显示视频,Firefox显示不了
我重写了JstlView这个类,类名为DefaultJstlView,实现了里的checkResource方法,我用SpringMVC的DefaultJstlView来解析.jsp、.mp4视图,Chrome浏览器、IE浏览器、Firefox浏览器访问视频,结果用Chrome和IE测试时服务器报 APR error: -730054的异常,但能显示MP4视频文件,Firefox测试时却显示没有找到支持的视频格式和MINE类型,服务器也报 APR error: -730054的异常,怎么让Firefox浏览器在报 APR error: -730054的异常时能正常显示视频? 以下是错误信息: org.apache.catalina.connector.ClientAbortException: java.io.IOException: APR error: -730054 at org.apache.catalina.connector.OutputBuffer.realWriteBytes(OutputBuffer.java:396) at org.apache.tomcat.util.buf.ByteChunk.flushBuffer(ByteChunk.java:381) at org.apache.tomcat.util.buf.ByteChunk.append(ByteChunk.java:310) at org.apache.catalina.connector.OutputBuffer.writeBytes(OutputBuffer.java:421) at org.apache.catalina.connector.OutputBuffer.write(OutputBuffer.java:409) at org.apache.catalina.connector.CoyoteOutputStream.write(CoyoteOutputStream.java:97) at org.apache.catalina.servlets.DefaultServlet.copyRange(DefaultServlet.java:2219) at org.apache.catalina.servlets.DefaultServlet.copy(DefaultServlet.java:2053) at org.apache.catalina.servlets.DefaultServlet.serveResource(DefaultServlet.java:1015) at org.apache.catalina.servlets.DefaultServlet.doGet(DefaultServlet.java:410) at javax.servlet.http.HttpServlet.service(HttpServlet.java:622) at org.apache.catalina.servlets.DefaultServlet.service(DefaultServlet.java:390) at javax.servlet.http.HttpServlet.service(HttpServlet.java:729) at org.apache.catalina.core.ApplicationFilterChain.internalDoFilter(ApplicationFilterChain.java:292) at org.apache.catalina.core.ApplicationFilterChain.doFilter(ApplicationFilterChain.java:207) at org.apache.catalina.core.ApplicationDispatcher.invoke(ApplicationDispatcher.java:716) at org.apache.catalina.core.ApplicationDispatcher.processRequest(ApplicationDispatcher.java:466) at org.apache.catalina.core.ApplicationDispatcher.doForward(ApplicationDispatcher.java:358) at org.apache.catalina.core.ApplicationDispatcher.forward(ApplicationDispatcher.java:318) at org.springframework.web.servlet.resource.DefaultServletHttpRequestHandler.handleRequest(DefaultServletHttpRequestHandler.java:122) at org.springframework.web.servlet.mvc.HttpRequestHandlerAdapter.handle(HttpRequestHandlerAdapter.java:51) at org.springframework.web.servlet.DispatcherServlet.doDispatch(DispatcherServlet.java:943) at org.springframework.web.servlet.DispatcherServlet.doService(DispatcherServlet.java:877) at org.springframework.web.servlet.FrameworkServlet.processRequest(FrameworkServlet.java:966) at org.springframework.web.servlet.FrameworkServlet.doGet(FrameworkServlet.java:857) at javax.servlet.http.HttpServlet.service(HttpServlet.java:622) at org.springframework.web.servlet.FrameworkServlet.service(FrameworkServlet.java:842) at javax.servlet.http.HttpServlet.service(HttpServlet.java:729) at org.apache.catalina.core.ApplicationFilterChain.internalDoFilter(ApplicationFilterChain.java:292) at org.apache.catalina.core.ApplicationFilterChain.doFilter(ApplicationFilterChain.java:207) at org.apache.tomcat.websocket.server.WsFilter.doFilter(WsFilter.java:52) at org.apache.catalina.core.ApplicationFilterChain.internalDoFilter(ApplicationFilterChain.java:240) at org.apache.catalina.core.ApplicationFilterChain.doFilter(ApplicationFilterChain.java:207) at org.apache.catalina.core.ApplicationDispatcher.invoke(ApplicationDispatcher.java:716) at org.apache.catalina.core.ApplicationDispatcher.processRequest(ApplicationDispatcher.java:466) at org.apache.catalina.core.ApplicationDispatcher.doForward(ApplicationDispatcher.java:391) at org.apache.catalina.core.ApplicationDispatcher.forward(ApplicationDispatcher.java:318) at org.springframework.web.servlet.view.InternalResourceView.renderMergedOutputModel(InternalResourceView.java:168) at org.springframework.web.servlet.view.AbstractView.render(AbstractView.java:303) at org.springframework.web.servlet.DispatcherServlet.render(DispatcherServlet.java:1228) at org.springframework.web.servlet.DispatcherServlet.processDispatchResult(DispatcherServlet.java:1011) at org.springframework.web.servlet.DispatcherServlet.doDispatch(DispatcherServlet.java:955) at org.springframework.web.servlet.DispatcherServlet.doService(DispatcherServlet.java:877) at org.springframework.web.servlet.FrameworkServlet.processRequest(FrameworkServlet.java:966) at org.springframework.web.servlet.FrameworkServlet.doGet(FrameworkServlet.java:857) at javax.servlet.http.HttpServlet.service(HttpServlet.java:622) at org.springframework.web.servlet.FrameworkServlet.service(FrameworkServlet.java:842) at javax.servlet.http.HttpServlet.service(HttpServlet.java:729) at org.apache.catalina.core.ApplicationFilterChain.internalDoFilter(ApplicationFilterChain.java:292) at org.apache.catalina.core.ApplicationFilterChain.doFilter(ApplicationFilterChain.java:207) at org.apache.tomcat.websocket.server.WsFilter.doFilter(WsFilter.java:52) at org.apache.catalina.core.ApplicationFilterChain.internalDoFilter(ApplicationFilterChain.java:240) at org.apache.catalina.core.ApplicationFilterChain.doFilter(ApplicationFilterChain.java:207) at org.springframework.web.filter.CharacterEncodingFilter.doFilterInternal(CharacterEncodingFilter.java:88) at org.springframework.web.filter.OncePerRequestFilter.doFilter(OncePerRequestFilter.java:107) at org.apache.catalina.core.ApplicationFilterChain.internalDoFilter(ApplicationFilterChain.java:240) at org.apache.catalina.core.ApplicationFilterChain.doFilter(ApplicationFilterChain.java:207) at org.apache.catalina.core.StandardWrapperValve.invoke(StandardWrapperValve.java:212) at org.apache.catalina.core.StandardContextValve.invoke(StandardContextValve.java:94) at org.apache.catalina.authenticator.AuthenticatorBase.invoke(AuthenticatorBase.java:492) at org.apache.catalina.core.StandardHostValve.invoke(StandardHostValve.java:141) at org.apache.catalina.valves.ErrorReportValve.invoke(ErrorReportValve.java:80) at org.apache.catalina.valves.AbstractAccessLogValve.invoke(AbstractAccessLogValve.java:620) at org.apache.catalina.core.StandardEngineValve.invoke(StandardEngineValve.java:88) at org.apache.catalina.connector.CoyoteAdapter.service(CoyoteAdapter.java:502) at org.apache.coyote.http11.AbstractHttp11Processor.process(AbstractHttp11Processor.java:1152) at org.apache.coyote.AbstractProtocol$AbstractConnectionHandler.process(AbstractProtocol.java:684) at org.apache.tomcat.util.net.AprEndpoint$SocketProcessor.doRun(AprEndpoint.java:2527) at org.apache.tomcat.util.net.AprEndpoint$SocketProcessor.run(AprEndpoint.java:2516) at java.util.concurrent.ThreadPoolExecutor.runWorker(ThreadPoolExecutor.java:1149) at java.util.concurrent.ThreadPoolExecutor$Worker.run(ThreadPoolExecutor.java:624) at org.apache.tomcat.util.threads.TaskThread$WrappingRunnable.run(TaskThread.java:61) at java.lang.Thread.run(Thread.java:748)
Unexpected CUDA error: invalid argument
我在使用tensorflow-gpu时,运行如下的代码: ``` import tensorflow as tf a = tf.constant([1.0,2.0,3.0],shape = [3],name='a') print(a) ``` 能正确显示 ``tf.Tensor([1. 2. 3.], shape=(3,), dtype=float32)`` 但当我加入以下两行代码 ``` b = tf.constant([1.0,2.0,3.0], shape = [3],name='b') a+b ``` 会报如下的错误 ``` F tensorflow/stream_executor/cuda/cuda_driver.cc:209] Check failed: err == cudaSuccess || err == cudaErrorInvalidValue Unexpected CUDA error: invalid argument ``` 请大神帮忙解答
同样的代码code::blocks中运行正常,VSCODE中提示collect2.exe: error: ld returned 1 exit statuscollect2.exe: error: ld returned 1 exit status
一段C代码,在code::blocks中运行正常,但在VSCODE中提示C:\Users\ADMINI~1\AppData\Local\Temp\cc3JOmOu.o:test.cpp:(.text+0x93): undefined reference to `gen_Data(void*)' collect2.exe: error: ld returned 1 exit status 代码如下: 头文件: ``` //kpid.h .... typedef struct _Para { ..... } Para; void gen_Data(void *p); ``` .c文件 ``` //kpid.c #include "kpid.h" void gen_Data(void *p) { Para *pa = (Para *)p; ...... } ``` main ``` //main.c #include "kpid.h" int main() { Para p; p.menber1 = 10; //初始化 .... gen_Data(&p) } ``` 1、这段程序在Code::Blocks17.2 中能正常运行,可输出期望结果 2、将struct定义,gen_Data() 函数定义/实现都放到main.c文件中时(代码不变,仅放的位置移动),在vscode中也能正常运行。 3、但如上代码,定义、实现放在单独的.h,.c文件中,在main.c中包含头文件时,运行错误。提示如下。(函数名的拼写是正确的,没错) C:\Users\ADMINI~1\AppData\Local\Temp\cc3JOmOu.o:test.cpp:(.text+0x93): undefined reference to `gen_Data(void*)' collect2.exe: error: ld returned 1 exit status
idea改成eclipse编译报错Error:java: Internal error:
问题描述 **Error:java: Internal error:** java.lang.IllegalArgumentException at org.eclipse.jdt.internal.compiler.tool.EclipseFileManager.handleOption(EclipseFileManager.java:758) at java.compiler@11.0.3/javax.tools.ForwardingJavaFileManager.handleOption(ForwardingJavaFileManager.java:99) at org.jetbrains.jps.javac.JpsJavacFileManager.handleOption(JpsJavacFileManager.java:318) at org.jetbrains.jps.javac.JavacMain.compile(JavacMain.java:71) at org.jetbrains.jps.incremental.java.JavaBuilder.compileJava(JavaBuilder.java:460) at org.jetbrains.jps.incremental.java.JavaBuilder.compile(JavaBuilder.java:330) at org.jetbrains.jps.incremental.java.JavaBuilder.doBuild(JavaBuilder.java:255) at org.jetbrains.jps.incremental.java.JavaBuilder.build(JavaBuilder.java:213) at org.jetbrains.jps.incremental.IncProjectBuilder.runModuleLevelBuilders(IncProjectBuilder.java:1324) at org.jetbrains.jps.incremental.IncProjectBuilder.runBuildersForChunk(IncProjectBuilder.java:1004) at org.jetbrains.jps.incremental.IncProjectBuilder.buildTargetsChunk(IncProjectBuilder.java:1071) at org.jetbrains.jps.incremental.IncProjectBuilder.buildChunkIfAffected(IncProjectBuilder.java:965) at org.jetbrains.jps.incremental.IncProjectBuilder.buildChunks(IncProjectBuilder.java:794) at org.jetbrains.jps.incremental.IncProjectBuilder.runBuild(IncProjectBuilder.java:376) at org.jetbrains.jps.incremental.IncProjectBuilder.build(IncProjectBuilder.java:178) at org.jetbrains.jps.cmdline.BuildRunner.runBuild(BuildRunner.java:139) at org.jetbrains.jps.cmdline.BuildSession.runBuild(BuildSession.java:288) at org.jetbrains.jps.cmdline.BuildSession.run(BuildSession.java:121) at org.jetbrains.jps.cmdline.BuildMain$MyMessageHandler.lambda$channelRead0$0(BuildMain.java:228) at java.base/java.util.concurrent.ThreadPoolExecutor.runWorker(ThreadPoolExecutor.java:1128) at java.base/java.util.concurrent.ThreadPoolExecutor$Worker.run(ThreadPoolExecutor.java:628) at java.base/java.lang.Thread.run(Thread.java:834) 尝试的解决方法: 我所有Jdk版本都改过来了,如下 (https://blog.csdn.net/wo541075754/article/details/82119860 "") 还是不管用。 我用Javac能编译,不报这个错。但是这个项目必须用eclipse编译。 下面是我配置的版本 ![图片说明](https://img-ask.csdn.net/upload/201910/10/1570678333_670537.png)![图片说明](https://img-ask.csdn.net/upload/201910/10/1570678338_83497.png)![图片说明](https://img-ask.csdn.net/upload/201910/10/1570678344_612385.png)![图片说明](https://img-ask.csdn.net/upload/201910/10/1570678348_889029.png)
unix网络编程卷2门代码编译中报错:error: ‘door_arg_t’ undeclared (first use in this function),环境是centos6
gcc client1.c -lunpipc -lrt -ldoor client1.c: In function ‘main’: client1.c:8: error: ‘door_arg_t’ undeclared (first use in this function) client1.c:8: error: (Each undeclared identifier is reported only once client1.c:8: error: for each function it appears in.) client1.c:8: error: expected ‘;’ before ‘arg’ client1.c:17: error: ‘arg’ undeclared (first use in this function)
idea 写flutter app,重启电脑后项目便宜报错Error:Android Dex: [my_app] Unable to execute DX
当天晚上 项目编译运行正常,关机后,第二天打开项目编译失败, ``` Information:2019/4/17 22:49 - Compilation completed with 24 errors and 0 warnings in 4 s 598 ms Error:Android Dex: [my_app] Uncaught translation error: java.lang.IllegalArgumentException: already added: Lorg/gradle/cli/AbstractCommandLineConverter; Error:Android Dex: [my_app] Uncaught translation error: java.lang.IllegalArgumentException: already added: Lorg/gradle/cli/AbstractPropertiesCommandLineConverter; Error:Android Dex: [my_app] Uncaught translation error: java.lang.IllegalArgumentException: already added: Lorg/gradle/cli/CommandLineArgumentException; Error:Android Dex: [my_app] Uncaught translation error: java.lang.IllegalArgumentException: already added: Lorg/gradle/cli/CommandLineConverter; Error:Android Dex: [my_app] Uncaught translation error: java.lang.IllegalArgumentException: already added: Lorg/gradle/cli/CommandLineOption; Error:Android Dex: [my_app] Uncaught translation error: java.lang.IllegalArgumentException: already added: Lorg/gradle/cli/CommandLineParser; Error:Android Dex: [my_app] Uncaught translation error: java.lang.IllegalArgumentException: already added: Lorg/gradle/cli/CommandLineParser$1; Error:Android Dex: [my_app] Uncaught translation error: java.lang.IllegalArgumentException: already added: Lorg/gradle/cli/CommandLineParser$AfterFirstSubCommand; Error:Android Dex: [my_app] Uncaught translation error: java.lang.IllegalArgumentException: already added: Lorg/gradle/cli/CommandLineParser$AfterOptions; Error:Android Dex: [my_app] Unable to execute DX Error:Android Dex: [my_app] java.lang.RuntimeException: Translation has been interrupted Error:Android Dex: [my_app] at com.android.dx.command.dexer.Main.processAllFiles(Main.java:614) Error:Android Dex: [my_app] at com.android.dx.command.dexer.Main.runMonoDex(Main.java:310) Error:Android Dex: [my_app] at com.android.dx.command.dexer.Main.runDx(Main.java:288) Error:Android Dex: [my_app] at com.android.dx.command.dexer.Main.run(Main.java:264) Error:Android Dex: [my_app] at sun.reflect.NativeMethodAccessorImpl.invoke0(Native Method) Error:Android Dex: [my_app] at sun.reflect.NativeMethodAccessorImpl.invoke(NativeMethodAccessorImpl.java:62) Error:Android Dex: [my_app] at sun.reflect.DelegatingMethodAccessorImpl.invoke(DelegatingMethodAccessorImpl.java:43) Error:Android Dex: [my_app] at java.lang.reflect.Method.invoke(Method.java:498) Error:Android Dex: [my_app] at org.jetbrains.android.compiler.tools.AndroidDxRunner.runDex(AndroidDxRunner.java:201) Error:Android Dex: [my_app] at org.jetbrains.android.compiler.tools.AndroidDxRunner.main(AndroidDxRunner.java:349) Error:Android Dex: [my_app] Caused by: java.lang.InterruptedException: Too many errors Error:Android Dex: [my_app] at com.android.dx.command.dexer.Main.processAllFiles(Main.java:606) Error:Android Dex: [my_app] ... 9 more ``` ![图片说明](https://img-ask.csdn.net/upload/201904/17/1555514999_883791.png) 请教大神解决!!
linux下qt中opencv打开摄像头HIGHGUI ERROR:OpenCV Error:
我在Ubuntu下用qt结合opencv做一个人眼状态识别的程序,qt做界面,程序在vs控制台环境下已经可以运行,但是qt下出错。错误信息 如下: HIGHGUI ERROR: V4L/V4L2: VIDIOC_S_CROP OpenCV Error: Assertion failed (scn == 3 || scn == 4) in cvtColor, file /home/mkc/opencv/opencvinstallor/opencv-2.4.9/modules/imgproc/src/color.cpp, line 3737 Qt has caught an exception thrown from an event handler. Throwing exceptions from an event handler is not supported in Qt. You must reimplement QApplication::notify() and catch all exceptions there. 1. 我的程序思路是用opencv打开摄像头并捕捉每一帧,做完处理,最后在qt的label上显示,其间做了一个mat到QImage的转换, 2.用opencv官方程序圈出人脸。我单纯的将这一步写进qt运行没问题,能将摄像头显示在label上,但是将自己完整的一直到人眼状态识别代码写进去就报错。 3.中间用了opencv新版的Mat格式,也用了IplImage的图像格式,在Ubuntu下单纯编译也没错,但是到了qt下就闪退。 4.我百度得到的可能性是:如果有空帧的话,cvtColor会报错,后来我将 if( !frame.empty() )写在打开摄像头后还是报错。 我自己根本不太懂opencv和qt,所以一直没解决,会不会是是mat还有IplImage、QImage三种格式之间转换出了问题。 希望各位遇见过的各位能给与帮助,不甚感激。
ERROR: Unable to resolve dependency for' 问题
谁帮我看看是什么原因 ``` compileClasspath': Failed to transform artifact 'espresso-core.aar (androidx.test.espresso:espresso-core:3.1.1)' to match attributes {artifactType=jar}. Show Details Affected Modules: app ERROR: Unable to resolve dependency for ':app@debugAndroidTest/compileClasspath': Failed to transform artifact 'runner.aar (androidx.test:runner:1.1.1)' to match attributes {artifactType=jar}. Show Details Affected Modules: app ERROR: Unable to resolve dependency for ':app@debugAndroidTest/compileClasspath': Failed to transform artifact 'monitor.aar (androidx.test:monitor:1.1.1)' to match attributes {artifactType=jar}. Show Details Affected Modules: app ERROR: Unable to resolve dependency for ':app@debugAndroidTest/compileClasspath': Failed to transform artifact 'espresso-idling-resource.aar (androidx.test.espresso:espresso-idling-resource:3.1.1)' to match attributes {artifactType=jar}. Show Details Affected Modules: app ```
Java学习的正确打开方式
在博主认为,对于入门级学习java的最佳学习方法莫过于视频+博客+书籍+总结,前三者博主将淋漓尽致地挥毫于这篇博客文章中,至于总结在于个人,实际上越到后面你会发现学习的最好方式就是阅读参考官方文档其次就是国内的书籍,博客次之,这又是一个层次了,这里暂时不提后面再谈。博主将为各位入门java保驾护航,各位只管冲鸭!!!上天是公平的,只要不辜负时间,时间自然不会辜负你。 何谓学习?博主所理解的学习,它是一个过程,是一个不断累积、不断沉淀、不断总结、善于传达自己的个人见解以及乐于分享的过程。
程序员必须掌握的核心算法有哪些?
由于我之前一直强调数据结构以及算法学习的重要性,所以就有一些读者经常问我,数据结构与算法应该要学习到哪个程度呢?,说实话,这个问题我不知道要怎么回答你,主要取决于你想学习到哪些程度,不过针对这个问题,我稍微总结一下我学过的算法知识点,以及我觉得值得学习的算法。这些算法与数据结构的学习大多数是零散的,并没有一本把他们全部覆盖的书籍。下面是我觉得值得学习的一些算法以及数据结构,当然,我也会整理一些看过...
大学四年自学走来,这些私藏的实用工具/学习网站我贡献出来了
大学四年,看课本是不可能一直看课本的了,对于学习,特别是自学,善于搜索网上的一些资源来辅助,还是非常有必要的,下面我就把这几年私藏的各种资源,网站贡献出来给你们。主要有:电子书搜索、实用工具、在线视频学习网站、非视频学习网站、软件下载、面试/求职必备网站。 注意:文中提到的所有资源,文末我都给你整理好了,你们只管拿去,如果觉得不错,转发、分享就是最大的支持了。 一、电子书搜索 对于大部分程序员...
linux系列之常用运维命令整理笔录
本博客记录工作中需要的linux运维命令,大学时候开始接触linux,会一些基本操作,可是都没有整理起来,加上是做开发,不做运维,有些命令忘记了,所以现在整理成博客,当然vi,文件操作等就不介绍了,慢慢积累一些其它拓展的命令,博客不定时更新 free -m 其中:m表示兆,也可以用g,注意都要小写 Men:表示物理内存统计 total:表示物理内存总数(total=used+free) use...
比特币原理详解
一、什么是比特币 比特币是一种电子货币,是一种基于密码学的货币,在2008年11月1日由中本聪发表比特币白皮书,文中提出了一种去中心化的电子记账系统,我们平时的电子现金是银行来记账,因为银行的背后是国家信用。去中心化电子记账系统是参与者共同记账。比特币可以防止主权危机、信用风险。其好处不多做赘述,这一层面介绍的文章很多,本文主要从更深层的技术原理角度进行介绍。 二、问题引入 假设现有4个人...
程序员接私活怎样防止做完了不给钱?
首先跟大家说明一点,我们做 IT 类的外包开发,是非标品开发,所以很有可能在开发过程中会有这样那样的需求修改,而这种需求修改很容易造成扯皮,进而影响到费用支付,甚至出现做完了项目收不到钱的情况。 那么,怎么保证自己的薪酬安全呢? 我们在开工前,一定要做好一些证据方面的准备(也就是“讨薪”的理论依据),这其中最重要的就是需求文档和验收标准。一定要让需求方提供这两个文档资料作为开发的基础。之后开发...
网页实现一个简单的音乐播放器(大佬别看。(⊙﹏⊙))
今天闲着无事,就想写点东西。然后听了下歌,就打算写个播放器。 于是乎用h5 audio的加上js简单的播放器完工了。 演示地点演示 html代码如下` music 这个年纪 七月的风 音乐 ` 然后就是css`*{ margin: 0; padding: 0; text-decoration: none; list-...
Python十大装B语法
Python 是一种代表简单思想的语言,其语法相对简单,很容易上手。不过,如果就此小视 Python 语法的精妙和深邃,那就大错特错了。本文精心筛选了最能展现 Python 语法之精妙的十个知识点,并附上详细的实例代码。如能在实战中融会贯通、灵活使用,必将使代码更为精炼、高效,同时也会极大提升代码B格,使之看上去更老练,读起来更优雅。
数据库优化 - SQL优化
以实际SQL入手,带你一步一步走上SQL优化之路!
通俗易懂地给女朋友讲:线程池的内部原理
餐盘在灯光的照耀下格外晶莹洁白,女朋友拿起红酒杯轻轻地抿了一小口,对我说:“经常听你说线程池,到底线程池到底是个什么原理?”
经典算法(5)杨辉三角
杨辉三角 是经典算法,这篇博客对它的算法思想进行了讲解,并有完整的代码实现。
使用 Docker 部署 Spring Boot 项目
Docker 技术发展为微服务落地提供了更加便利的环境,使用 Docker 部署 Spring Boot 其实非常简单,这篇文章我们就来简单学习下。首先构建一个简单的 S...
英特尔不为人知的 B 面
从 PC 时代至今,众人只知在 CPU、GPU、XPU、制程、工艺等战场中,英特尔在与同行硬件芯片制造商们的竞争中杀出重围,且在不断的成长进化中,成为全球知名的半导体公司。殊不知,在「刚硬」的背后,英特尔「柔性」的软件早已经做到了全方位的支持与支撑,并持续发挥独特的生态价值,推动产业合作共赢。 而对于这一不知人知的 B 面,很多人将其称之为英特尔隐形的翅膀,虽低调,但是影响力却不容小觑。 那么,在...
面试官:你连RESTful都不知道我怎么敢要你?
干货,2019 RESTful最贱实践
刷了几千道算法题,这些我私藏的刷题网站都在这里了!
遥想当年,机缘巧合入了 ACM 的坑,周边巨擘林立,从此过上了"天天被虐似死狗"的生活… 然而我是谁,我可是死狗中的战斗鸡,智力不够那刷题来凑,开始了夜以继日哼哧哼哧刷题的日子,从此"读题与提交齐飞, AC 与 WA 一色 ",我惊喜的发现被题虐既刺激又有快感,那一刻我泪流满面。这么好的事儿作为一个正直的人绝不能自己独享,经过激烈的颅内斗争,我决定把我私藏的十几个 T 的,阿不,十几个刷题网...
白话阿里巴巴Java开发手册高级篇
不久前,阿里巴巴发布了《阿里巴巴Java开发手册》,总结了阿里巴巴内部实际项目开发过程中开发人员应该遵守的研发流程规范,这些流程规范在一定程度上能够保证最终的项目交付质量,通过在时间中总结模式,并推广给广大开发人员,来避免研发人员在实践中容易犯的错误,确保最终在大规模协作的项目中达成既定目标。 无独有偶,笔者去年在公司里负责升级和制定研发流程、设计模板、设计标准、代码标准等规范,并在实际工作中进行...
SQL-小白最佳入门sql查询一
不要偷偷的查询我的个人资料,即使你再喜欢我,也不要这样,真的不好;
redis分布式锁,面试官请随便问,我都会
文章有点长并且绕,先来个图片缓冲下! 前言 现在的业务场景越来越复杂,使用的架构也就越来越复杂,分布式、高并发已经是业务要求的常态。像腾讯系的不少服务,还有CDN优化、异地多备份等处理。 说到分布式,就必然涉及到分布式锁的概念,如何保证不同机器不同线程的分布式锁同步呢? 实现要点 互斥性,同一时刻,智能有一个客户端持有锁。 防止死锁发生,如果持有锁的客户端崩溃没有主动释放锁,也要保证锁可以正常释...
项目中的if else太多了,该怎么重构?
介绍 最近跟着公司的大佬开发了一款IM系统,类似QQ和微信哈,就是聊天软件。我们有一部分业务逻辑是这样的 if (msgType = "文本") { // dosomething } else if(msgType = "图片") { // doshomething } else if(msgType = "视频") { // doshomething } else { // doshom...
Nginx 原理和架构
Nginx 是一个免费的,开源的,高性能的 HTTP 服务器和反向代理,以及 IMAP / POP3 代理服务器。Nginx 以其高性能,稳定性,丰富的功能,简单的配置和低资源消耗而闻名。 Nginx 的整体架构 Nginx 里有一个 master 进程和多个 worker 进程。master 进程并不处理网络请求,主要负责调度工作进程:加载配置、启动工作进程及非停升级。worker 进程负责处...
“狗屁不通文章生成器”登顶GitHub热榜,分分钟写出万字形式主义大作
一、垃圾文字生成器介绍 最近在浏览GitHub的时候,发现了这样一个骨骼清奇的雷人项目,而且热度还特别高。 项目中文名:狗屁不通文章生成器 项目英文名:BullshitGenerator 根据作者的介绍,他是偶尔需要一些中文文字用于GUI开发时测试文本渲染,因此开发了这个废话生成器。但由于生成的废话实在是太过富于哲理,所以最近已经被小伙伴们给玩坏了。 他的文风可能是这样的: 你发现,...
程序员:我终于知道post和get的区别
是一个老生常谈的话题,然而随着不断的学习,对于以前的认识有很多误区,所以还是需要不断地总结的,学而时习之,不亦说乎
《程序人生》系列-这个程序员只用了20行代码就拿了冠军
你知道的越多,你不知道的越多 点赞再看,养成习惯GitHub上已经开源https://github.com/JavaFamily,有一线大厂面试点脑图,欢迎Star和完善 前言 这一期不算《吊打面试官》系列的,所有没前言我直接开始。 絮叨 本来应该是没有这期的,看过我上期的小伙伴应该是知道的嘛,双十一比较忙嘛,要值班又要去帮忙拍摄年会的视频素材,还得搞个程序员一天的Vlog,还要写BU...
加快推动区块链技术和产业创新发展,2019可信区块链峰会在京召开
11月8日,由中国信息通信研究院、中国通信标准化协会、中国互联网协会、可信区块链推进计划联合主办,科技行者协办的2019可信区块链峰会将在北京悠唐皇冠假日酒店开幕。   区块链技术被认为是继蒸汽机、电力、互联网之后,下一代颠覆性的核心技术。如果说蒸汽机释放了人类的生产力,电力解决了人类基本的生活需求,互联网彻底改变了信息传递的方式,区块链作为构造信任的技术有重要的价值。   1...
Java世界最常用的工具类库
Apache Commons Apache Commons有很多子项目 Google Guava 参考博客
程序员把地府后台管理系统做出来了,还有3.0版本!12月7号最新消息:已在开发中有github地址
第一幕:缘起 听说阎王爷要做个生死簿后台管理系统,我们派去了一个程序员…… 996程序员做的梦: 第一场:团队招募 为了应对地府管理危机,阎王打算找“人”开发一套地府后台管理系统,于是就在地府总经办群中发了项目需求。 话说还是中国电信的信号好,地府都是满格,哈哈!!! 经常会有外行朋友问:看某网站做的不错,功能也简单,你帮忙做一下? 而这次,面对这样的需求,这个程序员...
网易云6亿用户音乐推荐算法
网易云音乐是音乐爱好者的集聚地,云音乐推荐系统致力于通过 AI 算法的落地,实现用户千人千面的个性化推荐,为用户带来不一样的听歌体验。 本次分享重点介绍 AI 算法在音乐推荐中的应用实践,以及在算法落地过程中遇到的挑战和解决方案。 将从如下两个部分展开: AI算法在音乐推荐中的应用 音乐场景下的 AI 思考 从 2013 年 4 月正式上线至今,网易云音乐平台持续提供着:乐屏社区、UGC...
【技巧总结】位运算装逼指南
位算法的效率有多快我就不说,不信你可以去用 10 亿个数据模拟一下,今天给大家讲一讲位运算的一些经典例子。不过,最重要的不是看懂了这些例子就好,而是要在以后多去运用位运算这些技巧,当然,采用位运算,也是可以装逼的,不信,你往下看。我会从最简单的讲起,一道比一道难度递增,不过居然是讲技巧,那么也不会太难,相信你分分钟看懂。 判断奇偶数 判断一个数是基于还是偶数,相信很多人都做过,一般的做法的代码如下...
为什么要学数据结构?
一、前言 在可视化化程序设计的今天,借助于集成开发环境可以很快地生成程序,程序设计不再是计算机专业人员的专利。很多人认为,只要掌握几种开发工具就可以成为编程高手,其实,这是一种误解。要想成为一个专业的开发人员,至少需要以下三个条件: 1) 能够熟练地选择和设计各种数据结构和算法 2) 至少要能够熟练地掌握一门程序设计语言 3) 熟知所涉及的相关应用领域的知识 其中,后两个条件比较容易实现,而第一个...
Android 9.0 init 启动流程
阅读五分钟,每日十点,和您一起终身学习,这里是程序员Android本篇文章主要介绍Android开发中的部分知识点,通过阅读本篇文章,您将收获以下内容:一、启动流程概述一、 启动流程概述Android启动流程跟Linux启动类似,大致分为如下五个阶段。1.开机上电,加载固化的ROM。2.加载BootLoader,拉起Android OS。3.加载Uboot,初始外设,引导Kernel启动等。...
相关热词 c#中dns类 c#合并的excel c# implicit c#怎么保留3个小数点 c# 串口通信、 网络调试助手c# c# 泛型比较大小 c#解压分卷问题 c#启动居中 c# 逻辑或运算符
立即提问