maven 怎么引入jave-1.0.2.jar

maven 怎么引入jave-1.0.2.jar
我要使用import it.sauronsoftware这个包里的类

4个回答

这个包没有在maven私服中。先考虑进行下载http://download.csdn.net/detail/xiaofei_9070/9650294

再考虑使用maven依赖本地jar解决此问题。http://blog.csdn.net/chs_jdmdr/article/details/7467305

jar转maven命令(jar所在位置执行):
mvn install:install-file -Dfile=jave-1.0.2.jar -DgroupId=joinery -DartifactId=jave -Dversion=1.0.2 -Dpackaging=jar

http://blog.csdn.net/PGKE915/article/details/69951905 看看这里的方法 先下载到本地


esn
jave2-windows
1.1

图片说明

Csdn user default icon
上传中...
上传图片
插入图片
抄袭、复制答案,以达到刷声望分或其他目的的行为,在CSDN问答是严格禁止的,一经发现立刻封号。是时候展现真正的技术了!
其他相关推荐
apache-maven-3.2.5安装后运行报错
maven版本是最新的apache-maven-3.2.5,jdk版本32位jdk1.6u22. ![报错信息如图](https://img-ask.csdn.net/upload/201501/27/1422366382_964553.png) ![环境变量如图](https://img-ask.csdn.net/upload/201501/27/1422366666_753576.png) 由于提示没有找到org/apache/commons/cli/ParseException的定义 尝试解决方案:下载commons-cli-1.0.jar放到classpath中未能解决. 有没有谁碰到过,请高手指点或提供解决思路.
sapjco3-3.0.jar maven打包时 提示程序包com.sap.conn.jco不存在
我已经在pom.xml中加入了依赖路径 <dependency> <groupId>org.hibersap</groupId> <artifactId>sapjco3</artifactId> <version>3.0</version> </dependency> 本地的maven_repository里也下载下来了D:\mavenrepository\org\hibersap\sapjco3\3.0\sapjco3-3.0.jar sapjco3-3.0.pom等 为什么还是无法打包![图片说明](https://img-ask.csdn.net/upload/201606/08/1465376390_823860.png)
maven中一直提示缺少maven-resources-plugin-2.6的问题
我在netbeans中新建了一个maven工程,请问为什么每次编译后,都显示缺少maven-resources-plugin-2.6的错误?.m2中的依赖包里明明有这个jar包,而且我在工程里也反复添加好几次了,但是一运行程序,就会出现缺少这个jar的错误。
maven tomcat 6 servlet-api.jar和jsp-api.jar这两个包冲突
解决方法1:<scope>provided</scope> 解决方法2 : 删除jar包 在网上找了好到方法,都不行 注意:我在本地可以,但是放到服务器上就不行了 本地是win7系统,服务器上是windows_server_2008_R2 请大神们帮我解决一下,谢谢!
idea运行maven项目报错:WARNING [RMI TCP Connection(3)-127.0.0.1]
## 下面是控制台报错的一部分,其他的都是一样的错,不知道什么原因! 08-Jan-2019 16:01:33.442 WARNING [RMI TCP Connection(3)-127.0.0.1] org.apache.catalina.webresources.Cache.getResource Unable to add the resource at [/WEB-INF/lib/spring-tx-4.2.6.RELEASE.jar] to the cache because there was insufficient free space available after evicting expired cache entries - consider increasing the maximum size of the cache 08-Jan-2019 16:01:33.446 WARNING [RMI TCP Connection(3)-127.0.0.1] org.apache.catalina.webresources.Cache.getResource Unable to add the resource at [/WEB-INF/lib/validation-api-1.1.0.Final.jar] to the cache because there was insufficient free space available after evicting expired cache entries - consider increasing the maximum size of the cache 08-Jan-2019 16:01:33.448 WARNING [RMI TCP Connection(3)-127.0.0.1] org.apache.catalina.webresources.Cache.getResource Unable to add the resource at [/WEB-INF/lib/wechat-sdk-android-with-mta-1.0.2.jar] to the cache because there was insufficient free space available after evicting expired cache entries - consider increasing the maximum size of the cache 08-Jan-2019 16:01:33.451 WARNING [RMI TCP Connection(3)-127.0.0.1] org.apache.catalina.webresources.Cache.getResource Unable to add the resource at [/WEB-INF/lib/xml-apis-1.3.04.jar] to the cache because there was insufficient free space available after evicting expired cache entries - consider increasing the maximum size of the cache 08-Jan-2019 16:01:33.455 WARNING [RMI TCP Connection(3)-127.0.0.1] org.apache.catalina.webresources.Cache.getResource Unable to add the resource at [/WEB-INF/lib/xml-apis-ext-1.3.04.jar] to the cache because there was insufficient free space available after evicting expired cache entries - consider increasing the maximum size of the cache 08-Jan-2019 16:01:35.887 WARNING [RMI TCP Connection(3)-127.0.0.1] org.apache.catalina.webresources.Cache.getResource Unable to add the resource at [/WEB-INF/classes] to the cache because there was insufficient free space available after evicting expired cache entries - consider increasing the maximum size of the cache
spring-boot-starter-web-2.1.7.RELEASE.jar的依赖问题
spring-boot-starter-web-2.1.7.RELEASE.jar包下只有一个META-INF/MANIFEST.MF文件,maven是怎么知道它依赖了spring-web,spring-mvc的?
hudson3.1.2+maven3.1.1 构建异常,内容如下,求指导
Started by user anonymous Updating svn://172.17.199.42/Bidding/test At revision 726 no change for svn://172.17.199.42/Bidding/test since the previous build Parsing POMs [test] $ C:\Java\jdk1.7.0_51/bin/java -cp D:\hudson\plugins\maven-plugin\WEB-INF\lib\maven-agent-1.384.jar;D:\apache-maven-3.1.1\boot\plexus-classworlds-2.5.1.jar hudson.maven.agent.Main D:\apache-maven-3.1.1 D:\apache-tomcat-7.0.52\webapps\hudson\WEB-INF\lib\remoting-1.384.jar D:\hudson\plugins\maven-plugin\WEB-INF\lib\maven-interceptor-1.384.jar 58704 Exception in thread "main" java.lang.NoSuchMethodError: org.codehaus.classworlds.Launcher.getWorld()Lorg/codehaus/classworlds/ClassWorld; at hudson.maven.agent.Main.main(Main.java:115) at hudson.maven.agent.Main.main(Main.java:62) ERROR: Failed to launch Maven. Exit code = 1 Finished: FAILURE 在网上找不到此类型的错误,如有 帮助,不胜感激
maven配置私服打包报错Failed to execute goal org.apache.maven.plugins:maven-compiler-plugin:3.5:compile
直接使用阿里云镜像仓库打包没问题,替换为私服镜像仓库后报错: 就是pom.xml中的plugin报错 ``` <plugin> <groupId>org.apache.maven.plugins</groupId> <artifactId>maven-compiler-plugin</artifactId> <version>3.5</version> <configuration> <source>1.8</source> <target>1.8</target> <encoding>UTF-8</encoding> </configuration> </plugin> ``` 网上找了半天说这个指定的jdk版本的问题,查了一下版本没问题都是1.8 报错内容: [ERROR] Failed to execute goal org.apache.maven.plugins:maven-compiler-plugin:3.5:compile (default-compile) on project mytest-web: Execution default-compile of goal org.apache.maven.plugins:maven-compiler-plugin:3.5:compile failed: Plugin org.apache.maven.plugins:maven-compiler-plugin:3.5 or one of its dependencies could not be resolved: Failed to collect dependencies at org.apache.maven.plugins:maven-compiler-plugin:jar:3.5 -> org.apache.maven:maven-toolchain:jar:2.2.1 -> org.apache.maven:maven-core:jar:2.2.1 -> commons-cli:commons-cli:jar:1.2: Failed to read artifact descriptor for commons-cli:commons-cli:jar:1.2: Failure to find org.apache:apache:pom:4 in http://localhost:8081/nexus/content/groups/public/ was cached in the local repository, resolution will not be reattempted until the update interval of public has elapsed or updates are forced -> [Help 1] org.apache.maven.lifecycle.LifecycleExecutionException: Failed to execute goal org.apache.maven.plugins:maven-compiler-plugin:3.5:compile (default-compile) on project mytest-web: Execution default-compile of goal org.apache.maven.plugins:maven-compiler-plugin:3.5:compile failed: Plugin org.apache.maven.plugins:maven-compiler-plugin:3.5 or one of its dependencies could not be resolved: Failed to collect dependencies at org.apache.maven.plugins:maven-compiler-plugin:jar:3.5 -> org.apache.maven:maven-toolchain:jar:2.2.1 -> org.apache.maven:maven-core:jar:2.2.1 -> commons-cli:commons-cli:jar:1.2 at org.apache.maven.lifecycle.internal.MojoExecutor.execute(MojoExecutor.java:213) at org.apache.maven.lifecycle.internal.MojoExecutor.execute(MojoExecutor.java:154) at org.apache.maven.lifecycle.internal.MojoExecutor.execute(MojoExecutor.java:146) at org.apache.maven.lifecycle.internal.LifecycleModuleBuilder.buildProject(LifecycleModuleBuilder.java:117) at org.apache.maven.lifecycle.internal.LifecycleModuleBuilder.buildProject(LifecycleModuleBuilder.java:81) at org.apache.maven.lifecycle.internal.builder.singlethreaded.SingleThreadedBuilder.build(SingleThreadedBuilder.java:51) at org.apache.maven.lifecycle.internal.LifecycleStarter.execute(LifecycleStarter.java:128) at org.apache.maven.DefaultMaven.doExecute(DefaultMaven.java:309) at org.apache.maven.DefaultMaven.doExecute(DefaultMaven.java:194) at org.apache.maven.DefaultMaven.execute(DefaultMaven.java:107) at org.apache.maven.cli.MavenCli.execute(MavenCli.java:993) at org.apache.maven.cli.MavenCli.doMain(MavenCli.java:345) at org.apache.maven.cli.MavenCli.main(MavenCli.java:191) at sun.reflect.NativeMethodAccessorImpl.invoke0(Native Method) at sun.reflect.NativeMethodAccessorImpl.invoke(NativeMethodAccessorImpl.java:62) at sun.reflect.DelegatingMethodAccessorImpl.invoke(DelegatingMethodAccessorImpl.java:43) at java.lang.reflect.Method.invoke(Method.java:498) at org.codehaus.plexus.classworlds.launcher.Launcher.launchEnhanced(Launcher.java:289) at org.codehaus.plexus.classworlds.launcher.Launcher.launch(Launcher.java:229) at org.codehaus.plexus.classworlds.launcher.Launcher.mainWithExitCode(Launcher.java:415) at org.codehaus.plexus.classworlds.launcher.Launcher.main(Launcher.java:356) Caused by: org.apache.maven.plugin.PluginExecutionException: Execution default-compile of goal org.apache.maven.plugins:maven-compiler-plugin:3.5:compile failed: Plugin org.apache.maven.plugins:maven-compiler-plugin:3.5 or one of its dependencies could not be resolved: Failed to collect dependencies at org.apache.maven.plugins:maven-compiler-plugin:jar:3.5 -> org.apache.maven:maven-toolchain:jar:2.2.1 -> org.apache.maven:maven-core:jar:2.2.1 -> commons-cli:commons-cli:jar:1.2 at org.apache.maven.plugin.DefaultBuildPluginManager.executeMojo(DefaultBuildPluginManager.java:106) at org.apache.maven.lifecycle.internal.MojoExecutor.execute(MojoExecutor.java:208) ... 20 more Caused by: org.apache.maven.plugin.PluginResolutionException: Plugin org.apache.maven.plugins:maven-compiler-plugin:3.5 or one of its dependencies could not be resolved: Failed to collect dependencies at org.apache.maven.plugins:maven-compiler-plugin:jar:3.5 -> org.apache.maven:maven-toolchain:jar:2.2.1 -> org.apache.maven:maven-core:jar:2.2.1 -> commons-cli:commons-cli:jar:1.2 at org.apache.maven.plugin.internal.DefaultPluginDependenciesResolver.resolveInternal(DefaultPluginDependenciesResolver.java:214) at org.apache.maven.plugin.internal.DefaultPluginDependenciesResolver.resolve(DefaultPluginDependenciesResolver.java:149) at org.apache.maven.plugin.internal.DefaultMavenPluginManager.createPluginRealm(DefaultMavenPluginManager.java:402) at org.apache.maven.plugin.internal.DefaultMavenPluginManager.setupPluginRealm(DefaultMavenPluginManager.java:374) at org.apache.maven.plugin.DefaultBuildPluginManager.getPluginRealm(DefaultBuildPluginManager.java:231) at org.apache.maven.plugin.DefaultBuildPluginManager.executeMojo(DefaultBuildPluginManager.java:102) ... 21 more Caused by: org.eclipse.aether.collection.DependencyCollectionException: Failed to collect dependencies at org.apache.maven.plugins:maven-compiler-plugin:jar:3.5 -> org.apache.maven:maven-toolchain:jar:2.2.1 -> org.apache.maven:maven-core:jar:2.2.1 -> commons-cli:commons-cli:jar:1.2 at org.eclipse.aether.internal.impl.DefaultDependencyCollector.collectDependencies(DefaultDependencyCollector.java:300) at org.eclipse.aether.internal.impl.DefaultRepositorySystem.collectDependencies(DefaultRepositorySystem.java:325) at org.apache.maven.plugin.internal.DefaultPluginDependenciesResolver.resolveInternal(DefaultPluginDependenciesResolver.java:202) ... 26 more Caused by: org.eclipse.aether.resolution.ArtifactDescriptorException: Failed to read artifact descriptor for commons-cli:commons-cli:jar:1.2 at org.apache.maven.repository.internal.DefaultArtifactDescriptorReader.loadPom(DefaultArtifactDescriptorReader.java:330) at org.apache.maven.repository.internal.DefaultArtifactDescriptorReader.readArtifactDescriptor(DefaultArtifactDescriptorReader.java:199) at org.eclipse.aether.internal.impl.DefaultDependencyCollector.resolveCachedArtifactDescriptor(DefaultDependencyCollector.java:544) at org.eclipse.aether.internal.impl.DefaultDependencyCollector.getArtifactDescriptorResult(DefaultDependencyCollector.java:528) at org.eclipse.aether.internal.impl.DefaultDependencyCollector.processDependency(DefaultDependencyCollector.java:418) at org.eclipse.aether.internal.impl.DefaultDependencyCollector.processDependency(DefaultDependencyCollector.java:372) at org.eclipse.aether.internal.impl.DefaultDependencyCollector.process(DefaultDependencyCollector.java:360) at org.eclipse.aether.internal.impl.DefaultDependencyCollector.doRecurse(DefaultDependencyCollector.java:513) at org.eclipse.aether.internal.impl.DefaultDependencyCollector.processDependency(DefaultDependencyCollector.java:467) at org.eclipse.aether.internal.impl.DefaultDependencyCollector.processDependency(DefaultDependencyCollector.java:372) at org.eclipse.aether.internal.impl.DefaultDependencyCollector.process(DefaultDependencyCollector.java:360) at org.eclipse.aether.internal.impl.DefaultDependencyCollector.doRecurse(DefaultDependencyCollector.java:513) at org.eclipse.aether.internal.impl.DefaultDependencyCollector.processDependency(DefaultDependencyCollector.java:467) at org.eclipse.aether.internal.impl.DefaultDependencyCollector.processDependency(DefaultDependencyCollector.java:372) at org.eclipse.aether.internal.impl.DefaultDependencyCollector.process(DefaultDependencyCollector.java:360) at org.eclipse.aether.internal.impl.DefaultDependencyCollector.collectDependencies(DefaultDependencyCollector.java:263) ... 28 more Caused by: org.apache.maven.model.resolution.UnresolvableModelException: Failure to find org.apache:apache:pom:4 in http://localhost:8081/nexus/content/groups/public/ was cached in the local repository, resolution will not be reattempted until the update interval of public has elapsed or updates are forced at org.apache.maven.repository.internal.DefaultModelResolver.resolveModel(DefaultModelResolver.java:178) at org.apache.maven.repository.internal.DefaultModelResolver.resolveModel(DefaultModelResolver.java:224) at org.apache.maven.model.building.DefaultModelBuilder.readParentExternally(DefaultModelBuilder.java:1051) at org.apache.maven.model.building.DefaultModelBuilder.readParent(DefaultModelBuilder.java:829) at org.apache.maven.model.building.DefaultModelBuilder.build(DefaultModelBuilder.java:331) at org.apache.maven.repository.internal.DefaultArtifactDescriptorReader.loadPom(DefaultArtifactDescriptorReader.java:321) ... 43 more Caused by: org.eclipse.aether.resolution.ArtifactResolutionException: Failure to find org.apache:apache:pom:4 in http://localhost:8081/nexus/content/groups/public/ was cached in the local repository, resolution will not be reattempted until the update interval of public has elapsed or updates are forced at org.eclipse.aether.internal.impl.DefaultArtifactResolver.resolve(DefaultArtifactResolver.java:453) at org.eclipse.aether.internal.impl.DefaultArtifactResolver.resolveArtifacts(DefaultArtifactResolver.java:255) at org.eclipse.aether.internal.impl.DefaultArtifactResolver.resolveArtifact(DefaultArtifactResolver.java:232) at org.apache.maven.repository.internal.DefaultModelResolver.resolveModel(DefaultModelResolver.java:174) ... 48 more Caused by: org.eclipse.aether.transfer.ArtifactNotFoundException: Failure to find org.apache:apache:pom:4 in http://localhost:8081/nexus/content/groups/public/ was cached in the local repository, resolution will not be reattempted until the update interval of public has elapsed or updates are forced at org.eclipse.aether.internal.impl.DefaultUpdateCheckManager.newException(DefaultUpdateCheckManager.java:240) at org.eclipse.aether.internal.impl.DefaultUpdateCheckManager.checkArtifact(DefaultUpdateCheckManager.java:215) at org.eclipse.aether.internal.impl.DefaultArtifactResolver.gatherDownloads(DefaultArtifactResolver.java:594) at org.eclipse.aether.internal.impl.DefaultArtifactResolver.performDownloads(DefaultArtifactResolver.java:512) at org.eclipse.aether.internal.impl.DefaultArtifactResolver.resolve(DefaultArtifactResolver.java:430) ... 51 more [ERROR] [ERROR] Re-run Maven using the -X switch to enable full debug logging. [ERROR] [ERROR] For more information about the errors and possible solutions, please read the following articles: [ERROR] [Help 1] http://cwiki.apache.org/confluence/display/MAVEN/PluginResolutionException
springboot2.1 引入spring-boot-starter-web时启动 报错
``` java.util.concurrent.ExecutionException: org.apache.catalina.LifecycleException: Failed to start component [NonLoginAuthenticator[StandardEngine[Tomcat].StandardHost[localhost].TomcatEmbeddedContext[]]] at java.util.concurrent.FutureTask.report(FutureTask.java:122) [na:1.8.0_191] at java.util.concurrent.FutureTask.get(FutureTask.java:192) [na:1.8.0_191] at org.apache.catalina.core.ContainerBase.startInternal(ContainerBase.java:914) [tomcat-embed-core-9.0.14.jar:9.0.14] at org.apache.catalina.core.StandardHost.startInternal(StandardHost.java:831) [tomcat-embed-core-9.0.14.jar:9.0.14] at org.apache.catalina.util.LifecycleBase.start(LifecycleBase.java:183) [tomcat-embed-core-9.0.14.jar:9.0.14] at org.apache.catalina.core.ContainerBase$StartChild.call(ContainerBase.java:1382) [tomcat-embed-core-9.0.14.jar:9.0.14] at org.apache.catalina.core.ContainerBase$StartChild.call(ContainerBase.java:1372) [tomcat-embed-core-9.0.14.jar:9.0.14] at java.util.concurrent.FutureTask.run$$$capture(FutureTask.java:266) [na:1.8.0_191] at java.util.concurrent.FutureTask.run(FutureTask.java) [na:1.8.0_191] at org.apache.tomcat.util.threads.InlineExecutorService.execute(InlineExecutorService.java:75) [tomcat-embed-core-9.0.14.jar:9.0.14] at java.util.concurrent.AbstractExecutorService.submit(AbstractExecutorService.java:134) [na:1.8.0_191] at org.apache.catalina.core.ContainerBase.startInternal(ContainerBase.java:907) [tomcat-embed-core-9.0.14.jar:9.0.14] at org.apache.catalina.core.StandardEngine.startInternal(StandardEngine.java:262) [tomcat-embed-core-9.0.14.jar:9.0.14] at org.apache.catalina.util.LifecycleBase.start(LifecycleBase.java:183) [tomcat-embed-core-9.0.14.jar:9.0.14] at org.apache.catalina.core.StandardService.startInternal(StandardService.java:423) [tomcat-embed-core-9.0.14.jar:9.0.14] at org.apache.catalina.util.LifecycleBase.start(LifecycleBase.java:183) [tomcat-embed-core-9.0.14.jar:9.0.14] at org.apache.catalina.core.StandardServer.startInternal(StandardServer.java:933) [tomcat-embed-core-9.0.14.jar:9.0.14] at org.apache.catalina.util.LifecycleBase.start(LifecycleBase.java:183) [tomcat-embed-core-9.0.14.jar:9.0.14] at org.apache.catalina.startup.Tomcat.start(Tomcat.java:398) [tomcat-embed-core-9.0.14.jar:9.0.14] at org.springframework.boot.web.embedded.tomcat.TomcatWebServer.initialize(TomcatWebServer.java:106) [spring-boot-2.1.2.RELEASE.jar:2.1.2.RELEASE] at org.springframework.boot.web.embedded.tomcat.TomcatWebServer.<init>(TomcatWebServer.java:86) [spring-boot-2.1.2.RELEASE.jar:2.1.2.RELEASE] at org.springframework.boot.web.embedded.tomcat.TomcatServletWebServerFactory.getTomcatWebServer(TomcatServletWebServerFactory.java:415) [spring-boot-2.1.2.RELEASE.jar:2.1.2.RELEASE] at org.springframework.boot.web.embedded.tomcat.TomcatServletWebServerFactory.getWebServer(TomcatServletWebServerFactory.java:174) [spring-boot-2.1.2.RELEASE.jar:2.1.2.RELEASE] at org.springframework.boot.web.servlet.context.ServletWebServerApplicationContext.createWebServer(ServletWebServerApplicationContext.java:181) [spring-boot-2.1.2.RELEASE.jar:2.1.2.RELEASE] at org.springframework.boot.web.servlet.context.ServletWebServerApplicationContext.onRefresh(ServletWebServerApplicationContext.java:154) [spring-boot-2.1.2.RELEASE.jar:2.1.2.RELEASE] at org.springframework.context.support.AbstractApplicationContext.refresh(AbstractApplicationContext.java:540) [spring-context-5.1.4.RELEASE.jar:5.1.4.RELEASE] at org.springframework.boot.web.servlet.context.ServletWebServerApplicationContext.refresh(ServletWebServerApplicationContext.java:142) [spring-boot-2.1.2.RELEASE.jar:2.1.2.RELEASE] at org.springframework.boot.SpringApplication.refresh(SpringApplication.java:775) [spring-boot-2.1.2.RELEASE.jar:2.1.2.RELEASE] at org.springframework.boot.SpringApplication.refreshContext(SpringApplication.java:397) [spring-boot-2.1.2.RELEASE.jar:2.1.2.RELEASE] at org.springframework.boot.SpringApplication.run(SpringApplication.java:316) [spring-boot-2.1.2.RELEASE.jar:2.1.2.RELEASE] at org.springframework.boot.SpringApplication.run(SpringApplication.java:1260) [spring-boot-2.1.2.RELEASE.jar:2.1.2.RELEASE] at org.springframework.boot.SpringApplication.run(SpringApplication.java:1248) [spring-boot-2.1.2.RELEASE.jar:2.1.2.RELEASE] at com.example.demo.DemoApplication.main(DemoApplication.java:10) [classes/:na] Caused by: org.apache.catalina.LifecycleException: Failed to start component [NonLoginAuthenticator[StandardEngine[Tomcat].StandardHost[localhost].TomcatEmbeddedContext[]]] at org.apache.catalina.util.LifecycleBase.handleSubClassException(LifecycleBase.java:441) [tomcat-embed-core-9.0.14.jar:9.0.14] at org.apache.catalina.util.LifecycleBase.start(LifecycleBase.java:198) [tomcat-embed-core-9.0.14.jar:9.0.14] at org.apache.catalina.core.StandardPipeline.startInternal(StandardPipeline.java:181) ~[tomcat-embed-core-9.0.14.jar:9.0.14] at org.apache.catalina.util.LifecycleBase.start(LifecycleBase.java:183) [tomcat-embed-core-9.0.14.jar:9.0.14] at org.apache.catalina.core.StandardContext.startInternal(StandardContext.java:5041) ~[tomcat-embed-core-9.0.14.jar:9.0.14] at org.apache.catalina.util.LifecycleBase.start(LifecycleBase.java:183) [tomcat-embed-core-9.0.14.jar:9.0.14] at org.apache.catalina.core.ContainerBase$StartChild.call(ContainerBase.java:1382) [tomcat-embed-core-9.0.14.jar:9.0.14] at org.apache.catalina.core.ContainerBase$StartChild.call(ContainerBase.java:1372) [tomcat-embed-core-9.0.14.jar:9.0.14] at java.util.concurrent.FutureTask.run$$$capture(FutureTask.java:266) [na:1.8.0_191] at java.util.concurrent.FutureTask.run(FutureTask.java) [na:1.8.0_191] at org.apache.tomcat.util.threads.InlineExecutorService.execute(InlineExecutorService.java:75) [tomcat-embed-core-9.0.14.jar:9.0.14] at java.util.concurrent.AbstractExecutorService.submit(AbstractExecutorService.java:134) [na:1.8.0_191] at org.apache.catalina.core.ContainerBase.startInternal(ContainerBase.java:907) [tomcat-embed-core-9.0.14.jar:9.0.14] ... 30 common frames omitted Caused by: java.lang.NoSuchMethodError: javax.servlet.ServletContext.getVirtualServerName()Ljava/lang/String; at org.apache.catalina.authenticator.AuthenticatorBase.startInternal(AuthenticatorBase.java:1178) ~[tomcat-embed-core-9.0.14.jar:9.0.14] at org.apache.catalina.util.LifecycleBase.start(LifecycleBase.java:183) [tomcat-embed-core-9.0.14.jar:9.0.14] ... 41 common frames omitted 2019-01-21 22:19:30.303 ERROR 30556 --- [ main] org.apache.catalina.core.ContainerBase : A child container failed during start java.util.concurrent.ExecutionException: org.apache.catalina.LifecycleException: A child container failed during start at java.util.concurrent.FutureTask.report(FutureTask.java:122) ~[na:1.8.0_191] at java.util.concurrent.FutureTask.get(FutureTask.java:192) ~[na:1.8.0_191] at org.apache.catalina.core.ContainerBase.startInternal(ContainerBase.java:914) ~[tomcat-embed-core-9.0.14.jar:9.0.14] at org.apache.catalina.core.StandardEngine.startInternal(StandardEngine.java:262) [tomcat-embed-core-9.0.14.jar:9.0.14] at org.apache.catalina.util.LifecycleBase.start(LifecycleBase.java:183) [tomcat-embed-core-9.0.14.jar:9.0.14] at org.apache.catalina.core.StandardService.startInternal(StandardService.java:423) [tomcat-embed-core-9.0.14.jar:9.0.14] at org.apache.catalina.util.LifecycleBase.start(LifecycleBase.java:183) [tomcat-embed-core-9.0.14.jar:9.0.14] at org.apache.catalina.core.StandardServer.startInternal(StandardServer.java:933) [tomcat-embed-core-9.0.14.jar:9.0.14] at org.apache.catalina.util.LifecycleBase.start(LifecycleBase.java:183) [tomcat-embed-core-9.0.14.jar:9.0.14] at org.apache.catalina.startup.Tomcat.start(Tomcat.java:398) [tomcat-embed-core-9.0.14.jar:9.0.14] at org.springframework.boot.web.embedded.tomcat.TomcatWebServer.initialize(TomcatWebServer.java:106) [spring-boot-2.1.2.RELEASE.jar:2.1.2.RELEASE] at org.springframework.boot.web.embedded.tomcat.TomcatWebServer.<init>(TomcatWebServer.java:86) [spring-boot-2.1.2.RELEASE.jar:2.1.2.RELEASE] at org.springframework.boot.web.embedded.tomcat.TomcatServletWebServerFactory.getTomcatWebServer(TomcatServletWebServerFactory.java:415) [spring-boot-2.1.2.RELEASE.jar:2.1.2.RELEASE] at org.springframework.boot.web.embedded.tomcat.TomcatServletWebServerFactory.getWebServer(TomcatServletWebServerFactory.java:174) [spring-boot-2.1.2.RELEASE.jar:2.1.2.RELEASE] at org.springframework.boot.web.servlet.context.ServletWebServerApplicationContext.createWebServer(ServletWebServerApplicationContext.java:181) [spring-boot-2.1.2.RELEASE.jar:2.1.2.RELEASE] at org.springframework.boot.web.servlet.context.ServletWebServerApplicationContext.onRefresh(ServletWebServerApplicationContext.java:154) [spring-boot-2.1.2.RELEASE.jar:2.1.2.RELEASE] at org.springframework.context.support.AbstractApplicationContext.refresh(AbstractApplicationContext.java:540) [spring-context-5.1.4.RELEASE.jar:5.1.4.RELEASE] at org.springframework.boot.web.servlet.context.ServletWebServerApplicationContext.refresh(ServletWebServerApplicationContext.java:142) [spring-boot-2.1.2.RELEASE.jar:2.1.2.RELEASE] at org.springframework.boot.SpringApplication.refresh(SpringApplication.java:775) [spring-boot-2.1.2.RELEASE.jar:2.1.2.RELEASE] at org.springframework.boot.SpringApplication.refreshContext(SpringApplication.java:397) [spring-boot-2.1.2.RELEASE.jar:2.1.2.RELEASE] at org.springframework.boot.SpringApplication.run(SpringApplication.java:316) [spring-boot-2.1.2.RELEASE.jar:2.1.2.RELEASE] at org.springframework.boot.SpringApplication.run(SpringApplication.java:1260) [spring-boot-2.1.2.RELEASE.jar:2.1.2.RELEASE] at org.springframework.boot.SpringApplication.run(SpringApplication.java:1248) [spring-boot-2.1.2.RELEASE.jar:2.1.2.RELEASE] at com.example.demo.DemoApplication.main(DemoApplication.java:10) [classes/:na] Caused by: org.apache.catalina.LifecycleException: A child container failed during start at org.apache.catalina.core.ContainerBase.startInternal(ContainerBase.java:926) ~[tomcat-embed-core-9.0.14.jar:9.0.14] at org.apache.catalina.core.StandardHost.startInternal(StandardHost.java:831) ~[tomcat-embed-core-9.0.14.jar:9.0.14] at org.apache.catalina.util.LifecycleBase.start(LifecycleBase.java:183) [tomcat-embed-core-9.0.14.jar:9.0.14] at org.apache.catalina.core.ContainerBase$StartChild.call(ContainerBase.java:1382) ~[tomcat-embed-core-9.0.14.jar:9.0.14] at org.apache.catalina.core.ContainerBase$StartChild.call(ContainerBase.java:1372) ~[tomcat-embed-core-9.0.14.jar:9.0.14] at java.util.concurrent.FutureTask.run$$$capture(FutureTask.java:266) ~[na:1.8.0_191] at java.util.concurrent.FutureTask.run(FutureTask.java) ~[na:1.8.0_191] at org.apache.tomcat.util.threads.InlineExecutorService.execute(InlineExecutorService.java:75) ~[tomcat-embed-core-9.0.14.jar:9.0.14] at java.util.concurrent.AbstractExecutorService.submit(AbstractExecutorService.java:134) ~[na:1.8.0_191] at org.apache.catalina.core.ContainerBase.startInternal(ContainerBase.java:907) ~[tomcat-embed-core-9.0.14.jar:9.0.14] ... 21 common frames omitted Caused by: java.util.concurrent.ExecutionException: org.apache.catalina.LifecycleException: Failed to start component [NonLoginAuthenticator[StandardEngine[Tomcat].StandardHost[localhost].TomcatEmbeddedContext[]]] at java.util.concurrent.FutureTask.report(FutureTask.java:122) ~[na:1.8.0_191] at java.util.concurrent.FutureTask.get(FutureTask.java:192) ~[na:1.8.0_191] at org.apache.catalina.core.ContainerBase.startInternal(ContainerBase.java:914) ~[tomcat-embed-core-9.0.14.jar:9.0.14] ... 30 common frames omitted Caused by: org.apache.catalina.LifecycleException: Failed to start component [NonLoginAuthenticator[StandardEngine[Tomcat].StandardHost[localhost].TomcatEmbeddedContext[]]] at org.apache.catalina.util.LifecycleBase.handleSubClassException(LifecycleBase.java:441) [tomcat-embed-core-9.0.14.jar:9.0.14] at org.apache.catalina.util.LifecycleBase.start(LifecycleBase.java:198) [tomcat-embed-core-9.0.14.jar:9.0.14] at org.apache.catalina.core.StandardPipeline.startInternal(StandardPipeline.java:181) ~[tomcat-embed-core-9.0.14.jar:9.0.14] at org.apache.catalina.util.LifecycleBase.start(LifecycleBase.java:183) [tomcat-embed-core-9.0.14.jar:9.0.14] at org.apache.catalina.core.StandardContext.startInternal(StandardContext.java:5041) ~[tomcat-embed-core-9.0.14.jar:9.0.14] at org.apache.catalina.util.LifecycleBase.start(LifecycleBase.java:183) [tomcat-embed-core-9.0.14.jar:9.0.14] at org.apache.catalina.core.ContainerBase$StartChild.call(ContainerBase.java:1382) ~[tomcat-embed-core-9.0.14.jar:9.0.14] at org.apache.catalina.core.ContainerBase$StartChild.call(ContainerBase.java:1372) ~[tomcat-embed-core-9.0.14.jar:9.0.14] at java.util.concurrent.FutureTask.run$$$capture(FutureTask.java:266) ~[na:1.8.0_191] at java.util.concurrent.FutureTask.run(FutureTask.java) ~[na:1.8.0_191] at org.apache.tomcat.util.threads.InlineExecutorService.execute(InlineExecutorService.java:75) ~[tomcat-embed-core-9.0.14.jar:9.0.14] at java.util.concurrent.AbstractExecutorService.submit(AbstractExecutorService.java:134) ~[na:1.8.0_191] at org.apache.catalina.core.ContainerBase.startInternal(ContainerBase.java:907) ~[tomcat-embed-core-9.0.14.jar:9.0.14] ... 30 common frames omitted Caused by: java.lang.NoSuchMethodError: javax.servlet.ServletContext.getVirtualServerName()Ljava/lang/String; at org.apache.catalina.authenticator.AuthenticatorBase.startInternal(AuthenticatorBase.java:1178) ~[tomcat-embed-core-9.0.14.jar:9.0.14] at org.apache.catalina.util.LifecycleBase.start(LifecycleBase.java:183) [tomcat-embed-core-9.0.14.jar:9.0.14] ... 41 common frames omitted Disconnected from the target VM, address: '127.0.0.1:57321', transport: 'socket' 2019-01-21 22:19:30.321 INFO 30556 --- [ main] o.apache.catalina.core.StandardService : Stopping service [Tomcat] 2019-01-21 22:19:30.322 WARN 30556 --- [ main] ConfigServletWebServerApplicationContext : Exception encountered during context initialization - cancelling refresh attempt: org.springframework.context.ApplicationContextException: Unable to start web server; nested exception is org.springframework.boot.web.server.WebServerException: Unable to start embedded Tomcat 2019-01-21 22:19:30.322 INFO 30556 --- [ main] ConditionEvaluationReportLoggingListener : Error starting ApplicationContext. To display the conditions report re-run your application with 'debug' enabled. 2019-01-21 22:19:30.333 ERROR 30556 --- [ main] o.s.b.d.LoggingFailureAnalysisReporter : *************************** APPLICATION FAILED TO START *************************** Description: An attempt was made to call the method javax.servlet.ServletContext.getVirtualServerName()Ljava/lang/String; but it does not exist. Its class, javax.servlet.ServletContext, is available from the following locations: jar:file:/C:/Program%20Files%20(x86)/JAVA/JDK/jre/lib/ext/servlet-api.jar!/javax/servlet/ServletContext.class jar:file:/C:/Mavn/maven-repository/org/apache/tomcat/embed/tomcat-embed-core/9.0.14/tomcat-embed-core-9.0.14.jar!/javax/servlet/ServletContext.class It was loaded from the following location: file:/C:/Program%20Files%20(x86)/JAVA/JDK/jre/lib/ext/servlet-api.jar Action: Correct the classpath of your application so that it contains a single, compatible version of javax.servlet.ServletContext Process finished with exit code 1 ``` idea生成的springboot项目,当pom文件引入spring-boot-starter-web时 启动报错
怎么查看maven的pom.xml是否成功下载了所需jar包
## 如题,pom.xml动不动就要报错,不知道是不是因为没有成功下载jar的原因? ![图片说明](https://img-ask.csdn.net/upload/201606/23/1466666764_888875.jpg) Multiple annotations found at this line: - Missing artifact org.apache.maven:maven-artifact:jar:2.0.6:compile - Missing artifact org.apache.maven.shared:maven-filtering:jar:1.0-beta-4:compile - Missing artifact org.apache.maven:maven-profile:jar:2.0.6:compile - Missing artifact org.apache.maven.reporting:maven-reporting-api:jar: 2.0.6:compile - Missing artifact org.apache.maven:maven-plugin-descriptor:jar:2.0.6:compile - Missing artifact org.apache.maven.wagon:wagon-ssh:jar:1.0-beta-2:runtime - Missing artifact org.apache.maven.wagon:wagon-ssh-external:jar:1.0- beta-2:runtime - Missing artifact org.apache.maven:maven-artifact-manager:jar:2.0.6:compile - Missing artifact org.apache.maven:maven-plugin-registry:jar:2.0.6:compile - Missing artifact org.apache.maven:maven-project:jar:2.0.6:compile - Missing artifact org.apache.maven:maven-plugin-api:jar:2.0.6:compile - Missing artifact org.codehaus.plexus:plexus-utils:jar:2.0.5:compile - Missing artifact com.jcraft:jsch:jar:0.1.27:runtime - Missing artifact commons-cli:commons-cli:jar:1.0:compile - Missing artifact org.apache.maven.wagon:wagon-ssh-common:jar:1.0- beta-2:runtime - Missing artifact org.codehaus.plexus:plexus-interactivity-api:jar:1.0- alpha-4:compile - Missing artifact org.wisdom-framework:mysql-connector-java:jar:5.1.34_1:compile - Failed to read artifact descriptor for org.wisdom-framework:abstract-jdbc- driver:jar:0.5 - Missing artifact org.apache.maven.wagon:wagon-file:jar:1.0-beta-2:runtime - Missing artifact org.sonatype.plexus:plexus-build-api:jar:0.0.4:compile - Missing artifact classworlds:classworlds:jar:1.1:compile - Missing artifact org.apache.maven.plugins:maven-resources-plugin:jar: 2.4.3:compile - Missing artifact org.apache.felix:org.apache.felix.ipojo.annotations:jar: 1.12.1:compile - Missing artifact org.codehaus.plexus:plexus-interpolation:jar:1.13:compile - Missing artifact org.apache.maven.wagon:wagon-provider-api:jar:1.0- beta-2:compile - Missing artifact org.apache.maven:maven-monitor:jar:2.0.6:compile - Missing artifact xml-apis:xml-apis:jar:1.0.b2:runtime - Missing artifact org.apache.maven.wagon:wagon-http-shared:jar:1.0- beta-2:runtime - Missing artifact jtidy:jtidy:jar:4aug2000r7-dev:runtime - Missing artifact org.apache.maven:maven-core:jar:2.0.6:compile - Missing artifact org.apache.maven:maven-settings:jar:2.0.6:compile - Missing artifact org.apache.maven:maven-model:jar:2.0.6:compile - Missing artifact org.apache.maven.doxia:doxia-sink-api:jar:1.0-alpha-7:compile - Missing artifact org.apache.maven.wagon:wagon-http-lightweight:jar:1.0- beta-2:runtime - Missing artifact org.apache.maven:maven-repository-metadata:jar:2.0.6:compile - Missing artifact org.apache.maven:maven-error-diagnostics:jar:2.0.6:compile - Missing artifact org.codehaus.plexus:plexus-container-default:jar:1.0-alpha-9- stable-1:compile - Missing artifact junit:junit:jar:3.8.1:test - Missing artifact org.apache.maven:maven-plugin-parameter-documenter:jar: 2.0.6:compile
ubuntu下hadoop-2.6.0测试用例运行失败
Results : Failed tests: TestTableMapping.testClearingCachedMappings:144 expected:</[rack1]> but was:</[default-rack]> TestTableMapping.testTableCaching:79 expected:</[rack1]> but was:</[default-rack]> TestTableMapping.testResolve:56 expected:</[rack1]> but was:</[default-rack]> TestDecayRpcScheduler.testAccumulate:136 expected:<3> but was:<2> TestDecayRpcScheduler.testPriority:203 expected:<2> but was:<1> Tests run: 2723, Failures: 5, Errors: 0, Skipped: 91 [INFO] ------------------------------------------------------------------------ [INFO] Reactor Summary: [INFO] [INFO] Apache Hadoop Main ................................ SUCCESS [4.300s] [INFO] Apache Hadoop Project POM ......................... SUCCESS [2.250s] [INFO] Apache Hadoop Annotations ......................... SUCCESS [7.805s] [INFO] Apache Hadoop Assemblies .......................... SUCCESS [1.006s] [INFO] Apache Hadoop Project Dist POM .................... SUCCESS [8.227s] [INFO] Apache Hadoop Maven Plugins ....................... SUCCESS [9.390s] [INFO] Apache Hadoop MiniKDC ............................. SUCCESS [22.836s] [INFO] Apache Hadoop Auth ................................ SUCCESS [40.704s] [INFO] Apache Hadoop Auth Examples ....................... SUCCESS [4.181s] [INFO] Apache Hadoop Common .............................. FAILURE [27:26.889s] [INFO] Apache Hadoop NFS ................................. SKIPPED [INFO] Apache Hadoop KMS ................................. SKIPPED [INFO] Apache Hadoop Common Project ...................... SKIPPED [INFO] Apache Hadoop HDFS ................................ SKIPPED [INFO] Apache Hadoop HttpFS .............................. SKIPPED [INFO] Apache Hadoop HDFS BookKeeper Journal ............. SKIPPED [INFO] Apache Hadoop HDFS-NFS ............................ SKIPPED [INFO] Apache Hadoop HDFS Project ........................ SKIPPED [INFO] hadoop-yarn ....................................... SKIPPED [INFO] hadoop-yarn-api ................................... SKIPPED [INFO] hadoop-yarn-common ................................ SKIPPED [INFO] hadoop-yarn-server ................................ SKIPPED [INFO] hadoop-yarn-server-common ......................... SKIPPED [INFO] hadoop-yarn-server-nodemanager .................... SKIPPED [INFO] hadoop-yarn-server-web-proxy ...................... SKIPPED [INFO] hadoop-yarn-server-applicationhistoryservice ...... SKIPPED [INFO] hadoop-yarn-server-resourcemanager ................ SKIPPED [INFO] hadoop-yarn-server-tests .......................... SKIPPED [INFO] hadoop-yarn-client ................................ SKIPPED [INFO] hadoop-yarn-applications .......................... SKIPPED [INFO] hadoop-yarn-applications-distributedshell ......... SKIPPED [INFO] hadoop-yarn-applications-unmanaged-am-launcher .... SKIPPED [INFO] hadoop-yarn-site .................................. SKIPPED [INFO] hadoop-yarn-registry .............................. SKIPPED [INFO] hadoop-yarn-project ............................... SKIPPED [INFO] hadoop-mapreduce-client ........................... SKIPPED [INFO] hadoop-mapreduce-client-core ...................... SKIPPED [INFO] hadoop-mapreduce-client-common .................... SKIPPED [INFO] hadoop-mapreduce-client-shuffle ................... SKIPPED [INFO] hadoop-mapreduce-client-app ....................... SKIPPED [INFO] hadoop-mapreduce-client-hs ........................ SKIPPED [INFO] hadoop-mapreduce-client-jobclient ................. SKIPPED [INFO] hadoop-mapreduce-client-hs-plugins ................ SKIPPED [INFO] Apache Hadoop MapReduce Examples .................. SKIPPED [INFO] hadoop-mapreduce .................................. SKIPPED [INFO] Apache Hadoop MapReduce Streaming ................. SKIPPED [INFO] Apache Hadoop Distributed Copy .................... SKIPPED [INFO] Apache Hadoop Archives ............................ SKIPPED [INFO] Apache Hadoop Rumen ............................... SKIPPED [INFO] Apache Hadoop Gridmix ............................. SKIPPED [INFO] Apache Hadoop Data Join ........................... SKIPPED [INFO] Apache Hadoop Ant Tasks ........................... SKIPPED [INFO] Apache Hadoop Extras .............................. SKIPPED [INFO] Apache Hadoop Pipes ............................... SKIPPED [INFO] Apache Hadoop OpenStack support ................... SKIPPED [INFO] Apache Hadoop Amazon Web Services support ......... SKIPPED [INFO] Apache Hadoop Client .............................. SKIPPED [INFO] Apache Hadoop Mini-Cluster ........................ SKIPPED [INFO] Apache Hadoop Scheduler Load Simulator ............ SKIPPED [INFO] Apache Hadoop Tools Dist .......................... SKIPPED [INFO] Apache Hadoop Tools ............................... SKIPPED [INFO] Apache Hadoop Distribution ........................ SKIPPED [INFO] ------------------------------------------------------------------------ [INFO] BUILD FAILURE [INFO] ------------------------------------------------------------------------ [INFO] Total time: 29:15.906s [INFO] Finished at: Tue Jun 09 01:10:59 CST 2015 [INFO] Final Memory: 65M/202M [INFO] ------------------------------------------------------------------------ [ERROR] Failed to execute goal org.apache.maven.plugins:maven-surefire-plugin:2.16:test (default-test) on project hadoop-common: There are test failures. [ERROR] [ERROR] Please refer to /home/cj/workspace/hadoop-2.6.0-src/hadoop-common-project/hadoop-common/target/surefire-reports for the individual test results. [ERROR] -> [Help 1] [ERROR] [ERROR] To see the full stack trace of the errors, re-run Maven with the -e switch. [ERROR] Re-run Maven using the -X switch to enable full debug logging. [ERROR] [ERROR] For more information about the errors and possible solutions, please read the following articles: [ERROR] [Help 1] http://cwiki.apache.org/confluence/display/MAVEN/MojoFailureException [ERROR] [ERROR] After correcting the problems, you can resume the build with the command [ERROR] mvn <goals> -rf :hadoop-common
Maven多渠道打包报错,求解!
## 这是异常: D:\makeApk\MavenBuild>D:\makeApk\MavenBuild\build.bat [INFO] Scanning for projects... [INFO] [INFO] ------------------------------------------------------------------------ [INFO] Building mavenbuild-test 1.0.0 [INFO] ------------------------------------------------------------------------ Exception in thread "pool-1-thread-1" java.lang.NoClassDefFoundError: org/eclips e/aether/spi/connector/Transfer$State at org.eclipse.aether.connector.wagon.WagonRepositoryConnector$GetTask.r un(WagonRepositoryConnector.java:608) at org.eclipse.aether.util.concurrency.RunnableErrorForwarder$1.run(Runn ableErrorForwarder.java:67) at java.util.concurrent.ThreadPoolExecutor.runWorker(ThreadPoolExecutor. java:1145) at java.util.concurrent.ThreadPoolExecutor$Worker.run(ThreadPoolExecutor .java:615) at java.lang.Thread.run(Thread.java:724) [INFO] ------------------------------------------------------------------------C aused by: java.lang.ClassNotFoundException: org.eclipse.aether.spi.connector.Tra nsfer$State at org.codehaus.plexus.classworlds.strategy.SelfFirstStrategy.loadClass( SelfFirstStrategy.java:50)[INFO] BUILD FAILURE at org.codehaus.plexus.classworlds.realm.ClassRealm.unsynchronizedLoadCl ass(ClassRealm.java:271)[INFO] ------------------------------------------------- ----------------------- at org.codehaus.plexus.classworlds.realm.ClassRealm.loadClass(ClassRealm .java:247) at org.codehaus.plexus.classworlds.realm.ClassRealm.loadClass(ClassRealm .java:239) ... 5 more [INFO] Total time: 2.117 s [INFO] Finished at: 2015-07-23T11:06:57+08:00 [INFO] Final Memory: 14M/213M [INFO] ------------------------------------------------------------------------ --------------------------------------------------- constituent[0]: file:/D:/Soft/apache-maven-3.3.3/lib/aether-api-1.0.2.v20150114. jar constituent[1]: file:/D:/Soft/apache-maven-3.3.3/lib/aether-connector-basic-1.0. 2.v20150114.jar constituent[2]: file:/D:/Soft/apache-maven-3.3.3/lib/aether-impl-1.0.2.v20150114 .jar constituent[3]: file:/D:/Soft/apache-maven-3.3.3/lib/aether-spi-1.0.2.v20150114. jar constituent[4]: file:/D:/Soft/apache-maven-3.3.3/lib/aether-transport-wagon-1.0. 2.v20150114.jar constituent[5]: file:/D:/Soft/apache-maven-3.3.3/lib/aether-util-1.0.2.v20150114 .jar constituent[6]: file:/D:/Soft/apache-maven-3.3.3/lib/aopalliance-1.0.jar constituent[7]: file:/D:/Soft/apache-maven-3.3.3/lib/cdi-api-1.0.jar constituent[8]: file:/D:/Soft/apache-maven-3.3.3/lib/commons-cli-1.2.jar constituent[9]: file:/D:/Soft/apache-maven-3.3.3/lib/commons-io-2.2.jar constituent[10]: file:/D:/Soft/apache-maven-3.3.3/lib/commons-lang-2.6.jar constituent[11]: file:/D:/Soft/apache-maven-3.3.3/lib/guava-18.0.jar constituent[12]: file:/D:/Soft/apache-maven-3.3.3/lib/javax.inject-1.jar constituent[13]: file:/D:/Soft/apache-maven-3.3.3/lib/jsoup-1.7.2.jar constituent[14]: file:/D:/Soft/apache-maven-3.3.3/lib/jsr250-api-1.0.jar constituent[15]: file:/D:/Soft/apache-maven-3.3.3/lib/maven-aether-provider-3.3. 3.jar constituent[16]: file:/D:/Soft/apache-maven-3.3.3/lib/maven-artifact-3.3.3.jar constituent[17]: file:/D:/Soft/apache-maven-3.3.3/lib/maven-builder-support-3.3. 3.jar constituent[18]: file:/D:/Soft/apache-maven-3.3.3/lib/maven-compat-3.3.3.jar constituent[19]: file:/D:/Soft/apache-maven-3.3.3/lib/maven-core-3.3.3.jar constituent[20]: file:/D:/Soft/apache-maven-3.3.3/lib/maven-embedder-3.3.3.jar constituent[21]: file:/D:/Soft/apache-maven-3.3.3/lib/maven-model-3.3.3.jar constituent[22]: file:/D:/Soft/apache-maven-3.3.3/lib/maven-model-builder-3.3.3. jar constituent[23]: file:/D:/Soft/apache-maven-3.3.3/lib/maven-plugin-api-3.3.3.jar constituent[24]: file:/D:/Soft/apache-maven-3.3.3/lib/maven-repository-metadata- 3.3.3.jar constituent[25]: file:/D:/Soft/apache-maven-3.3.3/lib/maven-settings-3.3.3.jar constituent[26]: file:/D:/Soft/apache-maven-3.3.3/lib/maven-settings-builder-3.3 .3.jar constituent[27]: file:/D:/Soft/apache-maven-3.3.3/lib/org.eclipse.sisu.inject-0. 3.0.jar constituent[28]: file:/D:/Soft/apache-maven-3.3.3/lib/org.eclipse.sisu.plexus-0. 3.0.jar constituent[29]: file:/D:/Soft/apache-maven-3.3.3/lib/plexus-cipher-1.7.jar constituent[30]: file:/D:/Soft/apache-maven-3.3.3/lib/plexus-component-annotatio ns-1.5.5.jar constituent[31]: file:/D:/Soft/apache-maven-3.3.3/lib/plexus-interpolation-1.21. jar constituent[32]: file:/D:/Soft/apache-maven-3.3.3/lib/plexus-sec-dispatcher-1.3. jar constituent[33]: file:/D:/Soft/apache-maven-3.3.3/lib/plexus-utils-3.0.20.jar constituent[34]: file:/D:/Soft/apache-maven-3.3.3/lib/sisu-guice-3.2.5-no_aop.ja r constituent[35]: file:/D:/Soft/apache-maven-3.3.3/lib/slf4j-api-1.7.5.jar constituent[36]: file:/D:/Soft/apache-maven-3.3.3/lib/slf4j-simple-1.7.5.jar constituent[37]: file:/D:/Soft/apache-maven-3.3.3/lib/wagon-file-2.9.jar constituent[38]: file:/D:/Soft/apache-maven-3.3.3/lib/wagon-http-2.9-shaded.jar constituent[39]: file:/D:/Soft/apache-maven-3.3.3/lib/wagon-http-shared-2.9.jar constituent[40]: file:/D:/Soft/apache-maven-3.3.3/lib/wagon-provider-api-2.9.jar constituent[41]: file:/D:/Soft/apache-maven-3.3.3/conf/logging/ --------------------------------------------------- Exception in thread "main" java.lang.NoClassDefFoundError: org/eclipse/aether/sp i/connector/Transfer$State at org.eclipse.aether.connector.wagon.WagonRepositoryConnector$GetTask.r un(WagonRepositoryConnector.java:608) at org.eclipse.aether.util.concurrency.RunnableErrorForwarder$1.run(Runn ableErrorForwarder.java:67) at java.util.concurrent.ThreadPoolExecutor.runWorker(ThreadPoolExecutor. java:1145) at java.util.concurrent.ThreadPoolExecutor$Worker.run(ThreadPoolExecutor .java:615) at java.lang.Thread.run(Thread.java:724) Caused by: java.lang.ClassNotFoundException: org.eclipse.aether.spi.connector.Tr ansfer$State at org.codehaus.plexus.classworlds.strategy.SelfFirstStrategy.loadClass( SelfFirstStrategy.java:50) at org.codehaus.plexus.classworlds.realm.ClassRealm.unsynchronizedLoadCl ass(ClassRealm.java:271) at org.codehaus.plexus.classworlds.realm.ClassRealm.loadClass(ClassRealm .java:247) at org.codehaus.plexus.classworlds.realm.ClassRealm.loadClass(ClassRealm .java:239) ... 5 more 系统找不到指定的路径。 子目录或文件 assets 已经存在。 'assets/common.properties'... 正在添加: META-INF/MANIFEST.MF 正在添加: META-INF/DREAMZON.SF 正在添加: META-INF/DREAMZON.RSA 正在签名: assets/common.properties 子目录或文件 assets 已经存在。 'assets/common.properties'... 正在添加: META-INF/MANIFEST.MF 正在添加: META-INF/DREAMZON.SF 正在添加: META-INF/DREAMZON.RSA 正在签名: assets/common.properties 子目录或文件 assets 已经存在。 'assets/common.properties'... 正在添加: META-INF/MANIFEST.MF 正在添加: META-INF/DREAMZON.SF 正在添加: META-INF/DREAMZON.RSA 正在签名: assets/common.properties D:\makeApk> ## 这是pom.xml: <?xml version="1.0" encoding="utf-8"?> <project xmlns="http://maven.apache.org/POM/4.0.0" xmlns:xsi="http://www.w3.org/2001/XMLSchema-instance" xsi:schemaLocation="http://maven.apache.org/POM/4.0.0 http://maven.apache.org/maven-v4_0_0.xsd"> <modelVersion>4.0.0</modelVersion> <groupId>com.example.mavenbuild</groupId> <artifactId>mavenbuild-test</artifactId> <version>1.0.0</version> <packaging>apk</packaging> <properties> <project.build.sourceEncoding>UTF-8</project.build.sourceEncoding> </properties> <dependencies> <dependency> <groupId>com.google.android</groupId> <artifactId>android</artifactId> <version>4.1.1.4</version> <scope>provided</scope> </dependency> </dependencies> <build> <sourceDirectory>src</sourceDirectory> <finalName>${project.artifactId}</finalName> <pluginManagement> <plugins> <plugin> <groupId>com.jayway.maven.plugins.android.generation2</groupId> <artifactId>android-maven-plugin</artifactId> <version>3.8.2</version> <extensions>true</extensions> </plugin> </plugins> </pluginManagement> <plugins> <plugin> <groupId>com.jayway.maven.plugins.android.generation2</groupId> <artifactId>android-maven-plugin</artifactId> <configuration> <sdk> <!-- platform as api level (api level 16 = platform 4.1)--> <platform>16</platform> </sdk> <sign> <debug>false</debug> </sign> </configuration> </plugin> </plugins> </build> </project>
创建Maven项目 pom.xml文件报错
创建maven项目 pom.xml文件提示错误: Failure to transfer org.apache.maven.surefire:surefire:pom:2.10 from http://repo.maven.apache.org/maven2 was cached in the local repository, resolution will not be reattempted until the update interval of central has elapsed or updates are forced. Original error: Could not transfer artifact org.apache.maven.surefire:surefire:pom:2.10 from/to central (http://repo.maven.apache.org/maven2): java.net.ConnectException: connection timed out to http://repo.maven.apache.org/maven2/org/apache/maven/surefire/surefire/2.10/surefire-2.10.pom 在网上搜索后给出的解决方法是 打开maven的本地库...\repository\org\apache\maven\plugins\maven-surefire-plugin\2.10会发现:里面少只有一个maven-surefire-plugin-2.10.pom.lastUpdated,而没有maven-surefire-plugin-2.10.jar 解决方法: 1.删除maven-surefire-plugin-2.7.1.pom.lastUpdated文件 2.右键点击project -> Maven - Update Dependencies 但我的本地库有aven-surefire-plugin-2.10.jar以及相关文件 没有maven-surefire-plugin-2.10.pom.lastUpdated文件 怎么还报这样的错误 在网上搜索好长时间 一直没有解决 求大神指点!! 谢谢
maven管理jar包问题,请大神们帮帮解决
本人手动更改settings.xml文件,将本地库改为e:/m2/repository。 导入maven项目完毕后,发现itext-4.2.1.jar包没有像下载,而是下载itextpdf-5.5.6.jar 最不能理解的是pom.xml文件中明明配置了itext-4.2.1.jar,没有配置itextpdf-5.5.6.jar为什么会下载itextpdf-5.5.6.jar。 补充说明:我之前有一个maven项目用到itextpdf-5.5.6.jar。本地库是默认C盘。求大神帮忙解答。感谢!
编译安装hadoop-2.5.0-rc1,程序包com.sun.javadoc不存在
编译安装hadoop-2.5.0-rc1,报如下错,求指点: [ERROR] Failed to execute goal org.apache.maven.plugins:maven-compiler-plugin:2.5.1:compile (default-compile) on project hadoop-annotations: Compilation failure: Compilation failure: [ERROR] /usr/local/src/release-2.5.0-rc1/hadoop-common-project/hadoop-annotations/src/main/java/org/apache/hadoop/classification/tools/ExcludePrivateAnnotationsJDiffDoclet.java:[20,22] 错误: 程序包com.sun.javadoc不存在
maven引入jsp-api的jar包问题,谢谢
![图片说明](https://img-ask.csdn.net/upload/201611/09/1478627853_289756.png) ![图片说明](https://img-ask.csdn.net/upload/201611/09/1478627863_160370.png) 我想知道,我没有引入jsp-api-2.0.jar这个jsp标签库的jar包,新创建一个xxx.jsp之后,为什么没有报错?
NetBeans清理构建报错,请大佬帮帮忙谢谢.
Cannot run program "cmd" (in directory "D:\Job\jobgit\aidamall"): Malformed argument has embedded quote: "D:\DevelopmentTool\maven\apache-maven-3.6.2\apache-maven-3.6.2\bin\mvn.cmd" -Dmaven.ext.class.path=D:\DevelopmentTool\NetBeans\NetBeans11.1\NetBeans11.1\netbeans-11.1-bin\netbeans\java\maven-nblib\netbeans-eventspy.jar -Dfile.encoding=UTF-8 clean install
jug-2.0.0.jar 在maven中央仓库下载不到,显示404,这是什么情况?
![图片说明](https://img-ask.csdn.net/upload/201710/15/1508041343_644134.png)
maven打包本地jar包出现问题,求解答
maven本地仓库install外部的jar包,出现这个错误 [WARNING] Failed to retrieve plugin descriptor for org.apache.maven.plugins:maven-clean-plugin:2.5: Plugin org.apache.maven.plugins:maven-clean-plugin:2.5 or one of its dependencies could not be resolved: Failed to read artifact descriptor for org.apache.maven.plugins:maven-clean-plugin:jar:2.5 Downloading from central: https://repo.maven.apache.org/maven2/org/apache/maven/plugins/maven-install-plugin/2.4/maven-install-plugin-2.4.pom [WARNING] Failed to retrieve plugin descriptor for org.apache.maven.plugins:maven-install-plugin:2.4: Plugin org.apache.maven.plugins:maven-install-plugin:2.4 or one of its dependencies could not be resolved: Failed to read artifact descriptor for org.apache.maven.plugins:maven-install-plugin:jar:2.4 Downloading from central: https://repo.maven.apache.org/maven2/org/apache/maven/plugins/maven-site-plugin/3.3/maven-site-plugin-3.3.pom [WARNING] Failed to retrieve plugin descriptor for org.apache.maven.plugins:maven-site-plugin:3.3: Plugin org.apache.maven.plugins:maven-site-plugin:3.3 or one of its dependencies could not be resolved: Failed to read artifact descriptor for org.apache.maven.plugins:maven-site-plugin:jar:3.3 Downloading from central: https://repo.maven.apache.org/maven2/org/apache/maven/plugins/maven-antrun-plugin/1.3/maven-antrun-plugin-1.3.pom [WARNING] Failed to retrieve plugin descriptor for org.apache.maven.plugins:maven-antrun-plugin:1.3: Plugin org.apache.maven.plugins:maven-antrun-plugin:1.3 or one of its dependencies could not be resolved: Failed to read artifact descriptor for org.apache.maven.plugins:maven-antrun-plugin:jar:1.3 Downloading from central: https://repo.maven.apache.org/maven2/org/apache/maven/plugins/maven-assembly-plugin/2.2-beta-5/maven-assembly-plugin-2.2-beta-5.pom [WARNING] Failed to retrieve plugin descriptor for org.apache.maven.plugins:maven-assembly-plugin:2.2-beta-5: Plugin org.apache.maven.plugins:maven-assembly-plugin:2.2-beta-5 or one of its dependencies could not be resolved: Failed to read artifact descriptor for org.apache.maven.plugins:maven-assembly-plugin:jar:2.2-beta-5 Downloading from central: https://repo.maven.apache.org/maven2/org/apache/maven/plugins/maven-dependency-plugin/2.8/maven-dependency-plugin-2.8.pom [WARNING] Failed to retrieve plugin descriptor for org.apache.maven.plugins:maven-dependency-plugin:2.8: Plugin org.apache.maven.plugins:maven-dependency-plugin:2.8 or one of its dependencies could not be resolved: Failed to read artifact descriptor for org.apache.maven.plugins:maven-dependency-plugin:jar:2.8 Downloading from central: https://repo.maven.apache.org/maven2/org/apache/maven/plugins/maven-release-plugin/2.5.3/maven-release-plugin-2.5.3.pom [WARNING] Failed to retrieve plugin descriptor for org.apache.maven.plugins:maven-release-plugin:2.5.3: Plugin org.apache.maven.plugins:maven-release-plugin:2.5.3 or one of its dependencies could not be resolved: Failed to read artifact descriptor for org.apache.maven.plugins:maven-release-plugin:jar:2.5.3 Downloading from central: https://repo.maven.apache.org/maven2/org/codehaus/mojo/maven-metadata.xml Downloading from central: https://repo.maven.apache.org/maven2/org/apache/maven/plugins/maven-metadata.xml [WARNING] Could not transfer metadata org.apache.maven.plugins/maven-metadata.xml from/to central (https://repo.maven.apache.org/maven2): Received fatal alert: protocol_version [WARNING] Could not transfer metadata org.codehaus.mojo/maven-metadata.xml from/to central (https://repo.maven.apache.org/maven2): Received fatal alert: protocol_version [WARNING] Failure to transfer org.apache.maven.plugins/maven-metadata.xml from https://repo.maven.apache.org/maven2 was cached in the local repository, resolution will not be reattempted until the update interval of central has elapsed or updates are forced. Original error: Could not transfer metadata org.apache.maven.plugins/maven-metadata.xml from/to central (https://repo.maven.apache.org/maven2): Received fatal alert: protocol_version [WARNING] Failure to transfer org.codehaus.mojo/maven-metadata.xml from https://repo.maven.apache.org/maven2 was cached in the local repository, resolution will not be reattempted until the update interval of central has elapsed or updates are forced. Original error: Could not transfer metadata org.codehaus.mojo/maven-metadata.xml from/to central (https://repo.maven.apache.org/maven2): Received fatal alert: protocol_version [INFO] ------------------------------------------------------------------------ [INFO] BUILD FAILURE [INFO] ------------------------------------------------------------------------ [INFO] Total time: 6.191 s [INFO] Finished at: 2018-07-25T21:57:45+08:00 [INFO] ------------------------------------------------------------------------ [ERROR] No plugin found for prefix 'install' in the current project and in the plugin groups [org.apache.maven.plugins, org.codehaus.mojo] available from the repositories [local (C:\Users\Administrator\.m2\repository), central (https://repo.maven.apache.org/maven2)] -> [Help 1] [ERROR] [ERROR] To see the full stack trace of the errors, re-run Maven with the -e switch. [ERROR] Re-run Maven using the -X switch to enable full debug logging. [ERROR] [ERROR] For more information about the errors and possible solutions, please read the following articles: [ERROR] [Help 1] http://cwiki.apache.org/confluence/display/MAVEN/NoPluginFoundForPrefixException
爬虫福利二 之 妹子图网MM批量下载
爬虫福利一:27报网MM批量下载    点击 看了本文,相信大家对爬虫一定会产生强烈的兴趣,激励自己去学习爬虫,在这里提前祝:大家学有所成! 目标网站:妹子图网 环境:Python3.x 相关第三方模块:requests、beautifulsoup4 Re:各位在测试时只需要将代码里的变量 path 指定为你当前系统要保存的路径,使用 python xxx.py 或IDE运行即可。
字节跳动视频编解码面经
三四月份投了字节跳动的实习(图形图像岗位),然后hr打电话过来问了一下会不会opengl,c++,shador,当时只会一点c++,其他两个都不会,也就直接被拒了。 七月初内推了字节跳动的提前批,因为内推没有具体的岗位,hr又打电话问要不要考虑一下图形图像岗,我说实习投过这个岗位不合适,不会opengl和shador,然后hr就说秋招更看重基础。我当时想着能进去就不错了,管他哪个岗呢,就同意了面试...
Java学习的正确打开方式
在博主认为,对于入门级学习java的最佳学习方法莫过于视频+博客+书籍+总结,前三者博主将淋漓尽致地挥毫于这篇博客文章中,至于总结在于个人,实际上越到后面你会发现学习的最好方式就是阅读参考官方文档其次就是国内的书籍,博客次之,这又是一个层次了,这里暂时不提后面再谈。博主将为各位入门java保驾护航,各位只管冲鸭!!!上天是公平的,只要不辜负时间,时间自然不会辜负你。 何谓学习?博主所理解的学习,它是一个过程,是一个不断累积、不断沉淀、不断总结、善于传达自己的个人见解以及乐于分享的过程。
程序员必须掌握的核心算法有哪些?
由于我之前一直强调数据结构以及算法学习的重要性,所以就有一些读者经常问我,数据结构与算法应该要学习到哪个程度呢?,说实话,这个问题我不知道要怎么回答你,主要取决于你想学习到哪些程度,不过针对这个问题,我稍微总结一下我学过的算法知识点,以及我觉得值得学习的算法。这些算法与数据结构的学习大多数是零散的,并没有一本把他们全部覆盖的书籍。下面是我觉得值得学习的一些算法以及数据结构,当然,我也会整理一些看过
linux系列之常用运维命令整理笔录
本博客记录工作中需要的linux运维命令,大学时候开始接触linux,会一些基本操作,可是都没有整理起来,加上是做开发,不做运维,有些命令忘记了,所以现在整理成博客,当然vi,文件操作等就不介绍了,慢慢积累一些其它拓展的命令,博客不定时更新 free -m 其中:m表示兆,也可以用g,注意都要小写 Men:表示物理内存统计 total:表示物理内存总数(total=used+free) use...
Python 基础(一):入门必备知识
目录1 标识符2 关键字3 引号4 编码5 输入输出6 缩进7 多行8 注释9 数据类型10 运算符10.1 常用运算符10.2 运算符优先级 1 标识符 标识符是编程时使用的名字,用于给变量、函数、语句块等命名,Python 中标识符由字母、数字、下划线组成,不能以数字开头,区分大小写。 以下划线开头的标识符有特殊含义,单下划线开头的标识符,如:_xxx ,表示不能直接访问的类属性,需通过类提供
兼职程序员一般可以从什么平台接私活?
这个问题我进行了系统性的总结,以下将进行言简意赅的说明和渠道提供,希望对各位小猿/小媛们有帮助~ 根据我们的经验,程序员兼职主要分为三种:兼职职位众包、项目整包和自由职业者驻场。 所谓的兼职职位众包,指的是需求方这边有自有工程师配合,只需要某个职位的工程师开发某个模块的项目。比如开发一个 app,后端接口有人开发,但是缺少 iOS 前端开发工程师,那么他们就会发布一个职位招聘前端,来配合公司一...
程序员接私活怎样防止做完了不给钱?
首先跟大家说明一点,我们做 IT 类的外包开发,是非标品开发,所以很有可能在开发过程中会有这样那样的需求修改,而这种需求修改很容易造成扯皮,进而影响到费用支付,甚至出现做完了项目收不到钱的情况。 那么,怎么保证自己的薪酬安全呢? 我们在开工前,一定要做好一些证据方面的准备(也就是“讨薪”的理论依据),这其中最重要的就是需求文档和验收标准。一定要让需求方提供这两个文档资料作为开发的基础。之后开发
Python十大装B语法
Python 是一种代表简单思想的语言,其语法相对简单,很容易上手。不过,如果就此小视 Python 语法的精妙和深邃,那就大错特错了。本文精心筛选了最能展现 Python 语法之精妙的十个知识点,并附上详细的实例代码。如能在实战中融会贯通、灵活使用,必将使代码更为精炼、高效,同时也会极大提升代码B格,使之看上去更老练,读起来更优雅。 1. for - else 什么?不是 if 和 else 才
数据库优化 - SQL优化
前面一篇文章从实例的角度进行数据库优化,通过配置一些参数让数据库性能达到最优。但是一些“不好”的SQL也会导致数据库查询变慢,影响业务流程。本文从SQL角度进行数据库优化,提升SQL运行效率。 判断问题SQL 判断SQL是否有问题时可以通过两个表象进行判断: 系统级别表象 CPU消耗严重 IO等待严重 页面响应时间过长
2019年11月中国大陆编程语言排行榜
2019年11月2日,我统计了某招聘网站,获得有效程序员招聘数据9万条。针对招聘信息,提取编程语言关键字,并统计如下: 编程语言比例 rank pl_ percentage 1 java 33.62% 2 c/c++ 16.42% 3 c_sharp 12.82% 4 javascript 12.31% 5 python 7.93% 6 go 7.25% 7
写了很久,这是一份最适合/贴切普通大众/科班/非科班的『学习路线』
说实话,对于学习路线这种文章我一般是不写的,大家看我的文章也知道,我是很少写建议别人怎么样怎么样的文章,更多的是,写自己的真实经历,然后供大家去参考,这样子,我内心也比较踏实,也不怕误导他人。 但是,最近好多人问我学习路线,而且很多大一大二的,说自己很迷茫,看到我那篇 普普通通,我的三年大学 之后很受激励,觉得自己也能行,(是的,别太浪,你一定能行)希望我能给他个学习路线,说
经典算法(5)杨辉三角
写在前面: 我是 扬帆向海,这个昵称来源于我的名字以及女朋友的名字。我热爱技术、热爱开源、热爱编程。技术是开源的、知识是共享的。 这博客是对自己学习的一点点总结及记录,如果您对 Java、算法 感兴趣,可以关注我的动态,我们一起学习。 用知识改变命运,让我们的家人过上更好的生活。 目录一、杨辉三角的介绍二、杨辉三角的算法思想三、代码实现1.第一种写法2.第二种写法 一、杨辉三角的介绍 百度
腾讯算法面试题:64匹马8个跑道需要多少轮才能选出最快的四匹?
昨天,有网友私信我,说去阿里面试,彻底的被打击到了。问了为什么网上大量使用ThreadLocal的源码都会加上private static?他被难住了,因为他从来都没有考虑过这个问题。无独有偶,今天笔者又发现有网友吐槽了一道腾讯的面试题,我们一起来看看。 腾讯算法面试题:64匹马8个跑道需要多少轮才能选出最快的四匹? 在互联网职场论坛,一名程序员发帖求助到。二面腾讯,其中一个算法题:64匹
面试官:你连RESTful都不知道我怎么敢要你?
面试官:了解RESTful吗? 我:听说过。 面试官:那什么是RESTful? 我:就是用起来很规范,挺好的 面试官:是RESTful挺好的,还是自我感觉挺好的 我:都挺好的。 面试官:… 把门关上。 我:… 要干嘛?先关上再说。 面试官:我说出去把门关上。 我:what ?,夺门而去 文章目录01 前言02 RESTful的来源03 RESTful6大原则1. C-S架构2. 无状态3.统一的接
为啥国人偏爱Mybatis,而老外喜欢Hibernate/JPA呢?
关于SQL和ORM的争论,永远都不会终止,我也一直在思考这个问题。昨天又跟群里的小伙伴进行了一番讨论,感触还是有一些,于是就有了今天这篇文。 声明:本文不会下关于Mybatis和JPA两个持久层框架哪个更好这样的结论。只是摆事实,讲道理,所以,请各位看官勿喷。 一、事件起因 关于Mybatis和JPA孰优孰劣的问题,争论已经很多年了。一直也没有结论,毕竟每个人的喜好和习惯是大不相同的。我也看
SQL-小白最佳入门sql查询一
一 说明 如果是初学者,建议去网上寻找安装Mysql的文章安装,以及使用navicat连接数据库,以后的示例基本是使用mysql数据库管理系统; 二 准备前提 需要建立一张学生表,列分别是id,名称,年龄,学生信息;本示例中文章篇幅原因SQL注释略; 建表语句: CREATE TABLE `student` ( `id` int(11) NOT NULL AUTO_INCREMENT, `
项目中的if else太多了,该怎么重构?
介绍 最近跟着公司的大佬开发了一款IM系统,类似QQ和微信哈,就是聊天软件。我们有一部分业务逻辑是这样的 if (msgType = "文本") { // dosomething } else if(msgType = "图片") { // doshomething } else if(msgType = "视频") { // doshomething } else { // dosho
致 Python 初学者
文章目录1. 前言2. 明确学习目标,不急于求成,不好高骛远3. 在开始学习 Python 之前,你需要做一些准备2.1 Python 的各种发行版2.2 安装 Python2.3 选择一款趁手的开发工具3. 习惯使用IDLE,这是学习python最好的方式4. 严格遵从编码规范5. 代码的运行、调试5. 模块管理5.1 同时安装了py2/py35.2 使用Anaconda,或者通过IDE来安装模
“狗屁不通文章生成器”登顶GitHub热榜,分分钟写出万字形式主义大作
一、垃圾文字生成器介绍 最近在浏览GitHub的时候,发现了这样一个骨骼清奇的雷人项目,而且热度还特别高。 项目中文名:狗屁不通文章生成器 项目英文名:BullshitGenerator 根据作者的介绍,他是偶尔需要一些中文文字用于GUI开发时测试文本渲染,因此开发了这个废话生成器。但由于生成的废话实在是太过富于哲理,所以最近已经被小伙伴们给玩坏了。 他的文风可能是这样的: 你发现,
程序员:我终于知道post和get的区别
IT界知名的程序员曾说:对于那些月薪三万以下,自称IT工程师的码农们,其实我们从来没有把他们归为我们IT工程师的队伍。他们虽然总是以IT工程师自居,但只是他们一厢情愿罢了。 此话一出,不知激起了多少(码农)程序员的愤怒,却又无可奈何,于是码农问程序员。 码农:你知道get和post请求到底有什么区别? 程序员:你看这篇就知道了。 码农:你月薪三万了? 程序员:嗯。 码农:你是怎么做到的? 程序员:
《程序人生》系列-这个程序员只用了20行代码就拿了冠军
你知道的越多,你不知道的越多 点赞再看,养成习惯GitHub上已经开源https://github.com/JavaFamily,有一线大厂面试点脑图,欢迎Star和完善 前言 这一期不算《吊打面试官》系列的,所有没前言我直接开始。 絮叨 本来应该是没有这期的,看过我上期的小伙伴应该是知道的嘛,双十一比较忙嘛,要值班又要去帮忙拍摄年会的视频素材,还得搞个程序员一天的Vlog,还要写BU
加快推动区块链技术和产业创新发展,2019可信区块链峰会在京召开
11月8日,由中国信息通信研究院、中国通信标准化协会、中国互联网协会、可信区块链推进计划联合主办,科技行者协办的2019可信区块链峰会将在北京悠唐皇冠假日酒店开幕。   区块链技术被认为是继蒸汽机、电力、互联网之后,下一代颠覆性的核心技术。如果说蒸汽机释放了人类的生产力,电力解决了人类基本的生活需求,互联网彻底改变了信息传递的方式,区块链作为构造信任的技术有重要的价值。   1...
程序员把地府后台管理系统做出来了,还有3.0版本!12月7号最新消息:已在开发中有github地址
第一幕:缘起 听说阎王爷要做个生死簿后台管理系统,我们派去了一个程序员…… 996程序员做的梦: 第一场:团队招募 为了应对地府管理危机,阎王打算找“人”开发一套地府后台管理系统,于是就在地府总经办群中发了项目需求。 话说还是中国电信的信号好,地府都是满格,哈哈!!! 经常会有外行朋友问:看某网站做的不错,功能也简单,你帮忙做一下? 而这次,面对这样的需求,这个程序员
网易云6亿用户音乐推荐算法
网易云音乐是音乐爱好者的集聚地,云音乐推荐系统致力于通过 AI 算法的落地,实现用户千人千面的个性化推荐,为用户带来不一样的听歌体验。 本次分享重点介绍 AI 算法在音乐推荐中的应用实践,以及在算法落地过程中遇到的挑战和解决方案。 将从如下两个部分展开: AI 算法在音乐推荐中的应用 音乐场景下的 AI 思考 从 2013 年 4 月正式上线至今,网易云音乐平台持续提供着:乐屏社区、UGC
8年经验面试官详解 Java 面试秘诀
    作者 | 胡书敏 责编 | 刘静 出品 | CSDN(ID:CSDNnews) 本人目前在一家知名外企担任架构师,而且最近八年来,在多家外企和互联网公司担任Java技术面试官,前后累计面试了有两三百位候选人。在本文里,就将结合本人的面试经验,针对Java初学者、Java初级开发和Java开发,给出若干准备简历和准备面试的建议。   Java程序员准备和投递简历的实
面试官如何考察你的思维方式?
1.两种思维方式在求职面试中,经常会考察这种问题:北京有多少量特斯拉汽车? 某胡同口的煎饼摊一年能卖出多少个煎饼? 深圳有多少个产品经理? 一辆公交车里能装下多少个乒乓球? 一
碎片化的时代,如何学习
今天周末,和大家聊聊学习这件事情。 在如今这个社会,我们的时间被各类 APP 撕的粉碎。 刷知乎、刷微博、刷朋友圈; 看论坛、看博客、看公号; 等等形形色色的信息和知识获取方式一个都不错过。 貌似学了很多,但是却感觉没什么用。 要解决上面这些问题,首先要分清楚一点,什么是信息,什么是知识。 那什么是信息呢? 你一切听到的、看到的,都是信息,比如微博上的明星出轨、微信中的表情大战、抖音上的...
so easy! 10行代码写个"狗屁不通"文章生成器
前几天,GitHub 有个开源项目特别火,只要输入标题就可以生成一篇长长的文章。 背后实现代码一定很复杂吧,里面一定有很多高深莫测的机器学习等复杂算法 不过,当我看了源代码之后 这程序不到50行 尽管我有多年的Python经验,但我竟然一时也没有看懂 当然啦,原作者也说了,这个代码也是在无聊中诞生的,平时撸码是不写中文变量名的, 中文...
知乎高赞:中国有什么拿得出手的开源软件产品?(整理自本人原创回答)
知乎高赞:中国有什么拿得出手的开源软件产品? 在知乎上,有个问题问“中国有什么拿得出手的开源软件产品(在 GitHub 等社区受欢迎度较好的)?” 事实上,还不少呢~ 本人于2019.7.6进行了较为全面的回答,对这些受欢迎的 Github 开源项目分类整理如下: 分布式计算、云平台相关工具类 1.SkyWalking,作者吴晟、刘浩杨 等等 仓库地址: apache/skywalking 更...
相关热词 c#处理浮点数 c# 生成字母数字随机数 c# 动态曲线 控件 c# oracle 开发 c#选择字体大小的控件 c# usb 批量传输 c#10进制转8进制 c#转base64 c# 科学计算 c#下拉列表获取串口
立即提问