maven项目报错Encountered "-", but was expecting: "="]

同一个项目组的,别人的项目就可以启动并且正常运行。真的不知道到底是哪里出了问题。开发工具,换了好几个版本。用了me6.5,2017.都是报这个错
别的tomcat 。maven版本。jdk。都是一样的。
唯一的不同。。和他们操作系统不一样,,千万不要跟我说让我重新装个win7.。。那我会崩溃的。。
在网上搜索同样的问题,别人说是什么编码的关系。我已经把所有我能改的编码都改成了UTF-8,还是不可以。
求大神解救

Servlet.service() for servlet [springmvc] in context with path [/shopPlat] threw exception [Request processing failed; nested exception is org.springframework.context.ApplicationContextException: Failed to parse FreeMarker template for URL [swms/swmssys/system/unit.html]; nested exception is freemarker.core.ParseException: Parsing error in template "swms/swmssys/system/unit.html" in line 1, column 41:
Encountered "-", but was expecting:
"="] with root cause
freemarker.core.ParseException: Parsing error in template "swms/swmssys/system/unit.html" in line 1, column 41:
Encountered "-", but was expecting:
"="
at freemarker.core.FMParser.generateParseException(FMParser.java:4672)
at freemarker.core.FMParser.jj_consume_token(FMParser.java:4543)
at freemarker.core.FMParser.Include(FMParser.java:1681)
at freemarker.core.FMParser.FreemarkerDirective(FMParser.java:2361)
at freemarker.core.FMParser.Content(FMParser.java:2593)
at freemarker.core.FMParser.OptionalBlock(FMParser.java:2761)
at freemarker.core.FMParser.Root(FMParser.java:2933)
at freemarker.template.Template.(Template.java:193)
at freemarker.cache.TemplateCache.loadTemplate(TemplateCache.java:419)
at freemarker.cache.TemplateCache.getTemplate(TemplateCache.java:330)
at freemarker.cache.TemplateCache.getTemplate(TemplateCache.java:205)
at freemarker.template.Configuration.getTemplate(Configuration.java:740)
at freemarker.template.Configuration.getTemplate(Configuration.java:673)
at org.springframework.web.servlet.view.freemarker.FreeMarkerView.getTemplate(FreeMarkerView.java:351)
at org.

4个回答

freemarker解析过程中有无,检查哈“-”标识符是否用错了。http://xiaolaohudebaba-126-com.iteye.com/blog/772470

qq_14853517
qq_14853517 没有用那个标识符呀也。。。
2 年多之前 回复

<?xml version="1.0" encoding="UTF-8"?>
xmlns:xsi="http://www.w3.org/2001/XMLSchema-instance"
xmlns:context="http://www.springframework.org/schema/context"
xmlns:mvc="http://www.springframework.org/schema/mvc"
xsi:schemaLocation="http://www.springframework.org/schema/beans http://www.springframework.org/schema/beans/spring-beans-3.0.xsd
http://www.springframework.org/schema/context http://www.springframework.org/schema/context/spring-context-3.0.xsd
http://www.springframework.org/schema/mvc
http://www.springframework.org/schema/mvc/spring-mvc-3.1.xsd"
default-lazy-init="true">

<bean id="freemarkerViewResolver" class="com.sgcctd.common.springmvc.RichFreeMarkerViewResolver">
    <property name="prefix" value=""/>
    <property name="suffix" value=".html"/>
    <property name="contentType" value="text/html; charset=UTF-8"/>
    <property name="exposeRequestAttributes" value="false"/>
    <property name="exposeSessionAttributes" value="false"/>
    <property name="exposeSpringMacroHelpers" value="true"/>
    <property name="order" value="1"/>
</bean>
<bean id="freemarkerConfig" class="org.springframework.web.servlet.view.freemarker.FreeMarkerConfigurer">
    <property name="templateLoaderPath" value=""/>
    <property name="freemarkerVariables" value="#{propertyUtils.getTemplateDirectivesMap()}"/>
    <property name="preferFileSystemAccess" value="false"></property>
    <property name="freemarkerSettings">
        <props>
            <prop key="tag_syntax">auto_detect</prop>
            <prop key="template_update_delay">0</prop>
            <prop key="defaultEncoding">UTF-8</prop>
            <prop key="url_escaping_charset">UTF-8</prop>
            <prop key="locale">zh_CN</prop>
            <prop key="boolean_format">true,false</prop>
            <prop key="datetime_format">yyyy-MM-dd HH:mm:ss</prop>
            <prop key="date_format">yyyy-MM-dd</prop>
            <prop key="time_format">HH:mm:ss</prop>
            <prop key="number_format">0.######</prop>
            <prop key="whitespace_stripping">true</prop>
            <prop key="auto_import">/WEB-INF/ftl/pony/index.ftl as p,/WEB-INF/ftl/spring.ftl as s</prop>
        </props>
    </property>
</bean>

以上是freemaker 的配置文件

<?xml version="1.0" encoding="UTF-8"?>
xmlns:xsi="http://www.w3.org/2001/XMLSchema-instance" xmlns:context="http://www.springframework.org/schema/context"
xmlns:aop="http://www.springframework.org/schema/aop" xmlns:tx="http://www.springframework.org/schema/tx"
xmlns:mvc="http://www.springframework.org/schema/mvc"
xsi:schemaLocation="http://www.springframework.org/schema/beans
http://www.springframework.org/schema/beans/spring-beans-3.2.xsd
http://www.springframework.org/schema/context
http://www.springframework.org/schema/context/spring-context-3.2.xsd
http://www.springframework.org/schema/aop
http://www.springframework.org/schema/aop/spring-aop-3.2.xsd
http://www.springframework.org/schema/tx
http://www.springframework.org/schema/tx/spring-tx-3.2.xsd
http://www.springframework.org/schema/mvc
http://www.springframework.org/schema/mvc/spring-mvc-3.2.xsd
">

<!-- 扫描注解配置-->
<context:component-scan base-package="com.sgcctd">
    <!-- 扫描除了Controller之外的注解Bean,Controller层扫描由springmvc来中配置,这里仅做其他类型注解扫描 -->
    <context:include-filter type="annotation" expression="org.springframework.stereotype.Controller" />
    <context:exclude-filter type="annotation" expression="org.springframework.stereotype.Service" /> 
    <context:exclude-filter type="annotation" expression="org.springframework.stereotype.Repository" />
</context:component-scan>
<!-- 扫描注解中的@Resource、@Required、@PreDestroy等-->
<context:annotation-config />

<!-- 定义文件上传处理器 -->  
<bean id="multipartResolver" class="org.springframework.web.multipart.commons.CommonsMultipartResolver"/>

<!-- json支持更改为fastjson -->
<!-- 启用默认配置 -->
<mvc:annotation-driven>
    <mvc:message-converters register-defaults="true">
        <!--先进行string转换-->
        <bean class="org.springframework.http.converter.StringHttpMessageConverter" >
            <property name="supportedMediaTypes">
                <list>
                    <bean class="org.springframework.http.MediaType">
                        <constructor-arg value="text" />
                        <constructor-arg value="plain" />
                        <constructor-arg value="UTF-8" />
                    </bean>
                </list>
            </property>
        </bean>
        <!-- 配置Fastjson支持 -->
        <bean class="com.alibaba.fastjson.support.spring.FastJsonHttpMessageConverter">
            <property name="supportedMediaTypes">
                <list>
                    <value>application/json</value>
                </list>
            </property>
            <property name="features">
                <list>
                    <value>WriteMapNullValue</value>
                    <value>QuoteFieldNames</value>
                </list>
            </property>
        </bean>
    </mvc:message-converters>
</mvc:annotation-driven>

<mvc:interceptors> 
     <mvc:interceptor>  
        <mvc:mapping path="/**" />
        <mvc:exclude-mapping path="/app/**" />
        <bean id="cloudContextInterceptor" class="com.sgcctd.common.interceptor.CloudContextInterceptor">
            <property name="nofindPage" value="/nosite.html"></property>
        </bean>
     </mvc:interceptor>
     <mvc:interceptor>  
        <mvc:mapping path="/admin/**" />
        <bean id="adminInterceptor" class="com.sgcctd.common.interceptor.AdminHandlerInterceptorAdapter">
            <property name="loginPage" value="/index.jhtml"></property>
        </bean>
    </mvc:interceptor>
</mvc:interceptors>

<bean id="localeResolver" class="org.springframework.web.servlet.i18n.CookieLocaleResolver">
    <property name="cookieName" value="clientlanguage"/>
    <property name="cookieMaxAge" value="-1"/>
</bean>

<!-- 异常统一处理 -->
<bean id="exceptionresolver"
    class="org.springframework.web.servlet.handler.SimpleMappingExceptionResolver">
    <property name="defaultErrorView">
        <value>/common/error/error</value>
    </property>
    <property name="exceptionAttribute" value="ex"></property>  
    <property name="exceptionMappings">
        <props>
            <prop key="com.sgcctd.base.exception.BusinessException">/common/error/errorB</prop>
            <prop key="java.sql.SQLException">/error/errorDB</prop>
        </props>
    </property>
</bean>

以上是springMVC的配置文件

https://my.oschina.net/u/2302435/blog/1527081
我的问题是解决了,你的看造化吧。

Csdn user default icon
上传中...
上传图片
插入图片
抄袭、复制答案,以达到刷声望分或其他目的的行为,在CSDN问答是严格禁止的,一经发现立刻封号。是时候展现真正的技术了!
其他相关推荐
maven配置私服打包报错Failed to execute goal org.apache.maven.plugins:maven-compiler-plugin:3.5:compile
直接使用阿里云镜像仓库打包没问题,替换为私服镜像仓库后报错: 就是pom.xml中的plugin报错 ``` <plugin> <groupId>org.apache.maven.plugins</groupId> <artifactId>maven-compiler-plugin</artifactId> <version>3.5</version> <configuration> <source>1.8</source> <target>1.8</target> <encoding>UTF-8</encoding> </configuration> </plugin> ``` 网上找了半天说这个指定的jdk版本的问题,查了一下版本没问题都是1.8 报错内容: [ERROR] Failed to execute goal org.apache.maven.plugins:maven-compiler-plugin:3.5:compile (default-compile) on project mytest-web: Execution default-compile of goal org.apache.maven.plugins:maven-compiler-plugin:3.5:compile failed: Plugin org.apache.maven.plugins:maven-compiler-plugin:3.5 or one of its dependencies could not be resolved: Failed to collect dependencies at org.apache.maven.plugins:maven-compiler-plugin:jar:3.5 -> org.apache.maven:maven-toolchain:jar:2.2.1 -> org.apache.maven:maven-core:jar:2.2.1 -> commons-cli:commons-cli:jar:1.2: Failed to read artifact descriptor for commons-cli:commons-cli:jar:1.2: Failure to find org.apache:apache:pom:4 in http://localhost:8081/nexus/content/groups/public/ was cached in the local repository, resolution will not be reattempted until the update interval of public has elapsed or updates are forced -> [Help 1] org.apache.maven.lifecycle.LifecycleExecutionException: Failed to execute goal org.apache.maven.plugins:maven-compiler-plugin:3.5:compile (default-compile) on project mytest-web: Execution default-compile of goal org.apache.maven.plugins:maven-compiler-plugin:3.5:compile failed: Plugin org.apache.maven.plugins:maven-compiler-plugin:3.5 or one of its dependencies could not be resolved: Failed to collect dependencies at org.apache.maven.plugins:maven-compiler-plugin:jar:3.5 -> org.apache.maven:maven-toolchain:jar:2.2.1 -> org.apache.maven:maven-core:jar:2.2.1 -> commons-cli:commons-cli:jar:1.2 at org.apache.maven.lifecycle.internal.MojoExecutor.execute(MojoExecutor.java:213) at org.apache.maven.lifecycle.internal.MojoExecutor.execute(MojoExecutor.java:154) at org.apache.maven.lifecycle.internal.MojoExecutor.execute(MojoExecutor.java:146) at org.apache.maven.lifecycle.internal.LifecycleModuleBuilder.buildProject(LifecycleModuleBuilder.java:117) at org.apache.maven.lifecycle.internal.LifecycleModuleBuilder.buildProject(LifecycleModuleBuilder.java:81) at org.apache.maven.lifecycle.internal.builder.singlethreaded.SingleThreadedBuilder.build(SingleThreadedBuilder.java:51) at org.apache.maven.lifecycle.internal.LifecycleStarter.execute(LifecycleStarter.java:128) at org.apache.maven.DefaultMaven.doExecute(DefaultMaven.java:309) at org.apache.maven.DefaultMaven.doExecute(DefaultMaven.java:194) at org.apache.maven.DefaultMaven.execute(DefaultMaven.java:107) at org.apache.maven.cli.MavenCli.execute(MavenCli.java:993) at org.apache.maven.cli.MavenCli.doMain(MavenCli.java:345) at org.apache.maven.cli.MavenCli.main(MavenCli.java:191) at sun.reflect.NativeMethodAccessorImpl.invoke0(Native Method) at sun.reflect.NativeMethodAccessorImpl.invoke(NativeMethodAccessorImpl.java:62) at sun.reflect.DelegatingMethodAccessorImpl.invoke(DelegatingMethodAccessorImpl.java:43) at java.lang.reflect.Method.invoke(Method.java:498) at org.codehaus.plexus.classworlds.launcher.Launcher.launchEnhanced(Launcher.java:289) at org.codehaus.plexus.classworlds.launcher.Launcher.launch(Launcher.java:229) at org.codehaus.plexus.classworlds.launcher.Launcher.mainWithExitCode(Launcher.java:415) at org.codehaus.plexus.classworlds.launcher.Launcher.main(Launcher.java:356) Caused by: org.apache.maven.plugin.PluginExecutionException: Execution default-compile of goal org.apache.maven.plugins:maven-compiler-plugin:3.5:compile failed: Plugin org.apache.maven.plugins:maven-compiler-plugin:3.5 or one of its dependencies could not be resolved: Failed to collect dependencies at org.apache.maven.plugins:maven-compiler-plugin:jar:3.5 -> org.apache.maven:maven-toolchain:jar:2.2.1 -> org.apache.maven:maven-core:jar:2.2.1 -> commons-cli:commons-cli:jar:1.2 at org.apache.maven.plugin.DefaultBuildPluginManager.executeMojo(DefaultBuildPluginManager.java:106) at org.apache.maven.lifecycle.internal.MojoExecutor.execute(MojoExecutor.java:208) ... 20 more Caused by: org.apache.maven.plugin.PluginResolutionException: Plugin org.apache.maven.plugins:maven-compiler-plugin:3.5 or one of its dependencies could not be resolved: Failed to collect dependencies at org.apache.maven.plugins:maven-compiler-plugin:jar:3.5 -> org.apache.maven:maven-toolchain:jar:2.2.1 -> org.apache.maven:maven-core:jar:2.2.1 -> commons-cli:commons-cli:jar:1.2 at org.apache.maven.plugin.internal.DefaultPluginDependenciesResolver.resolveInternal(DefaultPluginDependenciesResolver.java:214) at org.apache.maven.plugin.internal.DefaultPluginDependenciesResolver.resolve(DefaultPluginDependenciesResolver.java:149) at org.apache.maven.plugin.internal.DefaultMavenPluginManager.createPluginRealm(DefaultMavenPluginManager.java:402) at org.apache.maven.plugin.internal.DefaultMavenPluginManager.setupPluginRealm(DefaultMavenPluginManager.java:374) at org.apache.maven.plugin.DefaultBuildPluginManager.getPluginRealm(DefaultBuildPluginManager.java:231) at org.apache.maven.plugin.DefaultBuildPluginManager.executeMojo(DefaultBuildPluginManager.java:102) ... 21 more Caused by: org.eclipse.aether.collection.DependencyCollectionException: Failed to collect dependencies at org.apache.maven.plugins:maven-compiler-plugin:jar:3.5 -> org.apache.maven:maven-toolchain:jar:2.2.1 -> org.apache.maven:maven-core:jar:2.2.1 -> commons-cli:commons-cli:jar:1.2 at org.eclipse.aether.internal.impl.DefaultDependencyCollector.collectDependencies(DefaultDependencyCollector.java:300) at org.eclipse.aether.internal.impl.DefaultRepositorySystem.collectDependencies(DefaultRepositorySystem.java:325) at org.apache.maven.plugin.internal.DefaultPluginDependenciesResolver.resolveInternal(DefaultPluginDependenciesResolver.java:202) ... 26 more Caused by: org.eclipse.aether.resolution.ArtifactDescriptorException: Failed to read artifact descriptor for commons-cli:commons-cli:jar:1.2 at org.apache.maven.repository.internal.DefaultArtifactDescriptorReader.loadPom(DefaultArtifactDescriptorReader.java:330) at org.apache.maven.repository.internal.DefaultArtifactDescriptorReader.readArtifactDescriptor(DefaultArtifactDescriptorReader.java:199) at org.eclipse.aether.internal.impl.DefaultDependencyCollector.resolveCachedArtifactDescriptor(DefaultDependencyCollector.java:544) at org.eclipse.aether.internal.impl.DefaultDependencyCollector.getArtifactDescriptorResult(DefaultDependencyCollector.java:528) at org.eclipse.aether.internal.impl.DefaultDependencyCollector.processDependency(DefaultDependencyCollector.java:418) at org.eclipse.aether.internal.impl.DefaultDependencyCollector.processDependency(DefaultDependencyCollector.java:372) at org.eclipse.aether.internal.impl.DefaultDependencyCollector.process(DefaultDependencyCollector.java:360) at org.eclipse.aether.internal.impl.DefaultDependencyCollector.doRecurse(DefaultDependencyCollector.java:513) at org.eclipse.aether.internal.impl.DefaultDependencyCollector.processDependency(DefaultDependencyCollector.java:467) at org.eclipse.aether.internal.impl.DefaultDependencyCollector.processDependency(DefaultDependencyCollector.java:372) at org.eclipse.aether.internal.impl.DefaultDependencyCollector.process(DefaultDependencyCollector.java:360) at org.eclipse.aether.internal.impl.DefaultDependencyCollector.doRecurse(DefaultDependencyCollector.java:513) at org.eclipse.aether.internal.impl.DefaultDependencyCollector.processDependency(DefaultDependencyCollector.java:467) at org.eclipse.aether.internal.impl.DefaultDependencyCollector.processDependency(DefaultDependencyCollector.java:372) at org.eclipse.aether.internal.impl.DefaultDependencyCollector.process(DefaultDependencyCollector.java:360) at org.eclipse.aether.internal.impl.DefaultDependencyCollector.collectDependencies(DefaultDependencyCollector.java:263) ... 28 more Caused by: org.apache.maven.model.resolution.UnresolvableModelException: Failure to find org.apache:apache:pom:4 in http://localhost:8081/nexus/content/groups/public/ was cached in the local repository, resolution will not be reattempted until the update interval of public has elapsed or updates are forced at org.apache.maven.repository.internal.DefaultModelResolver.resolveModel(DefaultModelResolver.java:178) at org.apache.maven.repository.internal.DefaultModelResolver.resolveModel(DefaultModelResolver.java:224) at org.apache.maven.model.building.DefaultModelBuilder.readParentExternally(DefaultModelBuilder.java:1051) at org.apache.maven.model.building.DefaultModelBuilder.readParent(DefaultModelBuilder.java:829) at org.apache.maven.model.building.DefaultModelBuilder.build(DefaultModelBuilder.java:331) at org.apache.maven.repository.internal.DefaultArtifactDescriptorReader.loadPom(DefaultArtifactDescriptorReader.java:321) ... 43 more Caused by: org.eclipse.aether.resolution.ArtifactResolutionException: Failure to find org.apache:apache:pom:4 in http://localhost:8081/nexus/content/groups/public/ was cached in the local repository, resolution will not be reattempted until the update interval of public has elapsed or updates are forced at org.eclipse.aether.internal.impl.DefaultArtifactResolver.resolve(DefaultArtifactResolver.java:453) at org.eclipse.aether.internal.impl.DefaultArtifactResolver.resolveArtifacts(DefaultArtifactResolver.java:255) at org.eclipse.aether.internal.impl.DefaultArtifactResolver.resolveArtifact(DefaultArtifactResolver.java:232) at org.apache.maven.repository.internal.DefaultModelResolver.resolveModel(DefaultModelResolver.java:174) ... 48 more Caused by: org.eclipse.aether.transfer.ArtifactNotFoundException: Failure to find org.apache:apache:pom:4 in http://localhost:8081/nexus/content/groups/public/ was cached in the local repository, resolution will not be reattempted until the update interval of public has elapsed or updates are forced at org.eclipse.aether.internal.impl.DefaultUpdateCheckManager.newException(DefaultUpdateCheckManager.java:240) at org.eclipse.aether.internal.impl.DefaultUpdateCheckManager.checkArtifact(DefaultUpdateCheckManager.java:215) at org.eclipse.aether.internal.impl.DefaultArtifactResolver.gatherDownloads(DefaultArtifactResolver.java:594) at org.eclipse.aether.internal.impl.DefaultArtifactResolver.performDownloads(DefaultArtifactResolver.java:512) at org.eclipse.aether.internal.impl.DefaultArtifactResolver.resolve(DefaultArtifactResolver.java:430) ... 51 more [ERROR] [ERROR] Re-run Maven using the -X switch to enable full debug logging. [ERROR] [ERROR] For more information about the errors and possible solutions, please read the following articles: [ERROR] [Help 1] http://cwiki.apache.org/confluence/display/MAVEN/PluginResolutionException
mycelipse创建maven项目报错
Could not get mojo execution paramater value Plugin org.apache.maven.plugins:maven-compiler-plugin:2.0.2 or one of its dependencies could not be resolved: Unable to get dependency information for org.apache.maven.plugins:maven-compiler-plugin:maven-plugin:2.0.2: Failed to process POM for org.apache.maven.plugins:maven-compiler-plugin:maven-plugin:2.0.2: Non-resolvable parent POM org.apache.maven:maven-parent:5 for org.apache.maven.plugins:maven-plugins:8: Failed to resolve POM for org.apache.maven:maven-parent:5 due to Missing: ---------- 1) org.apache.maven:maven-parent:pom:5 ---------- 1 required artifact is missing. for artifact: org.apache.maven:maven-parent:pom:5 from the specified remote repositories: central (http://repo1.maven.org/maven2, releases=true, snapshots=false)
新建maven项目报错An internal error occurred during: "
eclipse提示这个:An internal error occurred during: "Creating maven-archetype-quickstart". org/apache/maven/project/MavenProject 我把maven里的org/apache都删了重新载入都还是一样,求解。
java mongodb ObjectId json序列化问题
数据库里面的Id 拿到接口里面变成了 下面这个样子 , 能不能返回toString()的ObjectId ``` "id": { "counter": 2179906, "date": "2020-01-03 13:48:40", "machineIdentifier": 6355970, "processIdentifier": -25096, "time": "1578030520000", "timeSecond": 1578030520, "timestamp": 1578030520 }, ``` 尝试过codec 也试过自定义 JsonSerializer 都没有起效 #### 我想要的效果就是mongodb里面的objectId 返回出来的时候是String
MyEclipse创建maven项目报错?
大家好我安装了maven3,MyEclipse设置了maven下的setting.xml,但是创建项目时报错:Could not resolve archetype org.apache.maven.archetypes:maven-archetype-quickstart:RELEASE from any of the configured repositories. Could not resolve artifact org.apache.maven.archetypes:maven-archetype-quickstart:pom:RELEASE Failed to resolve version for org.apache.maven.archetypes:maven-archetype-quickstart:pom:RELEASE: Could not find metadata org.apache.maven.archetypes:maven-archetype-quickstart/maven-metadata.xml in local (F:\Learing\Maven\LocalMaven) 在本地工厂中确实没有maven-metadata.xml,是不是在创建项目时下载这个啊?我的是win10系统,在win7上没有出现这种情况,还有就是有的说设置代理,请问这个代理是干什么的?对大神教教我,谢谢了,,,
新建Maven项目报错,提示连接不上中央存储库
CoreException: Could not calculate build plan: Plugin org.apache.maven.plugins:maven-compiler-plugin:2.3.2 or one of its dependencies could not be resolved: Failed to read artifact descriptor for org.apache.maven.plugins:maven-compiler-plugin:jar:2.3.2: ArtifactResolutionException: Failure to transfer org.apache.maven.plugins:maven-compiler-plugin:pom:2.3.2 from http://repo.maven.apache.org/maven2 was cached in the local repository, resolution will not be reattempted until the update interval of central has elapsed or updates are forced. Original error: Could not transfer artifact org.apache.maven.plugins:maven-compiler-plugin:pom:2.3.2 from/to central (http://repo.maven.apache.org/maven2): null to http://repo.maven.apache.org/maven2/org/apache/maven/plugins/maven-compiler-plugin/2.3.2/maven-compiler-plugin-2.3.2.pom
怎么查看maven的pom.xml是否成功下载了所需jar包
## 如题,pom.xml动不动就要报错,不知道是不是因为没有成功下载jar的原因? ![图片说明](https://img-ask.csdn.net/upload/201606/23/1466666764_888875.jpg) Multiple annotations found at this line: - Missing artifact org.apache.maven:maven-artifact:jar:2.0.6:compile - Missing artifact org.apache.maven.shared:maven-filtering:jar:1.0-beta-4:compile - Missing artifact org.apache.maven:maven-profile:jar:2.0.6:compile - Missing artifact org.apache.maven.reporting:maven-reporting-api:jar: 2.0.6:compile - Missing artifact org.apache.maven:maven-plugin-descriptor:jar:2.0.6:compile - Missing artifact org.apache.maven.wagon:wagon-ssh:jar:1.0-beta-2:runtime - Missing artifact org.apache.maven.wagon:wagon-ssh-external:jar:1.0- beta-2:runtime - Missing artifact org.apache.maven:maven-artifact-manager:jar:2.0.6:compile - Missing artifact org.apache.maven:maven-plugin-registry:jar:2.0.6:compile - Missing artifact org.apache.maven:maven-project:jar:2.0.6:compile - Missing artifact org.apache.maven:maven-plugin-api:jar:2.0.6:compile - Missing artifact org.codehaus.plexus:plexus-utils:jar:2.0.5:compile - Missing artifact com.jcraft:jsch:jar:0.1.27:runtime - Missing artifact commons-cli:commons-cli:jar:1.0:compile - Missing artifact org.apache.maven.wagon:wagon-ssh-common:jar:1.0- beta-2:runtime - Missing artifact org.codehaus.plexus:plexus-interactivity-api:jar:1.0- alpha-4:compile - Missing artifact org.wisdom-framework:mysql-connector-java:jar:5.1.34_1:compile - Failed to read artifact descriptor for org.wisdom-framework:abstract-jdbc- driver:jar:0.5 - Missing artifact org.apache.maven.wagon:wagon-file:jar:1.0-beta-2:runtime - Missing artifact org.sonatype.plexus:plexus-build-api:jar:0.0.4:compile - Missing artifact classworlds:classworlds:jar:1.1:compile - Missing artifact org.apache.maven.plugins:maven-resources-plugin:jar: 2.4.3:compile - Missing artifact org.apache.felix:org.apache.felix.ipojo.annotations:jar: 1.12.1:compile - Missing artifact org.codehaus.plexus:plexus-interpolation:jar:1.13:compile - Missing artifact org.apache.maven.wagon:wagon-provider-api:jar:1.0- beta-2:compile - Missing artifact org.apache.maven:maven-monitor:jar:2.0.6:compile - Missing artifact xml-apis:xml-apis:jar:1.0.b2:runtime - Missing artifact org.apache.maven.wagon:wagon-http-shared:jar:1.0- beta-2:runtime - Missing artifact jtidy:jtidy:jar:4aug2000r7-dev:runtime - Missing artifact org.apache.maven:maven-core:jar:2.0.6:compile - Missing artifact org.apache.maven:maven-settings:jar:2.0.6:compile - Missing artifact org.apache.maven:maven-model:jar:2.0.6:compile - Missing artifact org.apache.maven.doxia:doxia-sink-api:jar:1.0-alpha-7:compile - Missing artifact org.apache.maven.wagon:wagon-http-lightweight:jar:1.0- beta-2:runtime - Missing artifact org.apache.maven:maven-repository-metadata:jar:2.0.6:compile - Missing artifact org.apache.maven:maven-error-diagnostics:jar:2.0.6:compile - Missing artifact org.codehaus.plexus:plexus-container-default:jar:1.0-alpha-9- stable-1:compile - Missing artifact junit:junit:jar:3.8.1:test - Missing artifact org.apache.maven:maven-plugin-parameter-documenter:jar: 2.0.6:compile
idea创建Maven项目没有src目录 Run有错误
![图片说明](https://img-ask.csdn.net/upload/201911/02/1572702296_122439.png) ``` "C:\Program Files\Java\jdk1.8.0_202\bin\java.exe" -Dmaven.multiModuleProjectDirectory=C:\Users\dx\AppData\Local\Temp\archetype1tmp -Xms128m -Xmx512m -Duser.language=zh -Dfile.encoding=UTF-8 -Dmaven.home=E:\server\apache-maven-3.6.1 -Dclassworlds.conf=E:\server\apache-maven-3.6.1\bin\m2.conf "-Dmaven.ext.class.path=E:\IntelliJ IDEA 2019.2\plugins\maven\lib\maven-event-listener.jar" -classpath E:\server\apache-maven-3.6.1\boot\plexus-classworlds-2.6.0.jar org.codehaus.classworlds.Launcher -Didea.version2019.2 --offline -s E:\server\apache-maven-3.6.1\conf\settings.xml -Dmaven.repo.local=E:\server\Repository -DinteractiveMode=false -DgroupId=com -DartifactId=demo33333333 -Dversion=1.0-SNAPSHOT -DarchetypeGroupId=org.apache.maven.archetypes -DarchetypeArtifactId=maven-archetype-webapp -DarchetypeVersion=RELEASE org.apache.maven.plugins:maven-archetype-plugin:RELEASE:generate [INFO] Scanning for projects... [INFO] ------------------------------------------------------------------------ [INFO] BUILD FAILURE [INFO] ------------------------------------------------------------------------ [INFO] Total time: 0.140 s [INFO] Finished at: 2019-11-02T21:41:10+08:00 [INFO] ------------------------------------------------------------------------ [ERROR] Plugin org.apache.maven.plugins:maven-archetype-plugin:RELEASE or one of its dependencies could not be resolved: Failed to read artifact descriptor for org.apache.maven.plugins:maven-archetype-plugin:jar:RELEASE: Failed to resolve version for org.apache.maven.plugins:maven-archetype-plugin:jar:RELEASE: Could not find metadata org.apache.maven.plugins:maven-archetype-plugin/maven-metadata.xml in local (E:\server\Repository) -> [Help 1] [ERROR] [ERROR] To see the full stack trace of the errors, re-run Maven with the -e switch. [ERROR] Re-run Maven using the -X switch to enable full debug logging. [ERROR] [ERROR] For more information about the errors and possible solutions, please read the following articles: [ERROR] [Help 1] http://cwiki.apache.org/confluence/display/MAVEN/PluginResolutionException 网上的解决方法我都试过了还是报错,有大佬帮忙看下吗? ```
eclipse创建maven工程时报错
使用的是官方的Eclipse中自带的m2e插件,创建maven项目时就弹出个错误 ![图片说明](https://img-ask.csdn.net/upload/201507/15/1436949464_186734.png) 在pom.xml文件那会显示个红X,提示如下: Multiple annotations found at this line: - Plugin execution not covered by lifecycle configuration: org.apache.maven.plugins:maven-compiler-plugin:3.1:testCompile (execution: default-testCompile, phase: test- compile) - Execution default-resources of goal org.apache.maven.plugins:maven-resources-plugin:2.6:resources failed: Plugin org.apache.maven.plugins:maven-resources-plugin:2.6 or one of its dependencies could not be resolved: The following artifacts could not be resolved: org.apache.maven:maven-plugin-api:jar:2.0.6, org.apache.maven:maven- project:jar:2.0.6, org.apache.maven:maven-profile:jar:2.0.6, org.apache.maven:maven-artifact-manager:jar:2.0.6, org.apache.maven:maven-plugin-registry:jar:2.0.6, org.apache.maven:maven-core:jar:2.0.6, org.apache.maven:maven-plugin-parameter-documenter:jar:2.0.6, org.apache.maven:maven-repository-metadata:jar:2.0.6, org.apache.maven:maven-error-diagnostics:jar:2.0.6, org.apache.maven:maven-plugin-descriptor:jar:2.0.6, org.apache.maven:maven-artifact:jar:2.0.6, org.apache.maven:maven- settings:jar:2.0.6, org.apache.maven:maven-model:jar:2.0.6, org.apache.maven:maven-monitor:jar:2.0.6, org.codehaus.plexus:plexus-container-default:jar:1.0-alpha-9-stable-1: Failure to transfer org.apache.maven:maven-plugin-api:jar:2.0.6 from https://repo.maven.apache.org/maven2 was cached in the local repository, resolution will not be reattempted until the update interval of central has elapsed or updates are forced. Original error: Could not transfer artifact org.apache.maven:maven-plugin-api:jar:2.0.6 from/to central (https://repo.maven.apache.org/maven2): The operation was cancelled. (org.apache.maven.plugins:maven-resources-plugin:2.6:resources:default-resources:process-resources) org.apache.maven.plugin.PluginExecutionException: Execution default-resources of goal org.apache.maven.plugins:maven-resources-plugin:2.6:resources failed: Plugin org.apache.maven.plugins:maven-resources-plugin:2.6 or one of its dependencies could not be resolved: The following artifacts could not be resolved: org.apache.maven:maven- plugin-api:jar:2.0.6, org.apache.maven:maven-project:jar:2.0.6, org.apache.maven:maven-profile:jar:2.0.6, org.apache.maven:maven-artifact-manager:jar:2.0.6, org.apache.maven:maven-plugin-registry:jar:2.0.6, org.apache.maven:maven-core:jar:2.0.6, org.apache.maven:maven-plugin-parameter-documenter:jar:2.0.6, org.apache.maven:maven-repository-metadata:jar:2.0.6, org.apache.maven:maven-error-diagnostics:jar:2.0.6, org.apache.maven:maven-plugin-descriptor:jar:2.0.6, org.apache.maven:maven-artifact:jar:2.0.6, org.apache.maven:maven-settings:jar:2.0.6, org.apache.maven:maven-model:jar:2.0.6, org.apache.maven:maven-monitor:jar:2.0.6, org.codehaus.plexus:plexus-container-default:jar:1.0-alpha-9-stable-1: Failure to transfer org.apache.maven:maven-plugin-api:jar:2.0.6 from https://repo.maven.apache.org/ maven2 was cached in the local repository, resolution will not be reattempted until the update interval of central has elapsed or updates are forced. Original error: Could not transfer artifact org.apache.maven:maven-plugin-api:jar:2.0.6 from/to central (https://repo.maven.apache.org/maven2): The operation was cancelled. at org.apache.maven.plugin.DefaultBuildPluginManager.executeMojo(DefaultBuildPluginManager.java:106) at org.eclipse.m2e.core.internal.embedder.MavenImpl.execute(MavenImpl.java:331) at org.eclipse.m2e.core.internal.embedder.MavenImpl$11.call(MavenImpl.java:1362) at org.eclipse.m2e.core.internal.embedder.MavenImpl$11.call(MavenImpl.java:1) at org.eclipse.m2e.core.internal.embedder.MavenExecutionContext.executeBare(MavenExecutionContext.java:176) at org.eclipse.m2e.core.internal.embedder.MavenExecutionContext.execute(MavenExecutionContext.java:112) at org.eclipse.m2e.core.internal.embedder.MavenImpl.execute(MavenImpl.java:1360) at org.eclipse.m2e.core.project.configurator.MojoExecutionBuildParticipant.build(MojoExecutionBuildParticipant.java:52) at org.eclipse.m2e.core.internal.builder.MavenBuilderImpl.build(MavenBuilderImpl.java:137) at org.eclipse.m2e.core.internal.builder.MavenBuilder$1.method(MavenBuilder.java:172) at org.eclipse.m2e.core.internal.builder.MavenBuilder$1.method(MavenBuilder.java:1) at org.eclipse.m2e.core.internal.builder.MavenBuilder$BuildMethod$1$1.call(MavenBuilder.java: 115) at org.eclipse.m2e.core.internal.embedder.MavenExecutionContext.executeBare(MavenExecutionContext.java:176) at org.eclipse.m2e.core.internal.embedder.MavenExecutionContext.execute(MavenExecutionContext.java:112) at org.eclipse.m2e.core.internal.builder.MavenBuilder$BuildMethod $1.call(MavenBuilder.java:105) at org.eclipse.m2e.core.internal.embedder.MavenExecutionContext.executeBare(MavenExecutionContext.java:176) at org.eclipse.m2e.core.internal.embedder.MavenExecutionContext.execute(MavenExecutionContext.java:151) at org.eclipse.m2e.core.internal.embedder.MavenExecutionContext.execute(MavenExecutionContext.java:99) at org.eclipse.m2e.core.internal.builder.MavenBuilder $BuildMethod.execute(MavenBuilder.java:86) at org.eclipse.m2e.core.internal.builder.MavenBuilder.build(MavenBuilder.java:200) at org.eclipse.core.internal.events.BuildManager $2.run(BuildManager.java:734) at org.eclipse.core.runtime.SafeRunner.run(SafeRunner.java:42) at org.eclipse.core.internal.events.BuildManager.basicBuild(BuildManager.java:205) at org.eclipse.core.internal.events.BuildManager.basicBuild(BuildManager.java:245) at org.eclipse.core.internal.events.BuildManager$1.run(BuildManager.java:300) at org.eclipse.core.runtime.SafeRunner.run(SafeRunner.java:42) at org.eclipse.core.internal.events.BuildManager.basicBuild(BuildManager.java:303) at org.eclipse.core.internal.events.BuildManager.basicBuildLoop(BuildManager.java:359) at org.eclipse.core.internal.events.BuildManager.build(BuildManager.java:382) at org.eclipse.core.internal.events.AutoBuildJob.doBuild(AutoBuildJob.java:144) at org.eclipse.core.internal.events.AutoBuildJob.run(AutoBuildJob.java:235) at org.eclipse.core.internal.jobs.Worker.run(Worker.java:55) Caused by: org.apache.maven.plugin.PluginResolutionException: Plugin org.apache.maven.plugins:maven-resources- plugin:2.6 or one of its dependencies could not be resolved: The following artifacts could not be resolved: org.apache.maven:maven-plugin-api:jar:2.0.6, org.apache.maven:maven- project:jar:2.0.6, org.apache.maven:maven-profile:jar:2.0.6, 请问如何解决?谢谢 ----- 本机安装的maven是3.2.2 eclipse是4.5 m2e是1.2 ----- 最后也不知道什么原因,重新下了eclipse就没有问题了
求助:项目报错maven包无法解析
同一个项目在其中一台电脑idea上clean报Error resolving version for 'org.apache.maven.plugins:maven-clean-plugin': Plugin requires Maven version 3.0错,运行时报Error resolving version for 'org.apache.maven.plugins:maven-resources-plugin': Plugin requires Maven version 3.0错误,在另一台电脑不会报错,项目文件都是一样的,导入3.0版本的也没有用
创建maven项目报错了,怎么解决
unable to create project from archetype Unable to create project from archetype [org.apache.maven.archetypes:maven-archetype-quickstart:RELEASE] The desired archetype does not exist (org.apache.maven.archetypes:maven-archetype-quickstart:1.1)
maven update project 报错
Could not calculate build plan: Plugin org.apache.maven.plugins:maven-resources-plugin:2.5 or one of its dependencies could not be resolved: Failed to read artifact descriptor for org.apache.maven.plugins:maven-resources-plugin:jar:2.5 Plugin org.apache.maven.plugins:maven-resources-plugin:2.5 or one of its dependencies could not be resolved: Failed to read artifact descriptor for org.apache.maven.plugins:maven-resources-plugin:jar:2.5![图片说明](https://img-ask.csdn.net/upload/201504/03/1428046444_669591.png)
myeclipse创建maven项目出错
Could not resolve archetype org.apache.maven.archetypes:maven-archetype-quickstart:RELEASE from any of the configured repositories. Could not resolve artifact org.apache.maven.archetypes:maven-archetype-quickstart:pom:RELEASE Failed to resolve version for org.apache.maven.archetypes:maven-archetype-quickstart:pom:RELEASE: Could not find metadata org.apache.maven.archetypes:maven-archetype-quickstart/maven-metadata.xml in local (F:\Learing\Maven\LocalMaven)
eclipse的maven导入时报错
第一次装maven,按步骤是装好了。导入第一个maven项目就报错了,求大神不吝赐教! 以下是错误提示 Errors occurred during the build. Errors running builder 'Maven Project Builder' on project 'jeecg'. Could not calculate build plan: Plugin org.apache.maven.plugins:maven-resources-plugin:2.6 or one of its dependencies could not be resolved: Cannot access central (https://repo.maven.apache.org/maven2) in offline mode and the artifact org.apache.maven.plugins:maven-resources-plugin:jar:2.6 has not been downloaded from it before. Plugin org.apache.maven.plugins:maven-resources-plugin:2.6 or one of its dependencies could not be resolved: Cannot access central (https://repo.maven.apache.org/maven2) in offline mode and the artifact org.apache.maven.plugins:maven-resources-plugin:jar:2.6 has not been downloaded from it before. Could not calculate build plan: Plugin org.apache.maven.plugins:maven-resources-plugin:2.6 or one of its dependencies could not be resolved: Cannot access central (https://repo.maven.apache.org/maven2) in offline mode and the artifact org.apache.maven.plugins:maven-resources-plugin:jar:2.6 has not been downloaded from it before. Plugin org.apache.maven.plugins:maven-resources-plugin:2.6 or one of its dependencies could not be resolved: Cannot access central (https://repo.maven.apache.org/maven2) in offline mode and the artifact org.apache.maven.plugins:maven-resources-plugin:jar:2.6 has not been downloaded from it before.
myeclipse建不了maven项目
建不了maven的wep和quickstart项目 - Could not resolve archetype org.apache.maven.archetypes:maven-archetype-webapp:RELEASE from any of the configured repositories. Could not resolve artifact org.apache.maven.archetypes:maven-archetype-webapp:pom:RELEASE Failed to resolve version for org.apache.maven.archetypes:maven-archetype-webapp:pom:RELEASE: Could not find metadata org.apache.maven.archetypes:maven-archetype-webapp/maven-metadata.xml in local (E:\maven_repository\.m2\repository) Failed to resolve version for org.apache.maven.archetypes:maven-archetype-webapp:pom:RELEASE: Could not find metadata org.apache.maven.archetypes:maven-archetype-webapp/maven-metadata.xml in local (E:\maven_repository\.m2\repository) ========================================================================
服务器启动报错For input string: "${dubbo.port}"
严重: Servlet threw load() exception java.lang.NumberFormatException: For input string: "${dubbo.port}" 扫描配置 <?xml version="1.0" encoding="UTF-8"?> <beans xmlns="http://www.springframework.org/schema/beans" xmlns:context="http://www.springframework.org/schema/context" xmlns:xsi="http://www.w3.org/2001/XMLSchema-instance" xsi:schemaLocation="http://www.springframework.org/schema/beans http://www.springframework.org/schema/beans/spring-beans-4.2.xsd http://www.springframework.org/schema/context http://www.springframework.org/schema/context/spring-context.xsd"> <context:property-placeholder location="classpath*:*.properties" **ignore-unresolvable="true"** /> </beans> 之前是dao层的配置文件报错"${jdbc.url}" 无法解析,搜了资料在扫描配置文件上加了*ignore-unresolvable="true",然后就报错数字转换异常了,百度查了下,有这样的问题,但是都没解决,在dubbo配置文件加上host解决不了
maven项目启动jetty-maven-plugin报错
刚接触maven项目,按照maven实战的说明,使用jetty plugin进行部署,运行jetty:run命令的时候,控制台出现如下异常信息: 2015-05-06 13:42:08.082:WARN:oejw.WebAppContext:Failed startup of context o.m.j.p.JettyWebAppContext{/web,file:/E:/mycode/web_advancement/src/main/webapp/},file:/E:/mycode/web_advancement/src/main/webapp/ org.apache.commons.logging.LogConfigurationException: java.lang.IllegalAccessError: class sun.reflect.GeneratedConstructorAccessor 32 cannot access its superclass sun.reflect.ConstructorAccessorImpl (Caused by java.lang.IllegalAccessError: class sun.reflect.Gen eratedConstructorAccessor32 cannot access its superclass sun.reflect.ConstructorAccessorImpl) at org.apache.commons.logging.impl.LogFactoryImpl.newInstance(LogFactoryImpl.java:571) at org.apache.commons.logging.impl.LogFactoryImpl.getInstance(LogFactoryImpl.java:292) at org.apache.commons.logging.impl.LogFactoryImpl.getInstance(LogFactoryImpl.java:269) at org.apache.commons.logging.LogFactory.getLog(LogFactory.java:657) at org.springframework.core.env.PropertySource.<init>(PropertySource.java:58) at org.springframework.core.env.PropertySource$StubPropertySource.<init>(PropertySource.java:220) at org.springframework.core.env.PropertySource$ComparisonPropertySource.<init>(PropertySource.java:243) at org.springframework.core.env.PropertySource.named(PropertySource.java:200) 不知道哪位以前解决过类似的问题,请不吝赐教
关于maven下载jar报错问题,本地仓库有相关jar包
Could not calculate build plan: Plugin org.apache.maven.plugins:maven-resources-plugin:2.6 or one of its dependencies could not be resolved: Failed to read artifact descriptor for org.apache.maven.plugins:maven-resources-plugin:jar:2.6 Plugin org.apache.maven.plugins:maven-resources-plugin:2.6 or one of its dependencies could not be resolved: Failed to read artifact descriptor for org.apache.maven.plugins:maven-resources-plugin:jar:2.6 (已经删除响应jar包并且重新maven update 但是依然会弹出报错窗口)
在做一个淘淘商城的项目,出现了子项目pom.xml报错的问题
子项目pom.xml区 ``` <project xmlns="http://maven.apache.org/POM/4.0.0" xmlns:xsi="http://www.w3.org/2001/XMLSchema-instance" xsi:schemaLocation="http://maven.apache.org/POM/4.0.0 http://maven.apache.org/xsd/maven-4.0.0.xsd"> <modelVersion>4.0.0</modelVersion> <parent> <groupId>cn.itcast.parent</groupId> <artifactId>itcast-parent</artifactId> <version>0.0.1-SNAPSHOT</version> </parent> <groupId>cn.itcast.usermanage</groupId> <artifactId>itcast-usermanage</artifactId> <version>1.0.0-SNAPSHOT</version> <packaging>war</packaging> <dependencies> <!-- 单元测试 --> <dependency> <groupId>junit</groupId> <artifactId>junit</artifactId> <scope>test</scope> </dependency> <dependency> <groupId>org.springframework</groupId> <artifactId>spring-webmvc</artifactId> </dependency> <dependency> <groupId>org.springframework</groupId> <artifactId>spring-jdbc</artifactId> </dependency> <dependency> <groupId>org.springframework</groupId> <artifactId>spring-aspects</artifactId> </dependency> <!-- Mybatis --> <dependency> <groupId>org.mybatis</groupId> <artifactId>mybatis</artifactId> </dependency> <dependency> <groupId>org.mybatis</groupId> <artifactId>mybatis-spring</artifactId> </dependency> <!-- MySql --> <dependency> <groupId>mysql</groupId> <artifactId>mysql-connector-java</artifactId> </dependency> <dependency> <groupId>org.slf4j</groupId> <artifactId>slf4j-log4j12</artifactId> </dependency> <!-- Jackson Json处理工具包 --> <dependency> <groupId>com.fasterxml.jackson.core</groupId> <artifactId>jackson-databind</artifactId> </dependency> <!-- 连接池 --> <dependency> <groupId>com.jolbox</groupId> <artifactId>bonecp-spring</artifactId> </dependency> <!-- JSP相关 --> <dependency> <groupId>jstl</groupId> <artifactId>jstl</artifactId> </dependency> <dependency> <groupId>javax.servlet</groupId> <artifactId>servlet-api</artifactId> <scope>provided</scope> </dependency> <dependency> <groupId>javax.servlet</groupId> <artifactId>jsp-api</artifactId> <scope>provided</scope> </dependency> <!-- Apache工具组件 --> <dependency> <groupId>org.apache.commons</groupId> <artifactId>commons-lang3</artifactId> </dependency> <dependency> <groupId>org.apache.commons</groupId> <artifactId>commons-io</artifactId> </dependency> <dependency> <groupId>com.github.pagehelper</groupId> <artifactId>pagehelper</artifactId> </dependency> <dependency> <groupId>com.github.jsqlparser</groupId> <artifactId>jsqlparser</artifactId> </dependency> <dependency> <groupId>com.github.abel533</groupId> <artifactId>mapper</artifactId> </dependency> </dependencies> <build> <plugins> <!-- 配置Tomcat插件 --> <plugin> <groupId>org.apache.tomcat.maven</groupId> <artifactId>tomcat7-maven-plugin</artifactId> <configuration> <port>80</port> <!-- http://127.0.0.1:{port}/{path} --> <path>/</path> </configuration> </plugin> </plugins> </build> </project> ``` 报错问题代码区: ``` Multiple annotations found at this line: - Execution default-resources of goal org.apache.maven.plugins:maven-resources-plugin:2.7:resources failed: Plugin org.apache.maven.plugins:maven-resources-plugin:2.7 or one of its dependencies could not be resolved: The following artifacts could not be resolved: org.apache.maven.doxia:doxia-sink-api:jar:1.1, org.apache.maven.doxia:doxia-logging-api:jar:1.1, org.apache.maven:maven-repository-metadata:jar:2.2.1, org.apache.maven:maven-error-diagnostics:jar:2.2.1, org.apache.maven:maven- plugin-descriptor:jar:2.2.1, org.sonatype.plexus:plexus-sec-dispatcher:jar:1.3, org.sonatype.plexus:plexus-cipher:jar:1.4, org.apache.maven:maven-settings:jar:2.2.1, org.apache.maven:maven-monitor:jar:2.2.1: Failure to transfer org.apache.maven.doxia:doxia- sink-api:jar:1.1 from http://maven.aliyun.com/nexus/content/repositories/central/ was cached in the local repository, resolution will not be reattempted until the update interval of alimaven has elapsed or updates are forced. Original error: Could not transfer artifact org.apache.maven.doxia:doxia-sink-api:jar:1.1 from/to alimaven (http://maven.aliyun.com/nexus/content/repositories/central/): The operation was cancelled. (org.apache.maven.plugins:maven-resources-plugin:2.7:resources:default-resources:process-resources) org.apache.maven.plugin.PluginExecutionException: Execution default-resources of goal org.apache.maven.plugins:maven-resources- plugin:2.7:resources failed: Plugin org.apache.maven.plugins:maven-resources-plugin:2.7 or one of its dependencies could not be resolved: The following artifacts could not be resolved: org.apache.maven.doxia:doxia-sink-api:jar:1.1, org.apache.maven.doxia:doxia- logging-api:jar:1.1, org.apache.maven:maven-repository-metadata:jar:2.2.1, org.apache.maven:maven-error-diagnostics:jar:2.2.1, org.apache.maven:maven-plugin-descriptor:jar:2.2.1, org.sonatype.plexus:plexus-sec-dispatcher:jar:1.3, org.sonatype.plexus:plexus- cipher:jar:1.4, org.apache.maven:maven-settings:jar:2.2.1, org.apache.maven:maven-monitor:jar:2.2.1: Failure to transfer org.apache.maven.doxia:doxia-sink-api:jar:1.1 from http://maven.aliyun.com/nexus/content/repositories/central/ was cached in the local repository, resolution will not be reattempted until the update interval of alimaven has elapsed or updates are forced. Original error: Could not transfer artifact org.apache.maven.doxia:doxia-sink-api:jar:1.1 from/to alimaven (http://maven.aliyun.com/nexus/content/ repositories/central/): The operation was cancelled. at org.apache.maven.plugin.DefaultBuildPluginManager.executeMojo(DefaultBuildPluginManager.java:109) at org.eclipse.m2e.core.internal.embedder.MavenImpl.execute(MavenImpl.java:331) at org.eclipse.m2e.core.internal.embedder.MavenImpl.lambda$7(MavenImpl.java:1342) at org.eclipse.m2e.core.internal.embedder.MavenExecutionContext.executeBare(MavenExecutionContext.java:177) at org.eclipse.m2e.core.internal.embedder.MavenExecutionContext.execute(MavenExecutionContext.java:112) at org.eclipse.m2e.core.internal.embedder.MavenImpl.execute(MavenImpl.java:1341) at org.eclipse.m2e.core.project.configurator.MojoExecutionBuildParticipant.build(MojoExecutionBuildParticipant.java:52) at org.eclipse.m2e.core.internal.builder.MavenBuilderImpl.build(MavenBuilderImpl.java:137) at org.eclipse.m2e.core.internal.builder.MavenBuilder$1.method(MavenBuilder.java:173) at org.eclipse.m2e.core.internal.builder.MavenBuilder$1.method(MavenBuilder.java:1) at org.eclipse.m2e.core.internal.builder.MavenBuilder$BuildMethod$1$1.call(MavenBuilder.java:116) at org.eclipse.m2e.core.internal.embedder.MavenExecutionContext.executeBare(MavenExecutionContext.java:177) at org.eclipse.m2e.core.internal.embedder.MavenExecutionContext.execute(MavenExecutionContext.java:112) at org.eclipse.m2e.core.internal.builder.MavenBuilder$BuildMethod$1.call(MavenBuilder.java:106) at org.eclipse.m2e.core.internal.embedder.MavenExecutionContext.executeBare(MavenExecutionContext.java:177) at org.eclipse.m2e.core.internal.embedder.MavenExecutionContext.execute(MavenExecutionContext.java:151) at org.eclipse.m2e.core.internal.embedder.MavenExecutionContext.execute(MavenExecutionContext.java:99) at org.eclipse.m2e.core.internal.builder.MavenBuilder$BuildMethod.execute(MavenBuilder.java:87) at org.eclipse.m2e.core.internal.builder.MavenBuilder.build(MavenBuilder.java:201) at org.eclipse.core.internal.events.BuildManager$2.run(BuildManager.java:833) at org.eclipse.core.runtime.SafeRunner.run(SafeRunner.java: 45) at org.eclipse.core.internal.events.BuildManager.basicBuild(BuildManager.java:220) at org.eclipse.core.internal.events.BuildManager.basicBuild(BuildManager.java:263) at org.eclipse.core.internal.events.BuildManager$1.run(BuildManager.java:316) at org.eclipse.core.runtime.SafeRunner.run(SafeRunner.java: 45) at org.eclipse.core.internal.events.BuildManager.basicBuild(BuildManager.java:319) at org.eclipse.core.internal.events.BuildManager.basicBuildLoop(BuildManager.java:371) at org.eclipse.core.internal.events.BuildManager.build(BuildManager.java:392) at org.eclipse.core.internal.events.AutoBuildJob.doBuild(AutoBuildJob.java:154) at org.eclipse.core.internal.events.AutoBuildJob.run(AutoBuildJob.java:244) at org.eclipse.core.internal.jobs.Worker.run(Worker.java:63) Caused by: org.apache.maven.plugin.PluginResolutionException: Plugin org.apache.maven.plugins:maven-resources-plugin:2.7 or one of its dependencies could not be resolved: The following artifacts could not be resolved: org.apache.maven.doxia:doxia-sink-api:jar:1.1, org.apache.maven.doxia:doxia-logging-api:jar:1.1, org.apache.maven:maven-repository-metadata:jar:2.2.1, org.apache.maven:maven- error-diagnostics:jar:2.2.1, org.apache.maven:maven-plugin-descriptor:jar:2.2.1, org.sonatype.plexus:plexus-sec-dispatcher:jar:1.3, org.sonatype.plexus:plexus-cipher:jar:1.4, org.apache.maven:maven-settings:jar:2.2.1, org.apache.maven:maven-monitor:jar:2.2.1: Failure to transfer org.apache.maven.doxia:doxia-sink-api:jar:1.1 from http://maven.aliyun.com/nexus/content/repositories/central/ was cached in the local repository, resolution will not be reattempted until the update interval of alimaven has elapsed or updates are forced. Original error: Could not transfer artifact org.apache.maven.doxia:doxia-sink-api:jar:1.1 from/to alimaven (http://maven.aliyun.com/nexus/ content/repositories/central/): The operation was cancelled. at org.apache.maven.plugin.internal.DefaultPluginDependenciesResolver.resolveInternal(DefaultPluginDependenciesResolver.java:218) at org.apache.maven.plugin.internal.DefaultPluginDependenciesResolver.resolve(DefaultPluginDependenciesResolver.java:149) at org.eclipse.m2e.core.internal.project.registry.EclipsePluginDependenciesResolver.resolve(EclipsePluginDependenciesResolver.java:59) at org.apache.maven.plugin.internal.DefaultMavenPluginManager.createPluginRealm(DefaultMavenPluginManager.java:402) at org.apache.maven.plugin.internal.DefaultMavenPluginManager.setupPluginRealm(DefaultMavenPluginManager.java:374) at org.apache.maven.plugin.DefaultBuildPluginManager.getPluginRealm(DefaultBuildPluginManager.java:234) at org.apache.maven.plugin.DefaultBuildPluginManager.executeMojo(DefaultBuildPluginManager.java:105) ... 30 more Caused by: org.eclipse.aether.resolution.ArtifactResolutionException: The following artifacts could not be resolved: org.apache.maven.doxia:doxia- sink-api:jar:1.1, org.apache.maven.doxia:doxia-logging-api:jar:1.1, org.apache.maven:maven-repository-metadata:jar:2.2.1, org.apache.maven:maven-error-diagnostics:jar:2.2.1, org.apache.maven:maven-plugin-descriptor:jar:2.2.1, org.sonatype.plexus:plexus- sec-dispatcher:jar:1.3, org.sonatype.plexus:plexus-cipher:jar:1.4, org.apache.maven:maven-settings:jar:2.2.1, org.apache.maven:maven- monitor:jar:2.2.1: Failure to transfer org.apache.maven.doxia:doxia-sink-api:jar:1.1 from http://maven.aliyun.com/nexus/content/ repositories/central/ was cached in the local repository, resolution will not be reattempted until the update interval of alimaven has elapsed or updates are forced. Original error: Could not transfer artifact org.apache.maven.doxia:doxia-sink-api:jar:1.1 from/to alimaven (http://maven.aliyun.com/nexus/content/repositories/central/): The operation was cancelled. at org.eclipse.aether.internal.impl.DefaultArtifactResolver.resolve(DefaultArtifactResolver.java:422) at org.eclipse.aether.internal.impl.DefaultArtifactResolver.resolveArtifacts(DefaultArtifactResolver.java:224) at org.eclipse.aether.internal.impl.DefaultRepositorySystem.resolveDependencies(DefaultRepositorySystem.java:338) at org.apache.maven.plugin.internal.DefaultPluginDependenciesResolver.resolveInternal(DefaultPluginDependenciesResolver.java:210) ... 36 more Caused by: org.eclipse.aether.transfer.ArtifactTransferException: Failure to transfer org.apache.maven.doxia:doxia-sink-api:jar: 1.1 from http://maven.aliyun.com/nexus/content/repositories/central/ was cached in the local repository, resolution will not be reattempted until the update interval of alimaven has elapsed or updates are forced. Original error: Could not transfer artifact org.apache.maven.doxia:doxia-sink-api:jar:1.1 from/to alimaven (http://maven.aliyun.com/nexus/content/repositories/central/): The operation was cancelled. at org.eclipse.aether.internal.impl.DefaultUpdateCheckManager.newException(DefaultUpdateCheckManager.java:240) at org.eclipse.aether.internal.impl.DefaultUpdateCheckManager.checkArtifact(DefaultUpdateCheckManager.java:208) at org.eclipse.aether.internal.impl.DefaultArtifactResolver.gatherDownloads(DefaultArtifactResolver.java:563) at org.eclipse.aether.internal.impl.DefaultArtifactResolver.performDownloads(DefaultArtifactResolver.java:481) at org.eclipse.aether.internal.impl.DefaultArtifactResolver.resolve(DefaultArtifactResolver.java:399) ... 39 more - Execution default-testResources of goal org.apache.maven.plugins:maven-resources-plugin:2.7:testResources failed: Plugin org.apache.maven.plugins:maven-resources-plugin:2.7 or one of its dependencies could not be resolved: The following artifacts could not be resolved: org.apache.maven.doxia:doxia-sink-api:jar:1.1, org.apache.maven.doxia:doxia-logging-api:jar:1.1, org.apache.maven:maven-repository-metadata:jar:2.2.1, org.apache.maven:maven-error-diagnostics:jar:2.2.1, org.apache.maven:maven- plugin-descriptor:jar:2.2.1, org.sonatype.plexus:plexus-sec-dispatcher:jar:1.3, org.sonatype.plexus:plexus-cipher:jar:1.4, org.apache.maven:maven-settings:jar:2.2.1, org.apache.maven:maven-monitor:jar:2.2.1: Failure to transfer org.apache.maven.doxia:doxia- sink-api:jar:1.1 from http://maven.aliyun.com/nexus/content/repositories/central/ was cached in the local repository, resolution will not be reattempted until the update interval of alimaven has elapsed or updates are forced. Original error: Could not transfer artifact org.apache.maven.doxia:doxia-sink-api:jar:1.1 from/to alimaven (http://maven.aliyun.com/nexus/content/repositories/central/): The operation was cancelled. (org.apache.maven.plugins:maven-resources-plugin:2.7:testResources:default-testResources:process-test- resources) org.apache.maven.plugin.PluginExecutionException: Execution default-testResources of goal org.apache.maven.plugins:maven-resources-plugin:2.7:testResources failed: Plugin org.apache.maven.plugins:maven-resources-plugin: 2.7 or one of its dependencies could not be resolved: The following artifacts could not be resolved: org.apache.maven.doxia:doxia-sink- api:jar:1.1, org.apache.maven.doxia:doxia-logging-api:jar:1.1, org.apache.maven:maven-repository-metadata:jar:2.2.1, org.apache.maven:maven-error-diagnostics:jar:2.2.1, org.apache.maven:maven-plugin-descriptor:jar:2.2.1, org.sonatype.plexus:plexus- sec-dispatcher:jar:1.3, org.sonatype.plexus:plexus-cipher:jar:1.4, org.apache.maven:maven-settings:jar:2.2.1, org.apache.maven:maven- monitor:jar:2.2.1: Failure to transfer org.apache.maven.doxia:doxia-sink-api:jar:1.1 from http://maven.aliyun.com/nexus/content/ repositories/central/ was cached in the local repository, resolution will not be reattempted until the update interval of alimaven has elapsed or updates are forced. Original error: Could not transfer artifact org.apache.maven.doxia:doxia-sink-api:jar:1.1 from/to alimaven (http://maven.aliyun.com/nexus/content/repositories/central/): The operation was cancelled. at org.apache.maven.plugin.DefaultBuildPluginManager.executeMojo(DefaultBuildPluginManager.java:109) at org.eclipse.m2e.core.internal.embedder.MavenImpl.execute(MavenImpl.java:331) at org.eclipse.m2e.core.internal.embedder.MavenImpl.lambda$7(MavenImpl.java:1342) at org.eclipse.m2e.core.internal.embedder.MavenExecutionContext.executeBare(MavenExecutionContext.java:177) at org.eclipse.m2e.core.internal.embedder.MavenExecutionContext.execute(MavenExecutionContext.java:112) at org.eclipse.m2e.core.internal.embedder.MavenImpl.execute(MavenImpl.java:1341) at org.eclipse.m2e.core.project.configurator.MojoExecutionBuildParticipant.build(MojoExecutionBuildParticipant.java:52) at org.eclipse.m2e.core.internal.builder.MavenBuilderImpl.build(MavenBuilderImpl.java:137) at org.eclipse.m2e.core.internal.builder.MavenBuilder$1.method(MavenBuilder.java:173) at org.eclipse.m2e.core.internal.builder.MavenBuilder$1.method(MavenBuilder.java:1) at org.eclipse.m2e.core.internal.builder.MavenBuilder$BuildMethod$1$1.call(MavenBuilder.java:116) at org.eclipse.m2e.core.internal.embedder.MavenExecutionContext.executeBare(MavenExecutionContext.java:177) at org.eclipse.m2e.core.internal.embedder.MavenExecutionContext.execute(MavenExecutionContext.java:112) at org.eclipse.m2e.core.internal.builder.MavenBuilder$BuildMethod$1.call(MavenBuilder.java:106) at org.eclipse.m2e.core.internal.embedder.MavenExecutionContext.executeBare(MavenExecutionContext.java:177) at org.eclipse.m2e.core.internal.embedder.MavenExecutionContext.execute(MavenExecutionContext.java:151) at org.eclipse.m2e.core.internal.embedder.MavenExecutionContext.execute(MavenExecutionContext.java:99) at org.eclipse.m2e.core.internal.builder.MavenBuilder$BuildMethod.execute(MavenBuilder.java:87) at org.eclipse.m2e.core.internal.builder.MavenBuilder.build(MavenBuilder.java:201) at org.eclipse.core.internal.events.BuildManager$2.run(BuildManager.java:833) at org.eclipse.core.runtime.SafeRunner.run(SafeRunner.java: 45) at org.eclipse.core.internal.events.BuildManager.basicBuild(BuildManager.java:220) at org.eclipse.core.internal.events.BuildManager.basicBuild(BuildManager.java:263) at org.eclipse.core.internal.events.BuildManager$1.run(BuildManager.java:316) at org.eclipse.core.runtime.SafeRunner.run(SafeRunner.java: 45) at org.eclipse.core.internal.events.BuildManager.basicBuild(BuildManager.java:319) at org.eclipse.core.internal.events.BuildManager.basicBuildLoop(BuildManager.java:371) at org.eclipse.core.internal.events.BuildManager.build(BuildManager.java:392) at org.eclipse.core.internal.events.AutoBuildJob.doBuild(AutoBuildJob.java:154) at org.eclipse.core.internal.events.AutoBuildJob.run(AutoBuildJob.java:244) at org.eclipse.core.internal.jobs.Worker.run(Worker.java:63) Caused by: org.apache.maven.plugin.PluginResolutionException: Plugin org.apache.maven.plugins:maven-resources-plugin:2.7 or one of its dependencies could not be resolved: The following artifacts could not be resolved: org.apache.maven.doxia:doxia-sink-api:jar:1.1, org.apache.maven.doxia:doxia-logging-api:jar:1.1, org.apache.maven:maven-repository-metadata:jar:2.2.1, org.apache.maven:maven- error-diagnostics:jar:2.2.1, org.apache.maven:maven-plugin-descriptor:jar:2.2.1, org.sonatype.plexus:plexus-sec-dispatcher:jar:1.3, org.sonatype.plexus:plexus-cipher:jar:1.4, org.apache.maven:maven-settings:jar:2.2.1, org.apache.maven:maven-monitor:jar:2.2.1: Failure to transfer org.apache.maven.doxia:doxia-sink-api:jar:1.1 from http://maven.aliyun.com/nexus/content/repositories/central/ was cached in the local repository, resolution will not be reattempted until the update interval of alimaven has elapsed or updates are forced. Original error: Could not transfer artifact org.apache.maven.doxia:doxia-sink-api:jar:1.1 from/to alimaven (http://maven.aliyun.com/nexus/ content/repositories/central/): The operation was cancelled. at org.apache.maven.plugin.internal.DefaultPluginDependenciesResolver.resolveInternal(DefaultPluginDependenciesResolver.java:218) at org.apache.maven.plugin.internal.DefaultPluginDependenciesResolver.resolve(DefaultPluginDependenciesResolver.java:149) at org.eclipse.m2e.core.internal.project.registry.EclipsePluginDependenciesResolver.resolve(EclipsePluginDependenciesResolver.java:59) at org.apache.maven.plugin.internal.DefaultMavenPluginManager.createPluginRealm(DefaultMavenPluginManager.java:402) at org.apache.maven.plugin.internal.DefaultMavenPluginManager.setupPluginRealm(DefaultMavenPluginManager.java:374) at org.apache.maven.plugin.DefaultBuildPluginManager.getPluginRealm(DefaultBuildPluginManager.java:234) at org.apache.maven.plugin.DefaultBuildPluginManager.executeMojo(DefaultBuildPluginManager.java:105) ... 30 more Caused by: org.eclipse.aether.resolution.ArtifactResolutionException: The following artifacts could not be resolved: org.apache.maven.doxia:doxia- sink-api:jar:1.1, org.apache.maven.doxia:doxia-logging-api:jar:1.1, org.apache.maven:maven-repository-metadata:jar:2.2.1, org.apache.maven:maven-error-diagnostics:jar:2.2.1, org.apache.maven:maven-plugin-descriptor:jar:2.2.1, org.sonatype.plexus:plexus- sec-dispatcher:jar:1.3, org.sonatype.plexus:plexus-cipher:jar:1.4, org.apache.maven:maven-settings:jar:2.2.1, org.apache.maven:maven- monitor:jar:2.2.1: Failure to transfer org.apache.maven.doxia:doxia-sink-api:jar:1.1 from http://maven.aliyun.com/nexus/content/ repositories/central/ was cached in the local repository, resolution will not be reattempted until the update interval of alimaven has elapsed or updates are forced. Original error: Could not transfer artifact org.apache.maven.doxia:doxia-sink-api:jar:1.1 from/to alimaven (http://maven.aliyun.com/nexus/content/repositories/central/): The operation was cancelled. at org.eclipse.aether.internal.impl.DefaultArtifactResolver.resolve(DefaultArtifactResolver.java:422) at org.eclipse.aether.internal.impl.DefaultArtifactResolver.resolveArtifacts(DefaultArtifactResolver.java:224) at org.eclipse.aether.internal.impl.DefaultRepositorySystem.resolveDependencies(DefaultRepositorySystem.java:338) at org.apache.maven.plugin.internal.DefaultPluginDependenciesResolver.resolveInternal(DefaultPluginDependenciesResolver.java:210) ... 36 more Caused by: org.eclipse.aether.transfer.ArtifactTransferException: Failure to transfer org.apache.maven.doxia:doxia-sink-api:jar: 1.1 from http://maven.aliyun.com/nexus/content/repositories/central/ was cached in the local repository, resolution will not be reattempted until the update interval of alimaven has elapsed or updates are forced. Original error: Could not transfer artifact org.apache.maven.doxia:doxia-sink-api:jar:1.1 from/to alimaven (http://maven.aliyun.com/nexus/content/repositories/central/): The operation was cancelled. at org.eclipse.aether.internal.impl.DefaultUpdateCheckManager.newException(DefaultUpdateCheckManager.java:240) at org.eclipse.aether.internal.impl.DefaultUpdateCheckManager.checkArtifact(DefaultUpdateCheckManager.java:208) at org.eclipse.aether.internal.impl.DefaultArtifactResolver.gatherDownloads(DefaultArtifactResolver.java:563) at org.eclipse.aether.internal.impl.DefaultArtifactResolver.performDownloads(DefaultArtifactResolver.java:481) at org.eclipse.aether.internal.impl.DefaultArtifactResolver.resolve(DefaultArtifactResolver.java:399) ... 39 more ```
终于明白阿里百度这样的大公司,为什么面试经常拿ThreadLocal考验求职者了
点击上面↑「爱开发」关注我们每晚10点,捕获技术思考和创业资源洞察什么是ThreadLocalThreadLocal是一个本地线程副本变量工具类,各个线程都拥有一份线程私...
《奇巧淫技》系列-python!!每天早上八点自动发送天气预报邮件到QQ邮箱
将代码部署服务器,每日早上定时获取到天气数据,并发送到邮箱。 也可以说是一个小人工智障。 思路可以运用在不同地方,主要介绍的是思路。
面试官问我:什么是消息队列?什么场景需要他?用了会出现什么问题?
你知道的越多,你不知道的越多 点赞再看,养成习惯 GitHub上已经开源 https://github.com/JavaFamily 有一线大厂面试点脑图、个人联系方式和人才交流群,欢迎Star和完善 前言 消息队列在互联网技术存储方面使用如此广泛,几乎所有的后端技术面试官都要在消息队列的使用和原理方面对小伙伴们进行360°的刁难。 作为一个在互联网公司面一次拿一次Offer的面霸...
8年经验面试官详解 Java 面试秘诀
作者 |胡书敏 责编 | 刘静 出品 | CSDN(ID:CSDNnews) 本人目前在一家知名外企担任架构师,而且最近八年来,在多家外企和互联网公司担任Java技术面试官,前后累计面试了有两三百位候选人。在本文里,就将结合本人的面试经验,针对Java初学者、Java初级开发和Java开发,给出若干准备简历和准备面试的建议。 Java程序员准备和投递简历的实...
究竟你适不适合买Mac?
我清晰的记得,刚买的macbook pro回到家,开机后第一件事情,就是上了淘宝网,花了500元钱,找了一个上门维修电脑的师傅,上门给我装了一个windows系统。。。。。。 表砍我。。。 当时买mac的初衷,只是想要个固态硬盘的笔记本,用来运行一些复杂的扑克软件。而看了当时所有的SSD笔记本后,最终决定,还是买个好(xiong)看(da)的。 已经有好几个朋友问我mba怎么样了,所以今天尽量客观...
MyBatis研习录(01)——MyBatis概述与入门
MyBatis 是一款优秀的持久层框架,它支持定制化 SQL、存储过程以及高级映射。MyBatis原本是apache的一个开源项目iBatis, 2010年该项目由apache software foundation 迁移到了google code并改名为MyBatis 。2013年11月MyBatis又迁移到Github。
程序员一般通过什么途径接私活?
二哥,你好,我想知道一般程序猿都如何接私活,我也想接,能告诉我一些方法吗? 上面是一个读者“烦不烦”问我的一个问题。其实不止是“烦不烦”,还有很多读者问过我类似这样的问题。 我接的私活不算多,挣到的钱也没有多少,加起来不到 20W。说实话,这个数目说出来我是有点心虚的,毕竟太少了,大家轻喷。但我想,恰好配得上“一般程序员”这个称号啊。毕竟苍蝇再小也是肉,我也算是有经验的人了。 唾弃接私活、做外...
Python爬虫爬取淘宝,京东商品信息
小编是一个理科生,不善长说一些废话。简单介绍下原理然后直接上代码。 使用的工具(Python+pycharm2019.3+selenium+xpath+chromedriver)其中要使用pycharm也可以私聊我selenium是一个框架可以通过pip下载 pip installselenium -ihttps://pypi.tuna.tsinghua.edu.cn/simple/ ...
阿里程序员写了一个新手都写不出的低级bug,被骂惨了。
这种新手都不会范的错,居然被一个工作好几年的小伙子写出来,差点被当场开除了。
Java工作4年来应聘要16K最后没要,细节如下。。。
前奏: 今天2B哥和大家分享一位前几天面试的一位应聘者,工作4年26岁,统招本科。 以下就是他的简历和面试情况。 基本情况: 专业技能: 1、&nbsp;熟悉Sping了解SpringMVC、SpringBoot、Mybatis等框架、了解SpringCloud微服务 2、&nbsp;熟悉常用项目管理工具:SVN、GIT、MAVEN、Jenkins 3、&nbsp;熟悉Nginx、tomca...
Python爬虫精简步骤1 获取数据
爬虫,从本质上来说,就是利用程序在网上拿到对我们有价值的数据。 爬虫能做很多事,能做商业分析,也能做生活助手,比如:分析北京近两年二手房成交均价是多少?广州的Python工程师平均薪资是多少?北京哪家餐厅粤菜最好吃?等等。 这是个人利用爬虫所做到的事情,而公司,同样可以利用爬虫来实现巨大的商业价值。比如你所熟悉的搜索引擎——百度和谷歌,它们的核心技术之一也是爬虫,而且是超级爬虫。 从搜索巨头到人工...
Python绘图,圣诞树,花,爱心 | Turtle篇
每周每日,分享Python实战代码,入门资料,进阶资料,基础语法,爬虫,数据分析,web网站,机器学习,深度学习等等。 公众号回复【进群】沟通交流吧,QQ扫码进群学习吧 微信群 QQ群 1.画圣诞树 import turtle screen = turtle.Screen() screen.setup(800,600) circle = turtle.Turtle()...
作为一个程序员,CPU的这些硬核知识你必须会!
CPU对每个程序员来说,是个既熟悉又陌生的东西? 如果你只知道CPU是中央处理器的话,那可能对你并没有什么用,那么作为程序员的我们,必须要搞懂的就是CPU这家伙是如何运行的,尤其要搞懂它里面的寄存器是怎么一回事,因为这将让你从底层明白程序的运行机制。 随我一起,来好好认识下CPU这货吧 把CPU掰开来看 对于CPU来说,我们首先就要搞明白它是怎么回事,也就是它的内部构造,当然,CPU那么牛的一个东...
破14亿,Python分析我国存在哪些人口危机!
一、背景 二、爬取数据 三、数据分析 1、总人口 2、男女人口比例 3、人口城镇化 4、人口增长率 5、人口老化(抚养比) 6、各省人口 7、世界人口 四、遇到的问题 遇到的问题 1、数据分页,需要获取从1949-2018年数据,观察到有近20年参数:LAST20,由此推测获取近70年的参数可设置为:LAST70 2、2019年数据没有放上去,可以手动添加上去 3、将数据进行 行列转换 4、列名...
web前端javascript+jquery知识点总结
1.Javascript 语法.用途 javascript 在前端网页中占有非常重要的地位,可以用于验证表单,制作特效等功能,它是一种描述语言,也是一种基于对象(Object)和事件驱动并具有安全性的脚本语言 ...
Python实战:抓肺炎疫情实时数据,画2019-nCoV疫情地图
今天,群里白垩老师问如何用python画武汉肺炎疫情地图。白垩老师是研究海洋生态与地球生物的学者,国家重点实验室成员,于不惑之年学习python,实为我等学习楷模。先前我并没有关注武汉肺炎的具体数据,也没有画过类似的数据分布图。于是就拿了两个小时,专门研究了一下,遂成此文。
听说想当黑客的都玩过这个Monyer游戏(1~14攻略)
第零关 进入传送门开始第0关(游戏链接) 请点击链接进入第1关: 连接在左边→ ←连接在右边 看不到啊。。。。(只能看到一堆大佬做完的留名,也能看到菜鸡的我,在后面~~) 直接fn+f12吧 &lt;span&gt;连接在左边→&lt;/span&gt; &lt;a href="first.php"&gt;&lt;/a&gt; &lt;span&gt;←连接在右边&lt;/span&gt; o...
在家远程办公效率低?那你一定要收好这个「在家办公」神器!
相信大家都已经收到国务院延长春节假期的消息,接下来,在家远程办公可能将会持续一段时间。 但是问题来了。远程办公不是人在电脑前就当坐班了,相反,对于沟通效率,文件协作,以及信息安全都有着极高的要求。有着非常多的挑战,比如: 1在异地互相不见面的会议上,如何提高沟通效率? 2文件之间的来往反馈如何做到及时性?如何保证信息安全? 3如何规划安排每天工作,以及如何进行成果验收? ...... ...
作为一个程序员,内存和磁盘的这些事情,你不得不知道啊!!!
截止目前,我已经分享了如下几篇文章: 一个程序在计算机中是如何运行的?超级干货!!! 作为一个程序员,CPU的这些硬核知识你必须会! 作为一个程序员,内存的这些硬核知识你必须懂! 这些知识可以说是我们之前都不太重视的基础知识,可能大家在上大学的时候都学习过了,但是嘞,当时由于老师讲解的没那么有趣,又加上这些知识本身就比较枯燥,所以嘞,大家当初几乎等于没学。 再说啦,学习这些,也看不出来有什么用啊!...
渗透测试-灰鸽子远控木马
木马概述 灰鸽子( Huigezi),原本该软件适用于公司和家庭管理,其功能十分强大,不但能监视摄像头、键盘记录、监控桌面、文件操作等。还提供了黑客专用功能,如:伪装系统图标、随意更换启动项名称和表述、随意更换端口、运行后自删除、毫无提示安装等,并采用反弹链接这种缺陷设计,使得使用者拥有最高权限,一经破解即无法控制。最终导致被黑客恶意使用。原作者的灰鸽子被定义为是一款集多种控制方式于一体的木马程序...
Python:爬取疫情每日数据
前言 目前每天各大平台,如腾讯、今日头条都会更新疫情每日数据,他们的数据源都是一样的,主要都是通过各地的卫健委官网通报。 以全国、湖北和上海为例,分别为以下三个网站: 国家卫健委官网:http://www.nhc.gov.cn/xcs/yqtb/list_gzbd.shtml 湖北卫健委官网:http://wjw.hubei.gov.cn/bmdt/ztzl/fkxxgzbdgrfyyq/xxfb...
这个世界上人真的分三六九等,你信吗?
偶然间,在知乎上看到一个问题 一时间,勾起了我深深的回忆。 以前在厂里打过两次工,做过家教,干过辅导班,做过中介。零下几度的晚上,贴过广告,满脸、满手地长冻疮。 再回首那段岁月,虽然苦,但让我学会了坚持和忍耐。让我明白了,在这个世界上,无论环境多么的恶劣,只要心存希望,星星之火,亦可燎原。 下文是原回答,希望能对你能有所启发。 如果我说,这个世界上人真的分三六九等,...
B 站上有哪些很好的学习资源?
哇说起B站,在小九眼里就是宝藏般的存在,放年假宅在家时一天刷6、7个小时不在话下,更别提今年的跨年晚会,我简直是跪着看完的!! 最早大家聚在在B站是为了追番,再后来我在上面刷欧美新歌和漂亮小姐姐的舞蹈视频,最近两年我和周围的朋友们已经把B站当作学习教室了,而且学习成本还免费,真是个励志的好平台ヽ(.◕ฺˇд ˇ◕ฺ;)ノ 下面我们就来盘点一下B站上优质的学习资源: 综合类 Oeasy: 综合...
雷火神山直播超两亿,Web播放器事件监听是怎么实现的?
Web播放器解决了在手机浏览器和PC浏览器上播放音视频数据的问题,让视音频内容可以不依赖用户安装App,就能进行播放以及在社交平台进行传播。在视频业务大数据平台中,播放数据的统计分析非常重要,所以Web播放器在使用过程中,需要对其内部的数据进行收集并上报至服务端,此时,就需要对发生在其内部的一些播放行为进行事件监听。 那么Web播放器事件监听是怎么实现的呢? 01 监听事件明细表 名...
3万字总结,Mysql优化之精髓
本文知识点较多,篇幅较长,请耐心学习 MySQL已经成为时下关系型数据库产品的中坚力量,备受互联网大厂的青睐,出门面试想进BAT,想拿高工资,不会点MySQL优化知识,拿offer的成功率会大大下降。 为什么要优化 系统的吞吐量瓶颈往往出现在数据库的访问速度上 随着应用程序的运行,数据库的中的数据会越来越多,处理时间会相应变慢 数据是存放在磁盘上的,读写速度无法和内存相比 如何优化 设计...
Python新型冠状病毒疫情数据自动爬取+统计+发送报告+数据屏幕(三)发送篇
今天介绍的项目是使用 Itchat 发送统计报告 项目功能设计: 定时爬取疫情数据存入Mysql 进行数据分析制作疫情报告 使用itchat给亲人朋友发送分析报告 基于Django做数据屏幕 使用Tableau做数据分析 来看看最终效果 目前已经完成,预计2月12日前更新 使用 itchat 发送数据统计报告 itchat 是一个基于 web微信的一个框架,但微信官方并不允许使用这...
作为程序员的我,大学四年一直自学,全靠这些实用工具和学习网站!
我本人因为高中沉迷于爱情,导致学业荒废,后来高考,毫无疑问进入了一所普普通通的大学,实在惭愧???? 我又是那么好强,现在学历不行,没办法改变的事情了,所以,进入大学开始,我就下定决心,一定要让自己掌握更多的技能,尤其选择了计算机这个行业,一定要多学习技术。 在进入大学学习不久后,我就认清了一个现实:我这个大学的整体教学质量和学习风气,真的一言难尽,懂的人自然知道怎么回事? 怎么办?我该如何更好的提升自...
粒子群算法求解物流配送路线问题(python)
1.Matlab实现粒子群算法的程序代码:https://www.cnblogs.com/kexinxin/p/9858664.html matlab代码求解函数最优值:https://blog.csdn.net/zyqblog/article/details/80829043 讲解通俗易懂,有数学实例的博文:https://blog.csdn.net/daaikuaichuan/article/...
教你如何编写第一个简单的爬虫
很多人知道爬虫,也很想利用爬虫去爬取自己想要的数据,那么爬虫到底怎么用呢?今天就教大家编写一个简单的爬虫。 下面以爬取笔者的个人博客网站为例获取第一篇文章的标题名称,教大家学会一个简单的爬虫。 第一步:获取页面 #!/usr/bin/python # coding: utf-8 import requests #引入包requests link = "http://www.santostang....
前端JS初级面试题二 (。•ˇ‸ˇ•。)老铁们!快来瞧瞧自己都会了么
1. 传统事件绑定和符合W3C标准的事件绑定有什么区别? 传统事件绑定 &lt;div onclick=""&gt;123&lt;/div&gt; div1.onclick = function(){}; &lt;button onmouseover=""&gt;&lt;/button&gt; 注意: 如果给同一个元素绑定了两次或多次相同类型的事件,那么后面的绑定会覆盖前面的绑定 (不支持DOM事...
相关热词 c# 压缩图片好麻烦 c#计算数组中的平均值 c#获取路由参数 c#日期精确到分钟 c#自定义异常必须继承 c#查表并返回值 c# 动态 表达式树 c# 监控方法耗时 c# listbox c#chart显示滚动条
立即提问