Visual Studio 2015 跨平台编译android动态链接clang错误,求大神解答!

我使用VS2015专业版进行android动态链接库编译,新建工程,去掉使用预编程序头选项,未添加或修改任何内容进行编译,发生错误,错误提示:

1>------ 已启动生成: 项目: SharedObject3, 配置: Debug ARM ------
1> ANDROID_HOME=D:\Android\sdk
1> ANT_HOME=D:\Program Files (x86)\Microsoft Visual Studio 14.0\Apps\apache-ant-1.9.3\
1> JAVA_HOME=C:\Program Files\Java\jdk1.7.0_80
1> NDK_ROOT=D:\Android\sdk\ndk-bundle
1>clang.exe : error : unable to execute command: program not executable
1>clang.exe : error : linker command failed with exit code 1 (use -v to see invocation)
========== 生成: 成功 0 个,失败 1 个,最新 0 个,跳过 0 个 ==========

查了好多资料,都没有解决问题,求大神解答!!!

1个回答

你好 我现在用VS2017编译android动态库 会出现类似的问题:
>TRACKER : ���� TRK0005: δ���ҵ�: ��clang.exe����ϵͳ�Ҳ���ָ�����ļ���

Microsoft.Cpp.Clang.targets(154,5): error MSB6006: “clang.exe”已退出,代码为 5。

我用的ndk是F:\android\android-ndk-r10e

请问您这个问题解决了吗? 我这个问题有没有什么建议?

Csdn user default icon
上传中...
上传图片
插入图片
抄袭、复制答案,以达到刷声望分或其他目的的行为,在CSDN问答是严格禁止的,一经发现立刻封号。是时候展现真正的技术了!
其他相关推荐
webrtc编译Android版本编译参数is_clang=false时,编译报错,is_clang=true时,编译成功。
[2274/3376] LINK ./rgba_to_i420_converter FAILED: rgba_to_i420_converter exe.unstripped/rgba_to_i420_converter python "../../build/toolchain/gcc_link_wrapper.py" --output="./rgba_to_i420_converter" --strip="../../buildtools/third_party/eu-strip/bin/eu-strip" --unstripped-file="./exe.unstripped/rgba_to_i420_converter" -- ../../third_party/llvm-build/Release+Asserts/bin/clang++ -Wl,--fatal-warnings -fPIC -Wl,-z,noexecstack -Wl,-z,relro -Wl,-z,now -Wl,-z,defs -Wl,--as-needed -fuse-ld=gold -Wl,--icf=all -Wl,--exclude-libs=libgcc.a -Wl,--exclude-libs=libvpx_assembly_arm.a --target=aarch64-linux-android -Wl,-mllvm,-enable-machine-outliner=never -Wl,--warn-shared-textrel -Wl,-O2 -Wl,--gc-sections -nodefaultlibs --sysroot=../../third_party/android_ndk/platforms/android-21/arch-arm64 -nostdlib -Wl,--warn-shared-textrel -pie -Bdynamic -Wl,-z,nocopyreloc -Wl,--dynamic-linker,/system/bin/linker64 -L../../third_party/android_ndk/sources/cxx-stl/llvm-libc++/libs/arm64-v8a -o "./exe.unstripped/rgba_to_i420_converter" -Wl,--start-group @"./rgba_to_i420_converter.rsp" -Wl,--end-group ../../third_party/android_ndk/platforms/android-21/arch-arm64/usr/lib/crtbegin_dynamic.o -lc -lgcc_s -lm -lrt -landroid_support ../../third_party/android_ndk/toolchains/aarch64-linux-android-4.9/prebuilt/linux-x86_64/lib/gcc/aarch64-linux-android/4.9.x/libgcc.a -ldl -llog -lGLESv2 ../../third_party/android_ndk/platforms/android-21/arch-arm64/usr/lib/crtend_android.o /usr/bin/ld.gold: fatal error: obj/rtc_tools/rgba_to_i420_converter/converter.o: unsupported ELF machine number 183 clang: error: linker command failed with exit code 1 (use -v to see invocation)
Mac 使用make编译gtest出现很多错误,如何解决?
## 系统环境 * Mac OS X Catalina 10.15.3 * 终端: zsh ## 编译过程 1. git clone googletest 2. mkdir mybuild && cd mybuild 3. cmake ../ ![成功](https://img-ask.csdn.net/upload/202002/15/1581750491_801128.png) 4. make ![失败](https://img-ask.csdn.net/upload/202002/15/1581750095_487520.png) ![失败](https://img-ask.csdn.net/upload/202002/15/1581750136_768008.png) ## 尝试 1. 按照网上搜到的方法,在.zshrc配置文件中加入 ```alias clang++="clang++ -std=c++11 -stdlib=libc++ -Weverything" ``` 之类的别名,再source .zshrc均无效。 2. 针对很多如下问题,[-Wer error: deleted function definitions are a C++11 extension [-Werror,-Wc++11-extensions] 我自己写了包含C++11的例子,如delete new,然后用clang++或者g++编译,均成功。
一段代码编译的问题!CCC CLang Visual C++
``` #include <string> #include <iostream> class Paser { public: Paser ( std::string _Command ); std::string Root ( ); /**std::string Operator ( ); std::string Path1 ( ); std::string Path2 ( ); std::string Variable ( );**/ private: std::string Command; std::string CommandReturn; void CommandSync ( ); }; int main() { Paser Paserd ( "move /a/b/c/d /ca/b/cd/" ); std::cout << Paserd.Root ( ) << '\n'; return 0; } Paser::Paser ( std::string Command ) { Paser::Command = Command; } std::string Paser::Root ( ) { Paser::CommandSync ( ); if ( Command.empty ( ) ) { throw 1; } else if ( Command.find ( " " ) == std::string::npos ) { throw 1; } else { return CommandReturn.substr ( 0 , CommandReturn.find ( " " ) ); } } void Paser::CommandSync ( ) { CommandReturn = Command; } ``` 此代码在 Windows下正常编译并可以运行,为何在 Linux下 用 GCC 和 Clang 却链接错误呢?
llvm/clang编译出错问题
我是直接下载llvm的源码编译出来的clang,然后编写了一个简单的源程序,包含一些STL的简单操作,在使用该clang编译该程序时,出现了一些"cannot compile this try statement yet"的try、throw错误提示,但在vs下编译成功的,很是迷惑,希望各位能指点一下,谢谢。。
编译llvm出现链接错误怎么办?
1,编译llvm,在编译进度100%时出现链接错误。 2,错误提示: ``` [100%] Building CXX object tools/clang/tools/libclang/CMakeFiles/libclang.dir/Indexing.cpp.o [100%] Linking CXX executable ../../../../bin/lldb-vscode [100%] Built target lldb-vscode [100%] Building CXX object tools/lldb/tools/driver/CMakeFiles/lldb.dir/Driver.cpp.o [100%] Linking CXX executable ../../../../bin/lldb [100%] Built target lldb [100%] Linking CXX shared library ../../../../lib/libclang.so ../../../../lib/libclangTidyAbseilModule.a(DurationAdditionCheck.cpp.o):在函数‘clang::tidy::abseil::DurationAdditionCheck::check(clang::ast_matchers::MatchFinder::MatchResult const&)’中: DurationAdditionCheck.cpp:(.text._ZN5clang4tidy6abseil21DurationAdditionCheck5checkERKNS_12ast_matchers11MatchFinder11MatchResultE+0x362):对‘clang::tidy::abseil::getScaleForTimeInverse(llvm::StringRef)’未定义的引用 DurationAdditionCheck.cpp:(.text._ZN5clang4tidy6abseil21DurationAdditionCheck5checkERKNS_12ast_matchers11MatchFinder11MatchResultE+0x37f):对‘clang::tidy::abseil::getTimeInverseForScale(clang::tidy::abseil::DurationScale)’未定义的引用 DurationAdditionCheck.cpp:(.text._ZN5clang4tidy6abseil21DurationAdditionCheck5checkERKNS_12ast_matchers11MatchFinder11MatchResultE+0x485):对‘clang::tidy::abseil::rewriteExprFromNumberToDuration[abi:cxx11](clang::ast_matchers::MatchFinder::MatchResult const&, clang::tidy::abseil::DurationScale, clang::Expr const*)’未定义的引用 DurationAdditionCheck.cpp:(.text._ZN5clang4tidy6abseil21DurationAdditionCheck5checkERKNS_12ast_matchers11MatchFinder11MatchResultE+0xa91):对‘clang::tidy::abseil::rewriteExprFromNumberToDuration[abi:cxx11](clang::ast_matchers::MatchFinder::MatchResult const&, clang::tidy::abseil::DurationScale, clang::Expr const*)’未定义的引用 ../../../../lib/libclangTidyAbseilModule.a(DurationComparisonCheck.cpp.o):在函数‘clang::tidy::abseil::DurationComparisonCheck::check(clang::ast_matchers::MatchFinder::MatchResult const&)’中: DurationComparisonCheck.cpp:(.text._ZN5clang4tidy6abseil23DurationComparisonCheck5checkERKNS_12ast_matchers11MatchFinder11MatchResultE+0x1ab):对‘clang::tidy::abseil::getScaleForDurationInverse(llvm::StringRef)’未定义的引用 DurationComparisonCheck.cpp:(.text._ZN5clang4tidy6abseil23DurationComparisonCheck5checkERKNS_12ast_matchers11MatchFinder11MatchResultE+0x1bf):对‘clang::tidy::abseil::isInMacro(clang::ast_matchers::MatchFinder::MatchResult const&, clang::Expr const*)’未定义的引用 DurationComparisonCheck.cpp:(.text._ZN5clang4tidy6abseil23DurationComparisonCheck5checkERKNS_12ast_matchers11MatchFinder11MatchResultE+0x1cf):对‘clang::tidy::abseil::isInMacro(clang::ast_matchers::MatchFinder::MatchResult const&, clang::Expr const*)’未定义的引用 DurationComparisonCheck.cpp:(.text._ZN5clang4tidy6abseil23DurationComparisonCheck5checkERKNS_12ast_matchers11MatchFinder11MatchResultE+0x2fd):对‘clang::tidy::abseil::rewriteExprFromNumberToDuration[abi:cxx11](clang::ast_matchers::MatchFinder::MatchResult const&, clang::tidy::abseil::DurationScale, clang::Expr const*)’未定义的引用 DurationComparisonCheck.cpp:(.text._ZN5clang4tidy6abseil23DurationComparisonCheck5checkERKNS_12ast_matchers11MatchFinder11MatchResultE+0x315):对‘clang::tidy::abseil::rewriteExprFromNumberToDuration[abi:cxx11](clang::ast_matchers::MatchFinder::MatchResult const&, clang::tidy::abseil::DurationScale, clang::Expr const*)’未定义的引用 ../../../../lib/libclangTidyAbseilModule.a(DurationFactoryFloatCheck.cpp.o):在函数‘clang::tidy::abseil::DurationFactoryFloatCheck::check(clang::ast_matchers::MatchFinder::MatchResult const&)’中: DurationFactoryFloatCheck.cpp:(.text._ZN5clang4tidy6abseil25DurationFactoryFloatCheck5checkERKNS_12ast_matchers11MatchFinder11MatchResultE+0x157):对‘clang::tidy::abseil::stripFloatCast[abi:cxx11](clang::ast_matchers::MatchFinder::MatchResult const&, clang::Expr const&)’未定义的引用 DurationFactoryFloatCheck.cpp:(.text._ZN5clang4tidy6abseil25DurationFactoryFloatCheck5checkERKNS_12ast_matchers11MatchFinder11MatchResultE+0x4a7):对‘clang::tidy::abseil::stripFloatLiteralFraction[abi:cxx11](clang::ast_matchers::MatchFinder::MatchResult const&, clang::Expr const&)’未定义的引用 ../../../../lib/libclangTidyAbseilModule.a(DurationFactoryScaleCheck.cpp.o):在函数‘clang::tidy::abseil::DurationFactoryScaleCheck::check(clang::ast_matchers::MatchFinder::MatchResult const&)’中: DurationFactoryScaleCheck.cpp:(.text._ZN5clang4tidy6abseil25DurationFactoryScaleCheck5checkERKNS_12ast_matchers11MatchFinder11MatchResultE+0x10a):对‘clang::tidy::abseil::IsLiteralZero(clang::ast_matchers::MatchFinder::MatchResult const&, clang::Expr const&)’未定义的引用 DurationFactoryScaleCheck.cpp:(.text._ZN5clang4tidy6abseil25DurationFactoryScaleCheck5checkERKNS_12ast_matchers11MatchFinder11MatchResultE+0x497):对‘clang::tidy::abseil::getDurationFactoryForScale(clang::tidy::abseil::DurationScale)’未定义的引用 DurationFactoryScaleCheck.cpp:(.text._ZN5clang4tidy6abseil25DurationFactoryScaleCheck5checkERKNS_12ast_matchers11MatchFinder11MatchResultE+0xde5):对‘clang::tidy::abseil::getDurationFactoryForScale(clang::tidy::abseil::DurationScale)’未定义的引用 ../../../../lib/libclangTidyAbseilModule.a(TimeComparisonCheck.cpp.o):在函数‘clang::tidy::abseil::TimeComparisonCheck::check(clang::ast_matchers::MatchFinder::MatchResult const&)’中: TimeComparisonCheck.cpp:(.text._ZN5clang4tidy6abseil19TimeComparisonCheck5checkERKNS_12ast_matchers11MatchFinder11MatchResultE+0x1ab):对‘clang::tidy::abseil::getScaleForTimeInverse(llvm::StringRef)’未定义的引用 TimeComparisonCheck.cpp:(.text._ZN5clang4tidy6abseil19TimeComparisonCheck5checkERKNS_12ast_matchers11MatchFinder11MatchResultE+0x1bf):对‘clang::tidy::abseil::isInMacro(clang::ast_matchers::MatchFinder::MatchResult const&, clang::Expr const*)’未定义的引用 TimeComparisonCheck.cpp:(.text._ZN5clang4tidy6abseil19TimeComparisonCheck5checkERKNS_12ast_matchers11MatchFinder11MatchResultE+0x1cf):对‘clang::tidy::abseil::isInMacro(clang::ast_matchers::MatchFinder::MatchResult const&, clang::Expr const*)’未定义的引用 TimeComparisonCheck.cpp:(.text._ZN5clang4tidy6abseil19TimeComparisonCheck5checkERKNS_12ast_matchers11MatchFinder11MatchResultE+0x2fd):对‘clang::tidy::abseil::rewriteExprFromNumberToTime[abi:cxx11](clang::ast_matchers::MatchFinder::MatchResult const&, clang::tidy::abseil::DurationScale, clang::Expr const*)’未定义的引用 TimeComparisonCheck.cpp:(.text._ZN5clang4tidy6abseil19TimeComparisonCheck5checkERKNS_12ast_matchers11MatchFinder11MatchResultE+0x315):对‘clang::tidy::abseil::rewriteExprFromNumberToTime[abi:cxx11](clang::ast_matchers::MatchFinder::MatchResult const&, clang::tidy::abseil::DurationScale, clang::Expr const*)’未定义的引用 ../../../../lib/libclangTidyAndroidModule.a(AndroidTidyModule.cpp.o):在函数‘std::_Function_handler<clang::tidy::ClangTidyCheck* (llvm::StringRef, clang::tidy::ClangTidyContext*), void clang::tidy::ClangTidyCheckFactories::registerCheck<clang::tidy::android::CloexecOpenCheck>(llvm::StringRef)::{lambda(llvm::StringRef, clang::tidy::ClangTidyContext*)#1}>::_M_invoke(std::_Any_data const&, llvm::StringRef&&, clang::tidy::ClangTidyContext*&&)’中: AndroidTidyModule.cpp:(.text._ZNSt17_Function_handlerIFPN5clang4tidy14ClangTidyCheckEN4llvm9StringRefEPNS1_16ClangTidyContextEEZNS1_23ClangTidyCheckFactories13registerCheckINS1_7android16CloexecOpenCheckEEEvS5_EUlS5_S7_E_E9_M_invokeERKSt9_Any_dataOS5_OS7_[_ZNSt17_Function_handlerIFPN5clang4tidy14ClangTidyCheckEN4llvm9StringRefEPNS1_16ClangTidyContextEEZNS1_23ClangTidyCheckFactories13registerCheckINS1_7android16CloexecOpenCheckEEEvS5_EUlS5_S7_E_E9_M_invokeERKSt9_Any_dataOS5_OS7_]+0x36):对‘vtable for clang::tidy::android::CloexecOpenCheck’未定义的引用 ../../../../lib/libclangTidyBugproneModule.a(BugproneTidyModule.cpp.o):在函数‘std::_Function_handler<clang::tidy::ClangTidyCheck* (llvm::StringRef, clang::tidy::ClangTidyContext*), void clang::tidy::ClangTidyCheckFactories::registerCheck<clang::tidy::bugprone::BoolPointerImplicitConversionCheck>(llvm::StringRef)::{lambda(llvm::StringRef, clang::tidy::ClangTidyContext*)#1}>::_M_invoke(std::_Any_data const&, llvm::StringRef&&, clang::tidy::ClangTidyContext*&&)’中: BugproneTidyModule.cpp:(.text._ZNSt17_Function_handlerIFPN5clang4tidy14ClangTidyCheckEN4llvm9StringRefEPNS1_16ClangTidyContextEEZNS1_23ClangTidyCheckFactories13registerCheckINS1_8bugprone34BoolPointerImplicitConversionCheckEEEvS5_EUlS5_S7_E_E9_M_invokeERKSt9_Any_dataOS5_OS7_[_ZNSt17_Function_handlerIFPN5clang4tidy14ClangTidyCheckEN4llvm9StringRefEPNS1_16ClangTidyContextEEZNS1_23ClangTidyCheckFactories13registerCheckINS1_8bugprone34BoolPointerImplicitConversionCheckEEEvS5_EUlS5_S7_E_E9_M_invokeERKSt9_Any_dataOS5_OS7_]+0x36):对‘vtable for clang::tidy::bugprone::BoolPointerImplicitConversionCheck’未定义的引用 ../../../../lib/libclangTidyAbseilModule.a(DurationConversionCastCheck.cpp.o):在函数‘clang::tidy::abseil::DurationConversionCastCheck::check(clang::ast_matchers::MatchFinder::MatchResult const&)’中: DurationConversionCastCheck.cpp:(.text._ZN5clang4tidy6abseil27DurationConversionCastCheck5checkERKNS_12ast_matchers11MatchFinder11MatchResultE+0xcf):对‘clang::tidy::abseil::isInMacro(clang::ast_matchers::MatchFinder::MatchResult const&, clang::Expr const*)’未定义的引用 DurationConversionCastCheck.cpp:(.text._ZN5clang4tidy6abseil27DurationConversionCastCheck5checkERKNS_12ast_matchers11MatchFinder11MatchResultE+0x279):对‘clang::tidy::abseil::getScaleForDurationInverse(llvm::StringRef)’未定义的引用 DurationConversionCastCheck.cpp:(.text._ZN5clang4tidy6abseil27DurationConversionCastCheck5checkERKNS_12ast_matchers11MatchFinder11MatchResultE+0x564):对‘clang::tidy::abseil::getDurationInverseForScale(clang::tidy::abseil::DurationScale)’未定义的引用 DurationConversionCastCheck.cpp:(.text._ZN5clang4tidy6abseil27DurationConversionCastCheck5checkERKNS_12ast_matchers11MatchFinder11MatchResultE+0x924):对‘clang::tidy::abseil::getDurationInverseForScale(clang::tidy::abseil::DurationScale)’未定义的引用 ../../../../lib/libclangTidyAbseilModule.a(DurationSubtractionCheck.cpp.o):在函数‘clang::tidy::abseil::DurationSubtractionCheck::check(clang::ast_matchers::MatchFinder::MatchResult const&)’中: DurationSubtractionCheck.cpp:(.text._ZN5clang4tidy6abseil24DurationSubtractionCheck5checkERKNS_12ast_matchers11MatchFinder11MatchResultE+0x191):对‘clang::tidy::abseil::getScaleForDurationInverse(llvm::StringRef)’未定义的引用 DurationSubtractionCheck.cpp:(.text._ZN5clang4tidy6abseil24DurationSubtractionCheck5checkERKNS_12ast_matchers11MatchFinder11MatchResultE+0x1c2):对‘clang::tidy::abseil::rewriteExprFromNumberToDuration[abi:cxx11](clang::ast_matchers::MatchFinder::MatchResult const&, clang::tidy::abseil::DurationScale, clang::Expr const*)’未定义的引用 ../../../../lib/libclangTidyAbseilModule.a(DurationUnnecessaryConversionCheck.cpp.o):在函数‘clang::tidy::abseil::DurationUnnecessaryConversionCheck::check(clang::ast_matchers::MatchFinder::MatchResult const&)’中: DurationUnnecessaryConversionCheck.cpp:(.text._ZN5clang4tidy6abseil34DurationUnnecessaryConversionCheck5checkERKNS_12ast_matchers11MatchFinder11MatchResultE+0x1af):对‘clang::tidy::abseil::isInMacro(clang::ast_matchers::MatchFinder::MatchResult const&, clang::Expr const*)’未定义的引用 ../../../../lib/libclangTidyAbseilModule.a(TimeSubtractionCheck.cpp.o):在函数‘clang::tidy::abseil::TimeSubtractionCheck::registerMatchers(clang::ast_matchers::MatchFinder*)’中: TimeSubtractionCheck.cpp:(.text._ZN5clang4tidy6abseil20TimeSubtractionCheck16registerMatchersEPNS_12ast_matchers11MatchFinderE+0x208):对‘clang::tidy::abseil::getScaleForTimeInverse(llvm::StringRef)’未定义的引用 TimeSubtractionCheck.cpp:(.text._ZN5clang4tidy6abseil20TimeSubtractionCheck16registerMatchersEPNS_12ast_matchers11MatchFinderE+0x89c):对‘clang::tidy::abseil::getDurationFactoryForScale(clang::tidy::abseil::DurationScale)’未定义的引用 ../../../../lib/libclangTidyAbseilModule.a(TimeSubtractionCheck.cpp.o):在函数‘clang::tidy::abseil::TimeSubtractionCheck::check(clang::ast_matchers::MatchFinder::MatchResult const&)’中: TimeSubtractionCheck.cpp:(.text._ZN5clang4tidy6abseil20TimeSubtractionCheck5checkERKNS_12ast_matchers11MatchFinder11MatchResultE+0x1a4):对‘clang::tidy::abseil::getScaleForTimeInverse(llvm::StringRef)’未定义的引用 TimeSubtractionCheck.cpp:(.text._ZN5clang4tidy6abseil20TimeSubtractionCheck5checkERKNS_12ast_matchers11MatchFinder11MatchResultE+0x26a):对‘clang::tidy::abseil::getDurationFactoryForScale(clang::tidy::abseil::DurationScale)’未定义的引用 TimeSubtractionCheck.cpp:(.text._ZN5clang4tidy6abseil20TimeSubtractionCheck5checkERKNS_12ast_matchers11MatchFinder11MatchResultE+0x732):对‘clang::tidy::abseil::rewriteExprFromNumberToTime[abi:cxx11](clang::ast_matchers::MatchFinder::MatchResult const&, clang::tidy::abseil::DurationScale, clang::Expr const*)’未定义的引用 TimeSubtractionCheck.cpp:(.text._ZN5clang4tidy6abseil20TimeSubtractionCheck5checkERKNS_12ast_matchers11MatchFinder11MatchResultE+0x782):对‘clang::tidy::abseil::rewriteExprFromNumberToTime[abi:cxx11](clang::ast_matchers::MatchFinder::MatchResult const&, clang::tidy::abseil::DurationScale, clang::Expr const*)’未定义的引用 TimeSubtractionCheck.cpp:(.text._ZN5clang4tidy6abseil20TimeSubtractionCheck5checkERKNS_12ast_matchers11MatchFinder11MatchResultE+0xd0a):对‘clang::tidy::abseil::rewriteExprFromNumberToTime[abi:cxx11](clang::ast_matchers::MatchFinder::MatchResult const&, clang::tidy::abseil::DurationScale, clang::Expr const*)’未定义的引用 TimeSubtractionCheck.cpp:(.text._ZN5clang4tidy6abseil20TimeSubtractionCheck5checkERKNS_12ast_matchers11MatchFinder11MatchResultE+0xd51):对‘clang::tidy::abseil::rewriteExprFromNumberToTime[abi:cxx11](clang::ast_matchers::MatchFinder::MatchResult const&, clang::tidy::abseil::DurationScale, clang::Expr const*)’未定义的引用 TimeSubtractionCheck.cpp:(.text._ZN5clang4tidy6abseil20TimeSubtractionCheck5checkERKNS_12ast_matchers11MatchFinder11MatchResultE+0xd89):对‘clang::tidy::abseil::getDurationInverseForScale(clang::tidy::abseil::DurationScale)’未定义的引用 TimeSubtractionCheck.cpp:(.text._ZN5clang4tidy6abseil20TimeSubtractionCheck5checkERKNS_12ast_matchers11MatchFinder11MatchResultE+0x1061):对‘clang::tidy::abseil::rewriteExprFromNumberToTime[abi:cxx11](clang::ast_matchers::MatchFinder::MatchResult const&, clang::tidy::abseil::DurationScale, clang::Expr const*)’未定义的引用 TimeSubtractionCheck.cpp:(.text._ZN5clang4tidy6abseil20TimeSubtractionCheck5checkERKNS_12ast_matchers11MatchFinder11MatchResultE+0x10aa):对‘clang::tidy::abseil::rewriteExprFromNumberToTime[abi:cxx11](clang::ast_matchers::MatchFinder::MatchResult const&, clang::tidy::abseil::DurationScale, clang::Expr const*)’未定义的引用 collect2: 错误:ld 返回 1 make[2]: *** [lib/libclang.so.10] 错误 1 make[1]: *** [tools/clang/tools/libclang/CMakeFiles/libclang.dir/all] 错误 2 make: *** [all] 错误 2 ``` 求救
在mac中怎样用clang编译一个c文件(支持arm64架构),生成静态库文件.a
在fun.c中定义一个void func()函数打印“hello”,在fun.h中申明void func()函数, 在mac中怎样用clang 命令行编译一个c文件(支持arm64架构和armv7架构),生成静态库文件.a
Ubuntu16.04如何安装clang预编译包
已在官网上下载好clang的预编译包,希望其可以和系统的gcc共存,求指导![图片说明](https://img-ask.csdn.net/upload/201802/14/1518598827_520265.png)
commit message带引号,clang 编译出错
使用git commit becf7bfd4d8b3d8858d0b94f779d1b690248c11a Author: tug <tug@skyth-tek.com> Date: Sat May 21 13:28:10 2016 +0800 "a test" 提交如上,提交名为 "a test " 编译时候就会报错: target thumb C++: libsurfaceflinger <= frameworks/native/services/surfaceflinger/Client.cpp clang++: error: no such file or directory: 'test"' 提交名没有" ",就能编译通过。 clang编译怎么会和我的commit message有关联?
clang编译boost提示unknown type name __int64,请问怎么解决?
问题步骤: 1. 代码中#include <boost/cstdint.hpp> 2. clang编译 提示错误: boost\include\boost-1_51\boost\interprocess\detail\win32_api.hpp unknown type name __int64 求助: 在不去掉#include <boost/cstdint.hpp>的前提下该如何解决这个unknown type name __int64?
android 7.1源码编译 出错
以下是shell上的打印 ``` Starting build with ninja [476/5393] ninja: Entering directory `.' [ 1% 8/468] target Executable: dexdump (out/target/product/px3/obj/EXECUTABLES/dexdump_intermediates/LINKED/dexdump) FAILED: /bin/bash -c "prebuilts/clang/host/linux-x86/clang-2690385/bin/clang++ -pie -nostdlib -Bdynamic -Wl,-dynamic-linker,/system/bin/linker -Wl,--gc-sections -Wl,-z,nocopyreloc -Lout/target/product/ px3/obj/lib -Wl,-rpath-link=out/target/product/px3/obj/lib out/target/product/px3/obj/lib/crtbegin_dynamic.o out/target/product/px3/obj/EXECUTABLES/dexdump_intermediates/DexDump.o -Wl ,--whole-archive -Wl,--no-whole-archive out/target/product/px3/obj/STATIC_LIBRARIES/libdex_intermediates/libdex.a out/target/product/px3/obj/STATIC_LIBRARIES/libbase_intermediates/libbase.a out/targ et/product/px3/obj/STATIC_LIBRARIES/libunwind_llvm_intermediates/libunwind_llvm.a out/target/product/px3/obj/STATIC_LIBRARIES/libcompiler_rt-extras_intermediates/libcompiler_rt-extras.a prebuilts/gcc/ linux-x86/arm/arm-linux-androideabi-4.9/bin/../lib/gcc/arm-linux-androideabi/4.9/../../../../arm-linux-androideabi/lib/armv7-a/libatomic.a prebuilts/gcc/linux-x86/arm/arm-linux-androideabi-4.9/bin/../li b/gcc/arm-linux-androideabi/4.9/armv7-a/libgcc.a -lz -llog -lutils -lc++ -ldl -lc -lm -o out/target/product/px3/obj/EXECUTABLES/dexdump_intermediates/LINKED/dexdump -Wl,-z,noexecstack -Wl,-z,relro -W l,-z,now -Wl,--build-id=md5 -Wl,--warn-shared-textrel -Wl,--fatal-warnings -Wl,--icf=safe -Wl,--hash-style=gnu -Wl,--no-undefined-version -Wl,--fix-cortex-a8 -target arm-linux-androideabi -Bprebuilts /gcc/linux-x86/arm/arm-linux-androideabi-4.9/arm-linux-androideabi/bin -Wl,--exclude-libs,libunwind_llvm.a -Wl,--no-undefined out/target/product/px3/obj/lib/crtend_android.o" dalvik/dexdump/DexDump.cpp:517: error: undefined reference to 'dexReadAndVerifyClassData(unsigned char const**, unsigned char const*)' dalvik/dexdump/DexDump.cpp:627: error: undefined reference to 'dexDecodeDebugInfo(DexFile const*, DexCode const*, char const*, unsigned int, unsigned int, int (*)(void*, unsigned int, unsigned int), voi d (*)(void*, unsigned short, unsigned int, unsigned int, char const*, char const*, char const*), void*)' dalvik/dexdump/DexDump.cpp:653: error: undefined reference to 'dexDecodeDebugInfo(DexFile const*, DexCode const*, char const*, unsigned int, unsigned int, int (*)(void*, unsigned int, unsigned int), voi d (*)(void*, unsigned short, unsigned int, unsigned int, char const*, char const*, char const*), void*)' dalvik/libdex/DexProto.h:143: error: undefined reference to 'dexProtoCopyMethodDescriptor(DexProto const*)' dalvik/dexdump/DexDump.cpp:890: error: undefined reference to 'dexGetOpcodeName(Opcode)' dalvik/dexdump/DexDump.cpp:1055: error: undefined reference to 'gDexOpcodeInfo' dalvik/dexdump/DexDump.cpp:845: error: undefined reference to 'gDexOpcodeInfo' dalvik/dexdump/DexDump.cpp:1120: error: undefined reference to 'dexDecodeInstruction(unsigned short const*, DecodedInstruction*)' dalvik/dexdump/DexDump.cpp:1128: error: undefined reference to 'gDexOpcodeInfo' dalvik/libdex/DexProto.h:143: error: undefined reference to 'dexProtoCopyMethodDescriptor(DexProto const*)' dalvik/dexdump/DexDump.cpp:1388: error: undefined reference to 'dexReadAndVerifyClassData(unsigned char const**, unsigned char const*)' dalvik/dexdump/DexDump.cpp:1704: error: undefined reference to 'dexReadAndVerifyClassData(unsigned char const**, unsigned char const*)' dalvik/dexdump/DexDump.cpp:1795: error: undefined reference to 'dexOpenAndMap(char const*, char const*, MemMapping*, bool)' dalvik/dexdump/DexDump.cpp:1804: error: undefined reference to 'dexFileParse(unsigned char const*, unsigned int, int)' dalvik/dexdump/DexDump.cpp:1820: error: undefined reference to 'sysReleaseShmem(MemMapping*)' dalvik/dexdump/DexDump.cpp:1822: error: undefined reference to 'dexFileFree(DexFile*)' dalvik/dexdump/DexDump.cpp:1820: error: undefined reference to 'sysReleaseShmem(MemMapping*)' clang++: error: linker command failed with exit code 1 (use -v to see invocation) [ 1% 8/468] Ensure Jack server is installed and started Jack server already installed in "/home2/hxw/.jack-server" Server is already running ``` 我已经试过改了jack的服务端口了 .jack .jack-setting .jack-server/config.properties 里面的地址都改了还是不行 据说不是jack的问题, jack错误只是编译错误引起的。 在网上搜 DexDump都只能搜到一些教怎么单独编译之类的教程 没找到有类似错误的
qt5.12.4安卓编译问题,生成不了apk, 求助这是哪里的问题?报错如下
20:35:47: 为项目app2执行步骤 ... 20:35:47: 配置没有改变, 跳过 qmake 步骤。 20:35:47: 正在启动 "E:\Android\android-ndk-r18b\prebuilt\windows-x86_64\bin\make.exe" -j12 make: Nothing to be done for `first'. 20:35:48: 进程"E:\Android\android-ndk-r18b\prebuilt\windows-x86_64\bin\make.exe"正常退出。 20:35:48: Removing directory D:\src\qt_src\build-app2-Android_for_armeabi_v7a_Clang_Qt_5_12_4_for_Android_ARMv7-Debug\android-build/assets 20:35:48: Removing directory D:\src\qt_src\build-app2-Android_for_armeabi_v7a_Clang_Qt_5_12_4_for_Android_ARMv7-Debug\android-build/libs 20:35:48: 正在启动 "E:\Android\android-ndk-r18b\prebuilt\windows-x86_64\bin\make.exe" "INSTALL_ROOT=D:\src\qt_src\build-app2-Android_for_armeabi_v7a_Clang_Qt_5_12_4_for_Android_ARMv7-Debug\android-build" install E:\App\Qt\5.12.4\android_armv7\bin\qmake.exe -install qinstall -exe libapp2.so D:\src\qt_src\build-app2-Android_for_armeabi_v7a_Clang_Qt_5_12_4_for_Android_ARMv7-Debug\android-build\libs\armeabi-v7a\libapp2.so 20:35:49: 进程"E:\Android\android-ndk-r18b\prebuilt\windows-x86_64\bin\make.exe"正常退出。 20:35:49: Starting: "E:\App\Qt\5.12.4\android_armv7\bin\androiddeployqt.exe" --input D:/src/qt_src/build-app2-Android_for_armeabi_v7a_Clang_Qt_5_12_4_for_Android_ARMv7-Debug/android-libapp2.so-deployment-settings.json --output D:/src/qt_src/build-app2-Android_for_armeabi_v7a_Clang_Qt_5_12_4_for_Android_ARMv7-Debug/android-build --android-platform android-23 --jdk "C:/Program Files/Java/jdk1.8.0_202" --gradle Generating Android Package Input file: D:/src/qt_src/build-app2-Android_for_armeabi_v7a_Clang_Qt_5_12_4_for_Android_ARMv7-Debug/android-libapp2.so-deployment-settings.json Output directory: D:/src/qt_src/build-app2-Android_for_armeabi_v7a_Clang_Qt_5_12_4_for_Android_ARMv7-Debug/android-build/ Application binary: D:/src/qt_src/build-app2-Android_for_armeabi_v7a_Clang_Qt_5_12_4_for_Android_ARMv7-Debug/libapp2.so Android build platform: android-23 Install to device: No -- Skipping E:/App/Qt/5.12.4/android_armv7/plugins/iconengines/libqsvgicon.so. It has unmet dependencies: lib/libQt5Svg.so. -- Skipping E:/App/Qt/5.12.4/android_armv7/plugins/imageformats/libqsvg.so. It has unmet dependencies: lib/libQt5Svg.so. :checkDebugClasspath UP-TO-DATE :preBuild UP-TO-DATE :preDebugBuild UP-TO-DATE :compileDebugAidl FAILED FAILURE: Build failed with an exception. * What went wrong: Execution failed for task ':compileDebugAidl'. > java.io.IOException: com.android.ide.common.process.ProcessException: Error while executing process E:\Android\android-sdk-windows\build-tools\29.0.0\aidl.exe with arguments {-pE:\Android\android-sdk-windows\platforms\android-23\framework.aidl -oD:\src\qt_src\build-app2-Android_for_armeabi_v7a_Clang_Qt_5_12_4_for_Android_ARMv7-Debug\android-build\build\generated\source\aidl\debug -IE:\App\Qt\5.12.4\android_armv7\src\android\java\src -ID:\src\qt_src\build-app2-Android_for_armeabi_v7a_Clang_Qt_5_12_4_for_Android_ARMv7-Debug\android-build\src -ID:\src\qt_src\build-app2-Android_for_armeabi_v7a_Clang_Qt_5_12_4_for_Android_ARMv7-Debug\android-build\src\debug\aidl -ID:\src\qt_src\build-app2-Android_for_armeabi_v7a_Clang_Qt_5_12_4_for_Android_ARMv7-Debug\android-build\aidl -dC:\Users\ADMINI~1\AppData\Local\Temp\aidl7196521705366926776.d E:\App\Qt\5.12.4\android_armv7\src\android\java\src\org\kde\necessitas\ministro\IMinistro.aidl} * Try: Run with --stacktrace option to get the stack trace. Run with --info or --debug option to get more log output. Run with --scan to get full insights. * Get more help at https://help.gradle.org BUILD FAILED in 6s 3 actionable tasks: 1 executed, 2 up-to-date Building the android package failed! -- For more information, run this command with --verbose. 20:35:57: 进程"E:\App\Qt\5.12.4\android_armv7\bin\androiddeployqt.exe"退出,退出代码 14 。 Error while building/deploying project app2 (kit: Android for armeabi-v7a (Clang Qt 5.12.4 for Android ARMv7)) When executing step "Build Android APK" 20:35:57: Elapsed time: 00:10.
centos6 编译osquery出错
#### 问题描述 >目的:需要在centos6.10 上安装osquery >>环境:centos6.10 >>内核: 2.6.32-431.el6.x86_64 >步骤: >>参考官网ubuntu18.04 编译步骤 >>https://osquery.readthedocs.io/en/stable/development/building/ ``` # Build osquery 1.mkdir build; cd build 2.cmake -DOSQUERY_TOOLCHAIN_SYSROOT=/usr/local/osquery-toolchain .. 3.cmake --build . -j10 # where 10 is the number of parallel build jobs ``` >>在第2步发生如下错误: ``` CMake Error at /usr/local/share/cmake-3.14/Modules/CMakeTestCCompiler.cmake:60 (message): The C compiler "/usr/local/osquery-toolchain/usr/bin/clang" is not able to compile a simple test program. It fails with the following output: Change Dir: /mnt/hgfs/share/osquery/source/osquery/build/CMakeFiles/CMakeTmp Run Build Command(s):/usr/bin/gmake cmTC_cc220/fast /usr/bin/gmake -f CMakeFiles/cmTC_cc220.dir/build.make CMakeFiles/cmTC_cc220.dir/build gmake[1]: Entering directory `/mnt/hgfs/share/osquery/source/osquery/build/CMakeFiles/CMakeTmp' Building C object CMakeFiles/cmTC_cc220.dir/testCCompiler.c.o /usr/local/osquery-toolchain/usr/bin/clang --sysroot=/usr/local/osquery-toolchain -o CMakeFiles/cmTC_cc220.dir/testCCompiler.c.o -c /mnt/hgfs/share/osquery/source/osquery/build/CMakeFiles/CMakeTmp/testCCompiler.c Linking C executable cmTC_cc220 /usr/local/bin/cmake -E cmake_link_script CMakeFiles/cmTC_cc220.dir/link.txt --verbose=1 /usr/local/osquery-toolchain/usr/bin/clang --sysroot=/usr/local/osquery-toolchain CMakeFiles/cmTC_cc220.dir/testCCompiler.c.o -o cmTC_cc220 ld.lld: error: cannot open output file cmTC_cc220: Input/output error clang-8: error: linker command failed with exit code 1 (use -v to see invocation) gmake[1]: *** [cmTC_cc220] Error 1 gmake[1]: Leaving directory `/mnt/hgfs/share/osquery/source/osquery/build/CMakeFiles/CMakeTmp' gmake: *** [cmTC_cc220/fast] Error 2 ``` 对cmake 不是很熟悉,不知以上问题发错误该定位于哪里?
android源码编译 出现的错误
编译6.0的时候出现下面这个错误,查了好久毫无头绪 有谁遇到过吗 preparing StaticLib: libc [including out/target/product/generic/obj/STATIC_LIBRARIES/libc_common_intermediates/libc_common.a] preparing StaticLib: libc [including out/target/product/generic/obj/STATIC_LIBRARIES/libjemalloc_intermediates/libjemalloc.a] target StaticLib: libc (out/target/product/generic/obj/STATIC_LIBRARIES/libc_intermediates/libc.a) clang: error: linker command failed with exit code 1 (use -v to see invocation) build/core/host_shared_library_internal.mk:51: recipe for target 'out/host/linux-x86/obj/lib/libart.so' failed make: *** [out/host/linux-x86/obj/lib/libart.so] Error 1 make: *** 正在等待未完成的任务.... 注: external/jsilver/src/org/clearsilver/FactoryLoader.java使用了未经检查或不安全的操作。 注: 有关详细信息, 请使用 -Xlint:unchecked 重新编译。 #### make failed to build some targets (09:44:35 (hh:mm:ss)) ####
为什么visual studio不能识别.h的文件呢
![图片说明](https://img-ask.csdn.net/upload/201904/07/1554640373_532304.png) ![图片说明](https://img-ask.csdn.net/upload/201904/07/1554640389_587845.png) 如图,它提示我安装这个clang的扩展包我也安装了呀
android studio 3.0 preview 创建添加C支持的项目时报错
错误如下: Build command failed. Error while executing process D:\Android\AndroidSDK\cmake\3.6.4111459\bin\cmake.exe with arguments {-HD:\Android\MyProject\TestC\app -BD:\Android\MyProject\TestC\app\.externalNativeBuild\cmake\release\armeabi -GAndroid Gradle - Ninja -DANDROID_ABI=armeabi -DANDROID_NDK=D:\Android\AndroidSDK\ndk-bundle -DCMAKE_LIBRARY_OUTPUT_DIRECTORY=D:\Android\MyProject\TestC\app\build\intermediates\cmake\release\obj\armeabi -DCMAKE_BUILD_TYPE=Release -DCMAKE_MAKE_PROGRAM=D:\Android\AndroidSDK\cmake\3.6.4111459\bin\ninja.exe -DCMAKE_TOOLCHAIN_FILE=D:\Android\AndroidSDK\ndk-bundle\build\cmake\android.toolchain.cmake -DANDROID_PLATFORM=android-15 -DCMAKE_CXX_FLAGS=-std=c++11 -frtti -fexceptions} -- Check for working C compiler: D:/Android/AndroidSDK/ndk-bundle/toolchains/llvm/prebuilt/windows-x86_64/bin/clang.exe -- Check for working C compiler: D:/Android/AndroidSDK/ndk-bundle/toolchains/llvm/prebuilt/windows-x86_64/bin/clang.exe -- broken CMake Error at D:/Android/AndroidSDK/cmake/3.6.4111459/share/cmake-3.6/Modules/CMakeTestCCompiler.cmake:61 (message): The C compiler "D:/Android/AndroidSDK/ndk-bundle/toolchains/llvm/prebuilt/windows-x86_64/bin/clang.exe" is not able to compile a simple test program. It fails with the following output: Change Dir: D:/Android/MyProject/TestC/app/.externalNativeBuild/cmake/release/armeabi/CMakeFiles/CMakeTmp Run Build Command:"D:\Android\AndroidSDK\cmake\3.6.4111459\bin\ninja.exe" "cmTC_80963" [1/2] Building C object CMakeFiles/cmTC_80963.dir/testCCompiler.c.o [2/2] Linking C executable cmTC_80963 ninja: fatal: CreateProcess: ����IJ�����Ҫ������ CMake will not be able to correctly generate this project. Call Stack (most recent call first): CMakeLists.txt -- Configuring incomplete, errors occurred! See also "D:/Android/MyProject/TestC/app/.externalNativeBuild/cmake/release/armeabi/CMakeFiles/CMakeOutput.log". See also "D:/Android/MyProject/TestC/app/.externalNativeBuild/cmake/release/armeabi/CMakeFiles/CMakeError.log".那些乱码是“请求的操作需要提升”有谁知道这是这么回事么?
RK3328平台android8.1编译报错
-fPIC -no-canonical-prefixes -U_FORTIFY_SOURCE -D_FORTIFY_SOURCE=2 -fstack-protector -D__STDC_FORMAT_MACROS -D__STDC_CONSTANT_MACROS -O2 -g -fno-strict-aliasing --gcc-toolchain=prebuilts/gcc/linux-x86/host/x86_64-linux-glibc2.15-4.8 --sysroot prebuilts/gcc/linux-x86/host/x86_64-linux-glibc2.15-4.8/sysroot -fstack-protector-strong -m64 -DANDROID -fmessage-length=0 -W -Wall -Wno-unused -Winit-self -Wpointer-arith -DNDEBUG -UDEBUG -fdebug-prefix-map=/proc/self/cwd= -D__compiler_offsetof=__builtin_offsetof -Werror=int-conversion -Wno-reserved-id-macro -Wno-format-pedantic -Wno-unused-command-line-argument -fcolor-diagnostics -Wno-expansion-to-defined -fdebug-prefix-map=\$PWD/= -target x86_64-linux-gnu -Bprebuilts/gcc/linux-x86/host/x86_64-linux-glibc2.15-4.8/x86_64-linux/bin -Wsign-promo -Wno-inconsistent-missing-override -Wno-null-dereference -D_LIBCPP_ENABLE_THREAD_SAFETY_ANNOTATIONS -Wno-thread-safety-negative -isystem prebuilts/gcc/linux-x86/host/x86_64-linux-glibc2.15-4.8/x86_64-linux/include/c++/4.8 -isystem prebuilts/gcc/linux-x86/host/x86_64-linux-glibc2.15-4.8/x86_64-linux/include/c++/4.8/backward -isystem prebuilts/gcc/linux-x86/host/x86_64-linux-glibc2.15-4.8/x86_64-linux/include/c++/4.8/x86_64-linux -std=gnu++14 -Wall -Werror -fPIE -D_USING_LIBCXX -DANDROID_STRICT -nostdinc++ -Werror=int-to-pointer-cast -Werror=pointer-to-int-cast -Werror=address-of-temporary -Werror=return-type -MD -MF out/host/linux-x86/obj/EXECUTABLES/validatekeymaps_intermediates/Main.d -o out/host/linux-x86/obj/EXECUTABLES/validatekeymaps_intermediates/Main.o frameworks/base/tools/validatekeymaps/Main.cpp" Traceback (most recent call last): File "prebuilts/clang/host/linux-x86/clang-4053586/bin/clang++", line 4, in <module> import shlex ImportError: No module named shlex [ 0% 29/76723] host C++: conscrypt_ge...nts/src/gen/cpp/generate_constants.cpp FAILED: out/host/linux-x86/obj/EXECUTABLES/conscrypt_generate_constants_intermediates/constants/src/gen/cpp/generate_constants.o /bin/bash -c "PWD=/proc/self/cwd prebuilts/clang/host/linux-x86/clang-4053586/bin/clang++ -I external/conscrypt -I out/host/linux-x86/obj/EXECUTABLES/conscrypt_generate_constants_intermediates -I out/host/linux-x86/gen/EXECUTABLES/conscrypt_generate_constants_intermediates -I libnativehelper/include_deprecated \$(cat out/host/linux-x86/obj/EXECUTABLES/conscrypt_generate_constants_intermediates/import_includes) -I system/core/include -I system/media/audio/include -I hardware/libhardware/include -I hardware/libhardware_legacy/include -I hardware/ril/include -I libnativehelper/include -I frameworks/native/include -I frameworks/native/opengl/include -I frameworks/av/include -c -fno-exceptions -Wno-multichar -Wa,--noexecstack -fPIC -no-canonical-prefixes -U_FORTIFY_SOURCE -D_FORTIFY_SOURCE=2 -fstack-protector -D__STDC_FORMAT_MACROS -D__STDC_CONSTANT_MACROS -O2 -g -fno-strict-aliasing --gcc-toolchain=prebuilts/gcc/linux-x86/host/x86_64-linux-glibc2.15-4.8 --sysroot prebuilts/gcc/linux-x86/host/x86_64-linux-glibc2.15-4.8/sysroot -fstack-protector-strong -m64 -DANDROID -fmessage-length=0 -W -Wall -Wno-unused -Winit-self -Wpointer-arith -DNDEBUG -UDEBUG -fdebug-prefix-map=/proc/self/cwd= -D__compiler_offsetof=__builtin_offsetof -Werror=int-conversion -Wno-reserved-id-macro -Wno-format-pedantic -Wno-unused-command-line-argument -fcolor-diagnostics -Wno-expansion-to-defined -fdebug-prefix-map=\$PWD/= -target x86_64-linux-gnu -Bprebuilts/gcc/linux-x86/host/x86_64-linux-glibc2.15-4.8/x86_64-linux/bin -Wsign-promo -Wno-inconsistent-missing-override -Wno-null-dereference -D_LIBCPP_ENABLE_THREAD_SAFETY_ANNOTATIONS -Wno-thread-safety-negative -isystem prebuilts/gcc/linux-x86/host/x86_64-linux-glibc2.15-4.8/x86_64-linux/include/c++/4.8 -isystem prebuilts/gcc/linux-x86/host/x86_64-linux-glibc2.15-4.8/x86_64-linux/include/c++/4.8/backward -isystem prebuilts/gcc/linux-x86/host/x86_64-linux-glibc2.15-4.8/x86_64-linux/include/c++/4.8/x86_64-linux -std=gnu++14 -fPIE -D_USING_LIBCXX -nostdinc++ -Werror=int-to-pointer-cast -Werror=pointer-to-int-cast -Werror=address-of-temporary -Werror=return-type -MD -MF out/host/linux-x86/obj/EXECUTABLES/conscrypt_generate_constants_intermediates/constants/src/gen/cpp/generate_constants.d -o out/host/linux-x86/obj/EXECUTABLES/conscrypt_generate_constants_intermediates/constants/src/gen/cpp/generate_constants.o external/conscrypt/constants/src/gen/cpp/generate_constants.cpp" Traceback (most recent call last): File "prebuilts/clang/host/linux-x86/clang-4053586/bin/clang++", line 4, in <module> import shlex ImportError: No module named shlex [ 0% 30/76723] host C++: protoc-gen-j...tools/streaming_proto/string_utils.cpp FAILED: out/host/linux-x86/obj/EXECUTABLES/protoc-gen-javastream_intermediates/string_utils.o /bin/bash -c "PWD=/proc/self/cwd prebuilts/clang/host/linux-x86/clang-4053586/bin/clang++ -I frameworks/base/tools/streaming_proto -I out/host/linux-x86/obj/EXECUTABLES/protoc-gen-javastream_intermediates -I out/host/linux-x86/gen/EXECUTABLES/protoc-gen-javastream_intermediates -I libnativehelper/include_deprecated \$(cat out/host/linux-x86/obj/EXECUTABLES/protoc-gen-javastream_intermediates/import_includes) -I system/core/include -I system/media/audio/include -I hardware/libhardware/include -I hardware/libhardware_legacy/include -I hardware/ril/include -I libnativehelper/include -I frameworks/native/include -I frameworks/native/opengl/include -I frameworks/av/include -c -fno-exceptions -Wno-multichar -Wa,--noexecstack -fPIC -no-canonical-prefixes -U_FORTIFY_SOURCE -D_FORTIFY_SOURCE=2 -fstack-protector -D__STDC_FORMAT_MACROS -D__STDC_CONSTANT_MACROS -O2 -g -fno-strict-aliasing --gcc-toolchain=prebuilts/gcc/linux-x86/host/x86_64-linux-glibc2.15-4.8 --sysroot prebuilts/gcc/linux-x86/host/x86_64-linux-glibc2.15-4.8/sysroot -fstack-protector-strong -m64 -DANDROID -fmessage-length=0 -W -Wall -Wno-unused -Winit-self -Wpointer-arith -DNDEBUG -UDEBUG -fdebug-prefix-map=/proc/self/cwd= -D__compiler_offsetof=__builtin_offsetof -Werror=int-conversion -Wno-reserved-id-macro -Wno-format-pedantic -Wno-unused-command-line-argument -fcolor-diagnostics -Wno-expansion-to-defined -fdebug-prefix-map=\$PWD/= -target x86_64-linux-gnu -Bprebuilts/gcc/linux-x86/host/x86_64-linux-glibc2.15-4.8/x86_64-linux/bin -Wsign-promo -Wno-inconsistent-missing-override -Wno-null-dereference -D_LIBCPP_ENABLE_THREAD_SAFETY_ANNOTATIONS -Wno-thread-safety-negative -isystem prebuilts/gcc/linux-x86/host/x86_64-linux-glibc2.15-4.8/x86_64-linux/include/c++/4.8 -isystem prebuilts/gcc/linux-x86/host/x86_64-linux-glibc2.15-4.8/x86_64-linux/include/c++/4.8/backward -isystem prebuilts/gcc/linux-x86/host/x86_64-linux-glibc2.15-4.8/x86_64-linux/include/c++/4.8/x86_64-linux -std=gnu++14 -fPIE -D_USING_LIBCXX -DANDROID_STRICT -nostdinc++ -Werror=int-to-pointer-cast -Werror=pointer-to-int-cast -Werror=address-of-temporary -Werror=return-type -MD -MF out/host/linux-x86/obj/EXECUTABLES/protoc-gen-javastream_intermediates/string_utils.d -o out/host/linux-x86/obj/EXECUTABLES/protoc-gen-javastream_intermediates/string_utils.o frameworks/base/tools/streaming_proto/string_utils.cpp" Traceback (most recent call last): File "prebuilts/clang/host/linux-x86/clang-4053586/bin/clang++", line 4, in <module> import shlex ImportError: No module named shlex [ 0% 49/76723] build out/target/common/obj/all-event-log-tags.txt ninja: build stopped: subcommand failed. 17:38:37 ninja failed with: exit status 1 make: *** [run_soong_ui] Error 1 jda@jda-ubut12-ser:rk3328_8.1_box_190306$
Unknown CMake command "add_clang_library".
CMake Error at clang-apply-replacements/CMakeLists.txt:5 (add_clang_library): Unknown CMake command "add_clang_library". 这个该怎解决?
clang怎么在「编译源代码并且生成可执行程序」的过程中生成AST
clang怎么在「编译源代码并且生成可执行程序」的过程中生成AST(抽象语法树) 是类似于![图片说明](https://img-ask.csdn.net/upload/201608/16/1471313363_237904.png)
终于明白阿里百度这样的大公司,为什么面试经常拿ThreadLocal考验求职者了
点击上面↑「爱开发」关注我们每晚10点,捕获技术思考和创业资源洞察什么是ThreadLocalThreadLocal是一个本地线程副本变量工具类,各个线程都拥有一份线程私有的数
程序员必须掌握的核心算法有哪些?
由于我之前一直强调数据结构以及算法学习的重要性,所以就有一些读者经常问我,数据结构与算法应该要学习到哪个程度呢?,说实话,这个问题我不知道要怎么回答你,主要取决于你想学习到哪些程度,不过针对这个问题,我稍微总结一下我学过的算法知识点,以及我觉得值得学习的算法。这些算法与数据结构的学习大多数是零散的,并没有一本把他们全部覆盖的书籍。下面是我觉得值得学习的一些算法以及数据结构,当然,我也会整理一些看过...
《奇巧淫技》系列-python!!每天早上八点自动发送天气预报邮件到QQ邮箱
此博客仅为我业余记录文章所用,发布到此,仅供网友阅读参考,如有侵权,请通知我,我会删掉。 补充 有不少读者留言说本文章没有用,因为天气预报直接打开手机就可以收到了,为何要多此一举发送到邮箱呢!!!那我在这里只能说:因为你没用,所以你没用!!! 这里主要介绍的是思路,不是天气预报!不是天气预报!!不是天气预报!!!天气预报只是用于举例。请各位不要再刚了!!! 下面是我会用到的两个场景: 每日下
面试官问我:什么是消息队列?什么场景需要他?用了会出现什么问题?
你知道的越多,你不知道的越多 点赞再看,养成习惯 GitHub上已经开源 https://github.com/JavaFamily 有一线大厂面试点脑图、个人联系方式,欢迎Star和完善 前言 消息队列在互联网技术存储方面使用如此广泛,几乎所有的后端技术面试官都要在消息队列的使用和原理方面对小伙伴们进行360°的刁难。 作为一个在互联网公司面一次拿一次Offer的面霸,打败了无数
8年经验面试官详解 Java 面试秘诀
    作者 | 胡书敏 责编 | 刘静 出品 | CSDN(ID:CSDNnews) 本人目前在一家知名外企担任架构师,而且最近八年来,在多家外企和互联网公司担任Java技术面试官,前后累计面试了有两三百位候选人。在本文里,就将结合本人的面试经验,针对Java初学者、Java初级开发和Java开发,给出若干准备简历和准备面试的建议。   Java程序员准备和投递简历的实
究竟你适不适合买Mac?
我清晰的记得,刚买的macbook pro回到家,开机后第一件事情,就是上了淘宝网,花了500元钱,找了一个上门维修电脑的师傅,上门给我装了一个windows系统。。。。。。 表砍我。。。 当时买mac的初衷,只是想要个固态硬盘的笔记本,用来运行一些复杂的扑克软件。而看了当时所有的SSD笔记本后,最终决定,还是买个好(xiong)看(da)的。 已经有好几个朋友问我mba怎么样了,所以今天尽量客观
程序员一般通过什么途径接私活?
二哥,你好,我想知道一般程序猿都如何接私活,我也想接,能告诉我一些方法吗? 上面是一个读者“烦不烦”问我的一个问题。其实不止是“烦不烦”,还有很多读者问过我类似这样的问题。 我接的私活不算多,挣到的钱也没有多少,加起来不到 20W。说实话,这个数目说出来我是有点心虚的,毕竟太少了,大家轻喷。但我想,恰好配得上“一般程序员”这个称号啊。毕竟苍蝇再小也是肉,我也算是有经验的人了。 唾弃接私活、做外
大学四年自学走来,这些珍藏的「实用工具/学习网站」我全贡献出来了
知乎高赞:文中列举了互联网一线大厂程序员都在用的工具集合,涉及面非常广,小白和老手都可以进来看看,或许有新收获。
《阿里巴巴开发手册》读书笔记-编程规约
Java编程规约命名风格 命名风格 类名使用UpperCamelCase风格 方法名,参数名,成员变量,局部变量都统一使用lowerCamelcase风格 常量命名全部大写,单词间用下划线隔开, 力求语义表达完整清楚,不要嫌名字长 ...
Python爬虫爬取淘宝,京东商品信息
小编是一个理科生,不善长说一些废话。简单介绍下原理然后直接上代码。 使用的工具(Python+pycharm2019.3+selenium+xpath+chromedriver)其中要使用pycharm也可以私聊我selenium是一个框架可以通过pip下载 pip install selenium -i https://pypi.tuna.tsinghua.edu.cn/simple/ 
阿里程序员写了一个新手都写不出的低级bug,被骂惨了。
你知道的越多,你不知道的越多 点赞再看,养成习惯 本文 GitHub https://github.com/JavaFamily 已收录,有一线大厂面试点思维导图,也整理了很多我的文档,欢迎Star和完善,大家面试可以参照考点复习,希望我们一起有点东西。 前前言 为啥今天有个前前言呢? 因为你们的丙丙啊,昨天有牌面了哟,直接被微信官方推荐,知乎推荐,也就仅仅是还行吧(心里乐开花)
Java工作4年来应聘要16K最后没要,细节如下。。。
前奏: 今天2B哥和大家分享一位前几天面试的一位应聘者,工作4年26岁,统招本科。 以下就是他的简历和面试情况。 基本情况: 专业技能: 1、&nbsp;熟悉Sping了解SpringMVC、SpringBoot、Mybatis等框架、了解SpringCloud微服务 2、&nbsp;熟悉常用项目管理工具:SVN、GIT、MAVEN、Jenkins 3、&nbsp;熟悉Nginx、tomca
Python爬虫精简步骤1 获取数据
爬虫的工作分为四步: 1.获取数据。爬虫程序会根据我们提供的网址,向服务器发起请求,然后返回数据。 2.解析数据。爬虫程序会把服务器返回的数据解析成我们能读懂的格式。 3.提取数据。爬虫程序再从中提取出我们需要的数据。 4.储存数据。爬虫程序把这些有用的数据保存起来,便于你日后的使用和分析。 这一篇的内容就是:获取数据。 首先,我们将会利用一个强大的库——requests来获取数据。 在电脑上安装
Python绘图,圣诞树,花,爱心 | Turtle篇
1.画圣诞树 import turtle screen = turtle.Screen() screen.setup(800,600) circle = turtle.Turtle() circle.shape('circle') circle.color('red') circle.speed('fastest') circle.up() square = turtle.Turtle()
作为一个程序员,CPU的这些硬核知识你必须会!
CPU对每个程序员来说,是个既熟悉又陌生的东西? 如果你只知道CPU是中央处理器的话,那可能对你并没有什么用,那么作为程序员的我们,必须要搞懂的就是CPU这家伙是如何运行的,尤其要搞懂它里面的寄存器是怎么一回事,因为这将让你从底层明白程序的运行机制。 随我一起,来好好认识下CPU这货吧 把CPU掰开来看 对于CPU来说,我们首先就要搞明白它是怎么回事,也就是它的内部构造,当然,CPU那么牛的一个东
破14亿,Python分析我国存在哪些人口危机!
2020年1月17日,国家统计局发布了2019年国民经济报告,报告中指出我国人口突破14亿。 猪哥的朋友圈被14亿人口刷屏,但是很多人并没有看到我国复杂的人口问题:老龄化、男女比例失衡、生育率下降、人口红利下降等。 今天我们就来分析一下我们国家的人口数据吧! 更多有趣分析教程,扫描下方二维码关注vx公号「裸睡的猪」 即可查看! 一、背景 1.人口突破14亿 2020年1月17日,国家统计局发布
听说想当黑客的都玩过这个Monyer游戏(1~14攻略)
第零关 进入传送门开始第0关(游戏链接) 请点击链接进入第1关: 连接在左边→ ←连接在右边 看不到啊。。。。(只能看到一堆大佬做完的留名,也能看到菜鸡的我,在后面~~) 直接fn+f12吧 &lt;span&gt;连接在左边→&lt;/span&gt; &lt;a href="first.php"&gt;&lt;/a&gt; &lt;span&gt;←连接在右边&lt;/span&gt; o
在家远程办公效率低?那你一定要收好这个「在家办公」神器!
相信大家都已经收到国务院延长春节假期的消息,接下来,在家远程办公可能将会持续一段时间。 但是问题来了。远程办公不是人在电脑前就当坐班了,相反,对于沟通效率,文件协作,以及信息安全都有着极高的要求。有着非常多的挑战,比如: 1在异地互相不见面的会议上,如何提高沟通效率? 2文件之间的来往反馈如何做到及时性?如何保证信息安全? 3如何规划安排每天工作,以及如何进行成果验收? ......
作为一个程序员,内存和磁盘的这些事情,你不得不知道啊!!!
截止目前,我已经分享了如下几篇文章: 一个程序在计算机中是如何运行的?超级干货!!! 作为一个程序员,CPU的这些硬核知识你必须会! 作为一个程序员,内存的这些硬核知识你必须懂! 这些知识可以说是我们之前都不太重视的基础知识,可能大家在上大学的时候都学习过了,但是嘞,当时由于老师讲解的没那么有趣,又加上这些知识本身就比较枯燥,所以嘞,大家当初几乎等于没学。 再说啦,学习这些,也看不出来有什么用啊!
别低估自己的直觉,也别高估自己的智商
所有群全部吵翻天,朋友圈全部沦陷,公众号疯狂转发。这两周没怎么发原创,只发新闻,可能有人注意到了。我不是懒,是文章写了却没发,因为大家的关注力始终在这次的疫情上面,发了也没人看。当然,我...
这个世界上人真的分三六九等,你信吗?
偶然间,在知乎上看到一个问题 一时间,勾起了我深深的回忆。 以前在厂里打过两次工,做过家教,干过辅导班,做过中介。零下几度的晚上,贴过广告,满脸、满手地长冻疮。   再回首那段岁月,虽然苦,但让我学会了坚持和忍耐。让我明白了,在这个世界上,无论环境多么的恶劣,只要心存希望,星星之火,亦可燎原。   下文是原回答,希望能对你能有所启发。   如果我说,这个世界上人真的分三六九等,
为什么听过很多道理,依然过不好这一生?
记录学习笔记是一个重要的习惯,不希望学习过的东西成为过眼云烟。做总结的同时也是一次复盘思考的过程。 本文是根据阅读得到 App上《万维钢·精英日课》部分文章后所做的一点笔记和思考。学习是一个系统的过程,思维模型的建立需要相对完整的学习和思考过程。以下观点是在碎片化阅读后总结的一点心得总结。
B 站上有哪些很好的学习资源?
哇说起B站,在小九眼里就是宝藏般的存在,放年假宅在家时一天刷6、7个小时不在话下,更别提今年的跨年晚会,我简直是跪着看完的!! 最早大家聚在在B站是为了追番,再后来我在上面刷欧美新歌和漂亮小姐姐的舞蹈视频,最近两年我和周围的朋友们已经把B站当作学习教室了,而且学习成本还免费,真是个励志的好平台ヽ(.◕ฺˇд ˇ◕ฺ;)ノ 下面我们就来盘点一下B站上优质的学习资源: 综合类 Oeasy: 综合
如何优雅地打印一个Java对象?
你好呀,我是沉默王二,一个和黄家驹一样身高,和刘德华一样颜值的程序员。虽然已经写了十多年的 Java 代码,但仍然觉得自己是个菜鸟(请允许我惭愧一下)。 在一个月黑风高的夜晚,我思前想后,觉得再也不能这么蹉跎下去了。于是痛下决心,准备通过输出的方式倒逼输入,以此来修炼自己的内功,从而进阶成为一名真正意义上的大神。与此同时,希望这些文章能够帮助到更多的读者,让大家在学习的路上不再寂寞、空虚和冷。 ...
雷火神山直播超两亿,Web播放器事件监听是怎么实现的?
Web播放器解决了在手机浏览器和PC浏览器上播放音视频数据的问题,让视音频内容可以不依赖用户安装App,就能进行播放以及在社交平台进行传播。在视频业务大数据平台中,播放数据的统计分析非常重要,所以Web播放器在使用过程中,需要对其内部的数据进行收集并上报至服务端,此时,就需要对发生在其内部的一些播放行为进行事件监听。 那么Web播放器事件监听是怎么实现的呢? 01 监听事件明细表 名
3万字总结,Mysql优化之精髓
本文知识点较多,篇幅较长,请耐心学习 MySQL已经成为时下关系型数据库产品的中坚力量,备受互联网大厂的青睐,出门面试想进BAT,想拿高工资,不会点MySQL优化知识,拿offer的成功率会大大下降。 为什么要优化 系统的吞吐量瓶颈往往出现在数据库的访问速度上 随着应用程序的运行,数据库的中的数据会越来越多,处理时间会相应变慢 数据是存放在磁盘上的,读写速度无法和内存相比 如何优化 设计
Linux 命令(122)—— watch 命令
1.命令简介 2.命令格式 3.选项说明 4.常用示例 参考文献 [1] watch(1) manual
Linux 命令(121)—— cal 命令
1.命令简介 2.命令格式 3.选项说明 4.常用示例 参考文献 [1] cal(1) manual
记jsp+servlet+jdbc实现的新闻管理系统
1.工具:eclipse+SQLyog 2.介绍:实现的内容就是显示新闻的基本信息,然后一个增删改查的操作。 3.数据库表设计 列名 中文名称 数据类型 长度 非空 newsId 文章ID int 11 √ newsTitle 文章标题 varchar 20 √ newsContent 文章内容 text newsStatus 是否审核 varchar 10 news...
Python新型冠状病毒疫情数据自动爬取+统计+发送报告+数据屏幕(三)发送篇
今天介绍的项目是使用 Itchat 发送统计报告 项目功能设计: 定时爬取疫情数据存入Mysql 进行数据分析制作疫情报告 使用itchat给亲人朋友发送分析报告(本文) 基于Django做数据屏幕 使用Tableau做数据分析 来看看最终效果 目前已经完成,预计2月12日前更新 使用 itchat 发送数据统计报告 itchat 是一个基于 web微信的一个框架,但微信官方并不允
作为程序员的我,大学四年一直自学,全靠这些实用工具和学习网站!
我本人因为高中沉迷于爱情,导致学业荒废,后来高考,毫无疑问进入了一所普普通通的大学,实在惭愧...... 我又是那么好强,现在学历不行,没办法改变的事情了,所以,进入大学开始,我就下定决心,一定要让自己掌握更多的技能,尤其选择了计算机这个行业,一定要多学习技术。 在进入大学学习不久后,我就认清了一个现实:我这个大学的整体教学质量和学习风气,真的一言难尽,懂的人自然知道怎么回事? 怎么办?我该如何更好的提升
相关热词 c# 时间比天数 c# oracle查询 c# 主动推送 事件 c# java 属性 c# 控制台 窗体 c# 静态类存值 c#矢量作图 c#窗体调用外部程式 c# enum是否合法 c# 如何卸载引用
立即提问