wild84
2017-06-30 11:29
采纳率: 91.6%
浏览 4.9k
已采纳

第一个maven项目出现数组越界异常

异常信息:

 [INFO] Error stacktraces are turned on.
[INFO] Scanning for projects...
[INFO] 
[INFO] ------------------------------------------------------------------------
[INFO] Building appsys Maven Webapp 0.0.1-SNAPSHOT
[INFO] ------------------------------------------------------------------------
[INFO] ------------------------------------------------------------------------
[INFO] BUILD FAILURE
[INFO] ------------------------------------------------------------------------
[INFO] Total time: 0.330 s
[INFO] Finished at: 2017-06-30T19:23:48+08:00
[INFO] Final Memory: 6M/123M
[INFO] ------------------------------------------------------------------------
[ERROR] 13529
java.lang.ArrayIndexOutOfBoundsException: 13529
    at org.codehaus.plexus.util.xml.pull.MXParser.parsePI(MXParser.java:2502)
    at org.codehaus.plexus.util.xml.pull.MXParser.parseEpilog(MXParser.java:1604)
    at org.codehaus.plexus.util.xml.pull.MXParser.nextImpl(MXParser.java:1434)
    at org.codehaus.plexus.util.xml.pull.MXParser.next(MXParser.java:1131)
    at org.apache.maven.model.io.xpp3.MavenXpp3Reader.read(MavenXpp3Reader.java:3856)
    at org.apache.maven.model.io.xpp3.MavenXpp3Reader.read(MavenXpp3Reader.java:595)
    at org.apache.maven.model.io.DefaultModelReader.read(DefaultModelReader.java:109)
    at org.apache.maven.model.io.DefaultModelReader.read(DefaultModelReader.java:82)
    at org.apache.maven.model.building.DefaultModelProcessor.read(DefaultModelProcessor.java:81)
    at org.apache.maven.model.building.DefaultModelBuilder.readModel(DefaultModelBuilder.java:535)
    at org.apache.maven.model.building.DefaultModelBuilder.build(DefaultModelBuilder.java:275)
    at org.apache.maven.repository.internal.DefaultArtifactDescriptorReader.loadPom(DefaultArtifactDescriptorReader.java:321)
    at org.apache.maven.repository.internal.DefaultArtifactDescriptorReader.readArtifactDescriptor(DefaultArtifactDescriptorReader.java:199)
    at org.eclipse.aether.internal.impl.DefaultDependencyCollector.resolveCachedArtifactDescriptor(DefaultDependencyCollector.java:544)
    at org.eclipse.aether.internal.impl.DefaultDependencyCollector.getArtifactDescriptorResult(DefaultDependencyCollector.java:528)
    at org.eclipse.aether.internal.impl.DefaultDependencyCollector.processDependency(DefaultDependencyCollector.java:418)
    at org.eclipse.aether.internal.impl.DefaultDependencyCollector.processDependency(DefaultDependencyCollector.java:372)
    at org.eclipse.aether.internal.impl.DefaultDependencyCollector.process(DefaultDependencyCollector.java:360)
    at org.eclipse.aether.internal.impl.DefaultDependencyCollector.collectDependencies(DefaultDependencyCollector.java:263)
    at org.eclipse.aether.internal.impl.DefaultRepositorySystem.collectDependencies(DefaultRepositorySystem.java:325)
    at org.apache.maven.project.DefaultProjectDependenciesResolver.resolve(DefaultProjectDependenciesResolver.java:169)
    at org.apache.maven.lifecycle.internal.LifecycleDependencyResolver.getDependencies(LifecycleDependencyResolver.java:195)
    at org.apache.maven.lifecycle.internal.LifecycleDependencyResolver.resolveProjectDependencies(LifecycleDependencyResolver.java:127)
    at org.apache.maven.lifecycle.internal.MojoExecutor.ensureDependenciesAreResolved(MojoExecutor.java:246)
    at org.apache.maven.lifecycle.internal.MojoExecutor.execute(MojoExecutor.java:200)
    at org.apache.maven.lifecycle.internal.MojoExecutor.execute(MojoExecutor.java:154)
    at org.apache.maven.lifecycle.internal.MojoExecutor.execute(MojoExecutor.java:146)
    at org.apache.maven.lifecycle.internal.LifecycleModuleBuilder.buildProject(LifecycleModuleBuilder.java:117)
    at org.apache.maven.lifecycle.internal.LifecycleModuleBuilder.buildProject(LifecycleModuleBuilder.java:81)
    at org.apache.maven.lifecycle.internal.builder.singlethreaded.SingleThreadedBuilder.build(SingleThreadedBuilder.java:51)
    at org.apache.maven.lifecycle.internal.LifecycleStarter.execute(LifecycleStarter.java:128)
    at org.apache.maven.DefaultMaven.doExecute(DefaultMaven.java:309)
    at org.apache.maven.DefaultMaven.doExecute(DefaultMaven.java:194)
    at org.apache.maven.DefaultMaven.execute(DefaultMaven.java:107)
    at org.apache.maven.cli.MavenCli.execute(MavenCli.java:993)
    at org.apache.maven.cli.MavenCli.doMain(MavenCli.java:345)
    at org.apache.maven.cli.MavenCli.main(MavenCli.java:191)
    at sun.reflect.NativeMethodAccessorImpl.invoke0(Native Method)
    at sun.reflect.NativeMethodAccessorImpl.invoke(NativeMethodAccessorImpl.java:62)
    at sun.reflect.DelegatingMethodAccessorImpl.invoke(DelegatingMethodAccessorImpl.java:43)
    at java.lang.reflect.Method.invoke(Method.java:498)
    at org.codehaus.plexus.classworlds.launcher.Launcher.launchEnhanced(Launcher.java:289)
    at org.codehaus.plexus.classworlds.launcher.Launcher.launch(Launcher.java:229)
    at org.codehaus.plexus.classworlds.launcher.Launcher.mainWithExitCode(Launcher.java:415)
    at org.codehaus.plexus.classworlds.launcher.Launcher.main(Launcher.java:356)
[ERROR] 
[ERROR] Re-run Maven using the -X switch to enable full debug logging.

pom.xml文件

 <project xmlns="http://maven.apache.org/POM/4.0.0" xmlns:xsi="http://www.w3.org/2001/XMLSchema-instance"
  xsi:schemaLocation="http://maven.apache.org/POM/4.0.0 http://maven.apache.org/maven-v4_0_0.xsd">
  <modelVersion>4.0.0</modelVersion>
  <groupId>cn.anywhere</groupId>
  <artifactId>appsys</artifactId>
  <packaging>war</packaging>
  <version>0.0.1-SNAPSHOT</version>
  <name>appsys Maven Webapp</name>
  <url>http://maven.apache.org</url>
  <dependencies>
    <dependency>
      <groupId>junit</groupId>
      <artifactId>junit</artifactId>
      <version>3.8.1</version>
      <scope>test</scope>
    </dependency>
    <!-- https://mvnrepository.com/artifact/javax.servlet/javax.servlet-api -->
    <dependency>
    <groupId>javax.servlet</groupId>
    <artifactId>javax.servlet-api</artifactId>
    <version>3.1.0</version>
    <scope>provided</scope>
    </dependency>
    <!-- https://mvnrepository.com/artifact/javax.servlet.jsp/javax.servlet.jsp-api -->
    <dependency>
        <groupId>javax.servlet.jsp</groupId>
        <artifactId>javax.servlet.jsp-api</artifactId>
        <version>2.3.0</version>
        <scope>provided</scope>
    </dependency>
  </dependencies>
  <build>
    <finalName>appsys</finalName>
  </build>
</project>

项目目录:
图片说明

 只有一个jsp页面

<%@ page language="java" import="java.util.*" pageEncoding="ISO-8859-1"%>
<%
String path = request.getContextPath();
String basePath = request.getScheme()+"://"+request.getServerName()+":"+request.getServerPort()+path+"/";
%>

<!DOCTYPE HTML PUBLIC "-//W3C//DTD HTML 4.01 Transitional//EN">


  • 写回答
  • 关注问题
  • 收藏
  • 邀请回答

5条回答 默认 最新

  • yangfande362 2017-07-05 03:58
    已采纳

    感觉是maven自己的plexus-utils包有问题

    打赏 评论
  • yangfande362 2017-07-04 08:32

    我也有如上问题,我是再pom中添加了activiti的jar就会报数组越界,去掉activiti的jar就正常。 但是我必须用activiti,也不知道究竟是什么原因。
    我的报错如下:
    [WARNING] The POM for org.slf4j:slf4j-api:jar:1.7.6 is invalid, transitive dependencies (if any) will not be available: 1 problem was encountered while building the effective model for org.slf4j:slf4j-api:[unknown-version]
    [FATAL] Non-parseable POM D:\maven\repository\org\slf4j\slf4j-parent\1.7.6\slf4j-parent-1.7.6.pom: end tag not allowed in epilog but got / (position: END_TAG seen ...\r\n\r\n\r\n </... @398:16) @ D:\maven\repository\org\slf4j\slf4j-parent\1.7.6\slf4j-parent-1.7.6.pom, line 398, column 16

    [INFO] ------------------------------------------------------------------------
    [INFO] BUILD FAILURE
    [INFO] ------------------------------------------------------------------------
    [INFO] Total time: 0.709 s
    [INFO] Finished at: 2017-07-04T15:23:48+08:00
    [INFO] Final Memory: 12M/219M
    [INFO] ------------------------------------------------------------------------
    [ERROR] 17166
    java.lang.ArrayIndexOutOfBoundsException: 17166
    at org.codehaus.plexus.util.xml.pull.MXParser.parsePI(MXParser.java:2502)
    at org.codehaus.plexus.util.xml.pull.MXParser.parseEpilog(MXParser.java:1604)
    at org.codehaus.plexus.util.xml.pull.MXParser.nextImpl(MXParser.java:1434)
    at org.codehaus.plexus.util.xml.pull.MXParser.next(MXParser.java:1131)
    at org.apache.maven.model.io.xpp3.MavenXpp3Reader.read(MavenXpp3Reader.java:3856)
    at org.apache.maven.model.io.xpp3.MavenXpp3Reader.read(MavenXpp3Reader.java:595)
    at org.apache.maven.model.io.DefaultModelReader.read(DefaultModelReader.java:109)
    at org.apache.maven.model.io.DefaultModelReader.read(DefaultModelReader.java:82)

    打赏 评论
  • 幸苦的程序元 2017-09-06 10:05

    [INFO] Error stacktraces are turned on.
    [INFO] Scanning for projects...
    [INFO]
    [INFO] ------------------------------------------------------------------------
    [INFO] Building act-demo Maven Webapp 0.0.1-SNAPSHOT
    [INFO] ------------------------------------------------------------------------
    [INFO] ------------------------------------------------------------------------
    [INFO] BUILD FAILURE
    [INFO] ------------------------------------------------------------------------
    [INFO] Total time: 0.912 s
    [INFO] Finished at: 2017-09-06T18:04:22+08:00
    [INFO] Final Memory: 7M/138M
    [INFO] ------------------------------------------------------------------------
    [ERROR] 20379
    java.lang.ArrayIndexOutOfBoundsException: 20379
    at org.codehaus.plexus.util.xml.pull.MXParser.parsePI(MXParser.java:2502)
    at org.codehaus.plexus.util.xml.pull.MXParser.parseEpilog(MXParser.java:1604)
    at org.codehaus.plexus.util.xml.pull.MXParser.nextImpl(MXParser.java:1434)
    at org.codehaus.plexus.util.xml.pull.MXParser.next(MXParser.java:1131)
    at org.apache.maven.model.io.xpp3.MavenXpp3Reader.read(MavenXpp3Reader.java:3856)
    at org.apache.maven.model.io.xpp3.MavenXpp3Reader.read(MavenXpp3Reader.java:595)
    at org.apache.maven.model.io.DefaultModelReader.read(DefaultModelReader.java:109)
    at org.apache.maven.model.io.DefaultModelReader.read(DefaultModelReader.java:82)
    at org.apache.maven.model.building.DefaultModelProcessor.read(DefaultModelProcessor.java:81)
    at org.apache.maven.model.building.DefaultModelBuilder.readModel(DefaultModelBuilder.java:535)
    at org.apache.maven.model.building.DefaultModelBuilder.build(DefaultModelBuilder.java:275)
    at org.apache.maven.repository.internal.DefaultArtifactDescriptorReader.loadPom(DefaultArtifactDescriptorReader.java:321)
    at org.apache.maven.repository.internal.DefaultArtifactDescriptorReader.readArtifactDescriptor(DefaultArtifactDescriptorReader.java:199)
    at org.eclipse.aether.internal.impl.DefaultDependencyCollector.resolveCachedArtifactDescriptor(DefaultDependencyCollector.java:544)
    at org.eclipse.aether.internal.impl.DefaultDependencyCollector.getArtifactDescriptorResult(DefaultDependencyCollector.java:528)
    at org.eclipse.aether.internal.impl.DefaultDependencyCollector.processDependency(DefaultDependencyCollector.java:418)
    at org.eclipse.aether.internal.impl.DefaultDependencyCollector.processDependency(DefaultDependencyCollector.java:372)
    at org.eclipse.aether.internal.impl.DefaultDependencyCollector.process(DefaultDependencyCollector.java:360)
    at org.eclipse.aether.internal.impl.DefaultDependencyCollector.doRecurse(DefaultDependencyCollector.java:513)
    at org.eclipse.aether.internal.impl.DefaultDependencyCollector.processDependency(DefaultDependencyCollector.java:467)
    at org.eclipse.aether.internal.impl.DefaultDependencyCollector.processDependency(DefaultDependencyCollector.java:372)
    at org.eclipse.aether.internal.impl.DefaultDependencyCollector.process(DefaultDependencyCollector.java:360)
    at org.eclipse.aether.internal.impl.DefaultDependencyCollector.doRecurse(DefaultDependencyCollector.java:513)
    at org.eclipse.aether.internal.impl.DefaultDependencyCollector.processDependency(DefaultDependencyCollector.java:467)
    at org.eclipse.aether.internal.impl.DefaultDependencyCollector.processDependency(DefaultDependencyCollector.java:372)
    at org.eclipse.aether.internal.impl.DefaultDependencyCollector.process(DefaultDependencyCollector.java:360)
    at org.eclipse.aether.internal.impl.DefaultDependencyCollector.doRecurse(DefaultDependencyCollector.java:513)
    at org.eclipse.aether.internal.impl.DefaultDependencyCollector.processDependency(DefaultDependencyCollector.java:467)
    at org.eclipse.aether.internal.impl.DefaultDependencyCollector.processDependency(DefaultDependencyCollector.java:372)
    at org.eclipse.aether.internal.impl.DefaultDependencyCollector.process(DefaultDependencyCollector.java:360)
    at org.eclipse.aether.internal.impl.DefaultDependencyCollector.collectDependencies(DefaultDependencyCollector.java:263)
    at org.eclipse.aether.internal.impl.DefaultRepositorySystem.collectDependencies(DefaultRepositorySystem.java:325)
    at org.apache.maven.project.DefaultProjectDependenciesResolver.resolve(DefaultProjectDependenciesResolver.java:169)
    at org.apache.maven.lifecycle.internal.LifecycleDependencyResolver.getDependencies(LifecycleDependencyResolver.java:195)
    at org.apache.maven.lifecycle.internal.LifecycleDependencyResolver.resolveProjectDependencies(LifecycleDependencyResolver.java:127)
    at org.apache.maven.lifecycle.internal.MojoExecutor.ensureDependenciesAreResolved(MojoExecutor.java:246)
    at org.apache.maven.lifecycle.internal.MojoExecutor.execute(MojoExecutor.java:200)
    at org.apache.maven.lifecycle.internal.MojoExecutor.execute(MojoExecutor.java:154)
    at org.apache.maven.lifecycle.internal.MojoExecutor.execute(MojoExecutor.java:146)
    at org.apache.maven.lifecycle.internal.LifecycleModuleBuilder.buildProject(LifecycleModuleBuilder.java:117)
    at org.apache.maven.lifecycle.internal.LifecycleModuleBuilder.buildProject(LifecycleModuleBuilder.java:81)
    at org.apache.maven.lifecycle.internal.builder.singlethreaded.SingleThreadedBuilder.build(SingleThreadedBuilder.java:51)
    at org.apache.maven.lifecycle.internal.LifecycleStarter.execute(LifecycleStarter.java:128)
    at org.apache.maven.DefaultMaven.doExecute(DefaultMaven.java:309)
    at org.apache.maven.DefaultMaven.doExecute(DefaultMaven.java:194)
    at org.apache.maven.DefaultMaven.execute(DefaultMaven.java:107)
    at org.apache.maven.cli.MavenCli.execute(MavenCli.java:993)
    at org.apache.maven.cli.MavenCli.doMain(MavenCli.java:345)
    at org.apache.maven.cli.MavenCli.main(MavenCli.java:191)
    at sun.reflect.NativeMethodAccessorImpl.invoke0(Native Method)
    at sun.reflect.NativeMethodAccessorImpl.invoke(NativeMethodAccessorImpl.java:62)
    at sun.reflect.DelegatingMethodAccessorImpl.invoke(DelegatingMethodAccessorImpl.java:43)
    at java.lang.reflect.Method.invoke(Method.java:498)
    at org.codehaus.plexus.classworlds.launcher.Launcher.launchEnhanced(Launcher.java:289)
    at org.codehaus.plexus.classworlds.launcher.Launcher.launch(Launcher.java:229)
    at org.codehaus.plexus.classworlds.launcher.Launcher.mainWithExitCode(Launcher.java:415)
    at org.codehaus.plexus.classworlds.launcher.Launcher.main(Launcher.java:356)
    [ERROR]
    [ERROR] Re-run Maven using the -X switch to enable full debug logging.

    求哪位大神解决下啊

    打赏 评论
  • MaterShifu 2017-12-20 09:55

    [ERROR] 13486
    java.lang.ArrayIndexOutOfBoundsException: 13486
    at org.codehaus.plexus.util.xml.pull.MXParser.parsePI(MXParser.java:2502)
    at org.codehaus.plexus.util.xml.pull.MXParser.parseEpilog(MXParser.java:1604)
    at org.codehaus.plexus.util.xml.pull.MXParser.nextImpl(MXParser.java:1434)
    at org.codehaus.plexus.util.xml.pull.MXParser.next(MXParser.java:1131)
    at org.apache.maven.model.io.xpp3.MavenXpp3Reader.read(MavenXpp3Reader.java:3856)
    at org.apache.maven.model.io.xpp3.MavenXpp3Reader.read(MavenXpp3Reader.java:595)
    at org.apache.maven.model.io.DefaultModelReader.read(DefaultModelReader.java:109)
    at org.apache.maven.model.io.DefaultModelReader.read(DefaultModelReader.java:82)
    at org.apache.maven.model.building.DefaultModelProcessor.read(DefaultModelProcessor.java:81)
    at org.apache.maven.model.building.DefaultModelBuilder.readModel(DefaultModelBuilder.java:535)
    at org.apache.maven.model.building.DefaultModelBuilder.readParentExternally(DefaultModelBuilder.java:1097)
    at org.apache.maven.model.building.DefaultModelBuilder.readParent(DefaultModelBuilder.java:829)
    at org.apache.maven.model.building.DefaultModelBuilder.build(DefaultModelBuilder.java:331)
    at org.apache.maven.repository.internal.DefaultArtifactDescriptorReader.loadPom(DefaultArtifactDescriptorReader.java:321)
    at org.apache.maven.repository.internal.DefaultArtifactDescriptorReader.readArtifactDescriptor(DefaultArtifactDescriptorReader.java:199)
    at org.eclipse.aether.internal.impl.DefaultDependencyCollector.resolveCachedArtifactDescriptor(DefaultDependencyCollector.java:544)
    at org.eclipse.aether.internal.impl.DefaultDependencyCollector.getArtifactDescriptorResult(DefaultDependencyCollector.java:528)
    at org.eclipse.aether.internal.impl.DefaultDependencyCollector.processDependency(DefaultDependencyCollector.java:418)
    at org.eclipse.aether.internal.impl.DefaultDependencyCollector.processDependency(DefaultDependencyCollector.java:372)
    at org.eclipse.aether.internal.impl.DefaultDependencyCollector.process(DefaultDependencyCollector.java:360)
    at org.eclipse.aether.internal.impl.DefaultDependencyCollector.doRecurse(DefaultDependencyCollector.java:513)
    at org.eclipse.aether.internal.impl.DefaultDependencyCollector.processDependency(DefaultDependencyCollector.java:467)
    at org.eclipse.aether.internal.impl.DefaultDependencyCollector.processDependency(DefaultDependencyCollector.java:372)
    at org.eclipse.aether.internal.impl.DefaultDependencyCollector.process(DefaultDependencyCollector.java:360)
    at org.eclipse.aether.internal.impl.DefaultDependencyCollector.doRecurse(DefaultDependencyCollector.java:513)
    at org.eclipse.aether.internal.impl.DefaultDependencyCollector.processDependency(DefaultDependencyCollector.java:467)
    at org.eclipse.aether.internal.impl.DefaultDependencyCollector.processDependency(DefaultDependencyCollector.java:372)
    at org.eclipse.aether.internal.impl.DefaultDependencyCollector.process(DefaultDependencyCollector.java:360)
    at org.eclipse.aether.internal.impl.DefaultDependencyCollector.doRecurse(DefaultDependencyCollector.java:513)
    at org.eclipse.aether.internal.impl.DefaultDependencyCollector.processDependency(DefaultDependencyCollector.java:467)
    at org.eclipse.aether.internal.impl.DefaultDependencyCollector.processDependency(DefaultDependencyCollector.java:372)
    at org.eclipse.aether.internal.impl.DefaultDependencyCollector.process(DefaultDependencyCollector.java:360)
    at org.eclipse.aether.internal.impl.DefaultDependencyCollector.doRecurse(DefaultDependencyCollector.java:513)
    at org.eclipse.aether.internal.impl.DefaultDependencyCollector.processDependency(DefaultDependencyCollector.java:467)
    at org.eclipse.aether.internal.impl.DefaultDependencyCollector.processDependency(DefaultDependencyCollector.java:372)
    at org.eclipse.aether.internal.impl.DefaultDependencyCollector.process(DefaultDependencyCollector.java:360)
    at org.eclipse.aether.internal.impl.DefaultDependencyCollector.collectDependencies(DefaultDependencyCollector.java:263)
    at org.eclipse.aether.internal.impl.DefaultRepositorySystem.collectDependencies(DefaultRepositorySystem.java:325)
    at org.apache.maven.project.DefaultProjectDependenciesResolver.resolve(DefaultProjectDependenciesResolver.java:169)
    at org.apache.maven.lifecycle.internal.LifecycleDependencyResolver.getDependencies(LifecycleDependencyResolver.java:195)
    at org.apache.maven.lifecycle.internal.LifecycleDependencyResolver.resolveProjectDependencies(LifecycleDependencyResolver.java:127)
    at org.apache.maven.lifecycle.internal.MojoExecutor.ensureDependenciesAreResolved(MojoExecutor.java:246)
    at org.apache.maven.lifecycle.internal.MojoExecutor.execute(MojoExecutor.java:200)
    at org.apache.maven.lifecycle.internal.MojoExecutor.execute(MojoExecutor.java:154)
    at org.apache.maven.lifecycle.internal.MojoExecutor.execute(MojoExecutor.java:146)
    at org.apache.maven.lifecycle.internal.LifecycleModuleBuilder.buildProject(LifecycleModuleBuilder.java:117)
    at org.apache.maven.lifecycle.internal.LifecycleModuleBuilder.buildProject(LifecycleModuleBuilder.java:81)
    at org.apache.maven.lifecycle.internal.builder.singlethreaded.SingleThreadedBuilder.build(SingleThreadedBuilder.java:51)
    at org.apache.maven.lifecycle.internal.LifecycleStarter.execute(LifecycleStarter.java:128)
    at org.apache.maven.DefaultMaven.doExecute(DefaultMaven.java:309)
    at org.apache.maven.DefaultMaven.doExecute(DefaultMaven.java:194)
    at org.apache.maven.DefaultMaven.execute(DefaultMaven.java:107)
    at org.apache.maven.cli.MavenCli.execute(MavenCli.java:993)
    at org.apache.maven.cli.MavenCli.doMain(MavenCli.java:345)
    at org.apache.maven.cli.MavenCli.main(MavenCli.java:191)
    at sun.reflect.NativeMethodAccessorImpl.invoke0(Native Method)
    at sun.reflect.NativeMethodAccessorImpl.invoke(NativeMethodAccessorImpl.java:62)
    at sun.reflect.DelegatingMethodAccessorImpl.invoke(DelegatingMethodAccessorImpl.java:43)
    at java.lang.reflect.Method.invoke(Method.java:498)
    at org.codehaus.plexus.classworlds.launcher.Launcher.launchEnhanced(Launcher.java:289)
    at org.codehaus.plexus.classworlds.launcher.Launcher.launch(Launcher.java:229)
    at org.codehaus.plexus.classworlds.launcher.Launcher.mainWithExitCode(Launcher.java:415)
    at org.codehaus.plexus.classworlds.launcher.Launcher.main(Launcher.java:356)
    [ERROR]
    [ERROR] Re-run Maven using the -X switch to enable full debug logging.

    同求大神解决类似问题

    打赏 评论
  • MaterShifu 2017-12-20 10:42

    我的3.5.0版maven报错,换成最新的3.5.2就不会了

    打赏 评论