报错 :error: command 'gcc' failed with exit status 1

系统: CentOS6.5 ,Python3.6
安装 mysqlclient 时候 报错:error: command 'gcc' failed with exit status 1
以下是错误信息:
Collecting mysqlclient
Using cached mysqlclient-1.3.10.tar.gz
Installing collected packages: mysqlclient
Running setup.py install for mysqlclient ... error
Complete output from command /usr/local/python3/bin/python3.6 -u -c "import setuptools, tokenize;__file__='/tmp/pip-build-t3olsi0s/mysqlclient/setup.py';f=getattr(tokenize, 'open', open)(__file__);code=f.read().replace('\r\n', '\n');f.close();exec(compile(code, file, 'exec'))" install --record /tmp/pip-oqq8k4wv-record/install-record.txt --single-version-externally-managed --compile:
running install
running build
running build_py
creating build
creating build/lib.linux-x86_64-3.6
copying mysql_exceptions.py -> build/lib.linux-x86_64-3.6
creating build/lib.linux-x86_64-3.6/MySQLdb
copying MySQLdb/
_init__.py -> build/lib.linux-x86_64-3.6/MySQLdb
copying MySQLdb/compat.py -> build/lib.linux-x86_64-3.6/MySQLdb
copying MySQLdb/connections.py -> build/lib.linux-x86_64-3.6/MySQLdb
copying MySQLdb/converters.py -> build/lib.linux-x86_64-3.6/MySQLdb
copying MySQLdb/cursors.py -> build/lib.linux-x86_64-3.6/MySQLdb
copying MySQLdb/release.py -> build/lib.linux-x86_64-3.6/MySQLdb
copying MySQLdb/times.py -> build/lib.linux-x86_64-3.6/MySQLdb
creating build/lib.linux-x86_64-3.6/MySQLdb/constants
copying MySQLdb/constants/__init__.py -> build/lib.linux-x86_64-3.6/MySQLdb/constants
copying MySQLdb/constants/CLIENT.py -> build/lib.linux-x86_64-3.6/MySQLdb/constants
copying MySQLdb/constants/CR.py -> build/lib.linux-x86_64-3.6/MySQLdb/constants
copying MySQLdb/constants/ER.py -> build/lib.linux-x86_64-3.6/MySQLdb/constants
copying MySQLdb/constants/FIELD_TYPE.py -> build/lib.linux-x86_64-3.6/MySQLdb/constants
copying MySQLdb/constants/FLAG.py -> build/lib.linux-x86_64-3.6/MySQLdb/constants
copying MySQLdb/constants/REFRESH.py -> build/lib.linux-x86_64-3.6/MySQLdb/constants
running build_ext
building '_mysql' extension
creating build/temp.linux-x86_64-3.6
gcc -pthread -Wsign-compare -DNDEBUG -g -fwrapv -O3 -Wall -Wstrict-prototypes -fPIC -Dversion_info=(1,3,10,'final',0) -D__version__=1.3.10 -I/usr/include/mysql -I/usr/local/python3/include/python3.6m -c _mysql.c -o build/temp.linux-x86_64-3.6/_mysql.o -g -fstack-protector -m64 -fPIC -g -fabi-version=2 -fno-omit-frame-pointer -fno-strict-aliasing
In file included from /usr/local/python3/include/python3.6m/Python.h:8,
from _mysql.c:40:
/usr/local/python3/include/python3.6m/pyconfig.h:600:1: warning: "HAVE_MBRTOWC" redefined
In file included from _mysql.c:29:
/usr/include/mysql/my_config.h:439:1: warning: this is the location of the previous definition
gcc -pthread -shared build/temp.linux-x86_64-3.6/_mysql.o -L/usr/lib64 -lmysqlclient -lpthread -lm -lrt -ldl -o build/lib.linux-x86_64-3.6/_mysql.cpython-36m-x86_64-linux-gnu.so
/usr/bin/ld: cannot find -lmysqlclient
collect2: ld returned 1 exit status
error: command 'gcc' failed with exit status 1

----------------------------------------

Command "/usr/local/python3/bin/python3.6 -u -c "import setuptools, tokenize;__file__='/tmp/pip-build-t3olsi0s/mysqlclient/setup.py';f=getattr(tokenize, 'open', open)(__file__);code=f.read().replace('\r\n', '\n');f.close();exec(compile(code, file, 'exec'))" install --record /tmp/pip-oqq8k4wv-record/install-record.txt --single-version-externally-managed --compile" failed with error code 1 in /tmp/pip-build-t3olsi0s/mysqlclient/

按照别的帖子 yum install 了 python-devel了还是一样..而且 安装的python-devel的version 是2.6.6的 跟我的Python版本不符,但是yum仓库里又没有 3.6的 python-devel

如何解决?菜鸡求助...

1个回答

Csdn user default icon
上传中...
上传图片
插入图片
抄袭、复制答案,以达到刷声望分或其他目的的行为,在CSDN问答是严格禁止的,一经发现立刻封号。是时候展现真正的技术了!
其他相关推荐
error: command 'x86_64-linux-gnu-gcc' failed with exit status 1
在安装Openstack时,提示如下错误:  In file included from /usr/include/openssl/cms.h:16:0, 2018-11-22 16:33:22.028 |                      from build/temp.linux-x86_64-2.7/_openssl.c:485: 2018-11-22 16:33:22.028 |     /usr/include/openssl/x509.h:552:6: note: expected 'const X509_ALGOR ** {aka const struct X509_algor_st **}' but argument is of type 'X509_ALGOR ** {aka struct X509_algor_st **}' 2018-11-22 16:33:22.028 |      void X509_get0_signature(const ASN1_BIT_STRING **psig, 2018-11-22 16:33:22.028 |           ^~~~~~~~~~~~~~~~~~~ 2018-11-22 16:33:22.028 |     At top level: 2018-11-22 16:33:22.029 |     build/temp.linux-x86_64-2.7/_openssl.c:3492:13: warning: '_ssl_thread_locking_function' defined but not used [-Wunused-function] 2018-11-22 16:33:22.029 |      static void _ssl_thread_locking_function(int mode, int n, const char *file, 2018-11-22 16:33:22.029 |                  ^~~~~~~~~~~~~~~~~~~~~~~~~~~~ 2018-11-22 16:33:22.029 |     error: command 'x86_64-linux-gnu-gcc' failed with exit status 1 2018-11-22 16:33:22.029 | 2018-11-22 16:33:22.029 |     ---------------------------------------- 2018-11-22 16:33:22.070 | Command "/usr/bin/python -u -c "import setuptools, tokenize;__file__='/tmp/pip-build-dDyHZi/cryptography/setup.py';f=getattr(tokenize, 'open', open)(__file__);code=f.read().replace('\r\n', '\n');f.close();exec(compile(code, __file__, 'exec'))" install --record /tmp/pip-VeABSz-record/install-record.txt --single-version-externally-managed --compile" failed with error code 1 in /tmp/pip-build-dDyHZi/cryptography/ 2018-11-22 16:33:22.097 | You are using pip version 9.0.3, however version 18.1 is available. 2018-11-22 16:33:22.097 | You should consider upgrading via the 'pip install --upgrade pip' command. 请大神帮忙看看哪里的问题,卡了好几天了,谢谢!
部署openstack,执行stack.sh报错
error: command 'x86_64-linux-gnu-gcc' failed with exit status 1
Linux运行PBC库中bls程序Make时报错
错误提示: make all Building target: BLSExample Invoking: GCC C Linker gcc -L/usr/local/lib -o "BLSExample" ./bls.o -lpbc /usr/bin/ld: ./bls.o: undefined reference to symbol '__gmpz_init' _//usr/local/lib/libgmp.so.10: error adding symbols: DSO missing from command line collect2: error: ld returned 1 exit status make: *** [BLSExample] Error 1 makefile:29: recipe for target 'BLSExample' failed_ 新手,希望可以知道详细解决方法 要详细!!!
MinGw编译GMP库时出错,跪求大神解答
![出错截图](https://img-ask.csdn.net/upload/201512/11/1449818918_325729.jpg) Config.log如下: This file contains any messages produced by compilers while running configure, to aid debugging if configure makes a mistake. It was created by GNU MP configure 6.1.0, which was generated by GNU Autoconf 2.69. Invocation command line was $ ./configure CPPGLAGS=-D_USE_MINGW_ANSI_STDIO=0--enable-static --disable-shared ## --------- ## ## Platform. ## ## --------- ## hostname = Mr-Chen uname -m = i686 uname -r = 1.0.17(0.48/3/2) uname -s = MINGW32_NT-6.1 uname -v = 2011-04-24 23:39 /usr/bin/ uname -p = unknown /bin/ uname -X = unknown /bin/arch = unknown /usr/bin/arch -k = unknown /usr/convex/getsysinfo = unknown /usr/bin/hostinfo = unknown /bin/machine = unknown /usr/bin/oslevel = unknown /bin/universe = unknown PATH: . PATH: /usr/local/bin PATH: /mingw/bin PATH: /bin PATH: /d/ActivePerl/site/bin PATH: /d/ActivePerl/bin PATH: /c/Program Files (x86)/NVIDIA Corporation/PhysX/Common PATH: /c/Windows/system32 PATH: /c/Windows PATH: /c/Windows/System32/Wbem PATH: /c/Windows/System32/WindowsPowerShell/v1.0/ PATH: %QUARTUS_ROOTDIR%/bin PATH: /c/Program Files (x86)/Common Files/Ulead Systems/MPEG PATH: /c/Program Files (x86)/Microsoft SQL Server/80/Tools/Binn/ PATH: /d/Latex/CTEX/UserData/miktex/bin PATH: /d/Latex/CTEX/MiKTeX/miktex/bin PATH: /d/Latex/CTEX/CTeX/ctex/bin PATH: /d/Latex/CTEX/CTeX/cct/bin PATH: /d/Latex/CTEX/CTeX/ty/bin PATH: /d/Latex/CTEX/Ghostscript/gs9.05/bin PATH: /d/Latex/CTEX/GSview/gsview PATH: /d/Latex/CTEX/WinEdt PATH: /c/Program Files/Microsoft SQL Server/110/Tools/Binn/ PATH: /c/MinGW/bin/ PATH: /d/ActivePerl/site/bin/ PATH: /d/ActivePerl/bin/ PATH: /c/Program Files (x86)/Microsoft SQL Server/100/Tools/Binn/ PATH: /c/Program Files/Microsoft SQL Server/100/Tools/Binn/ PATH: /c/Program Files/Microsoft SQL Server/100/DTS/Binn/ PATH: /d/VS2010/VC/bin/ PATH: /d/MinGw/bin ## ----------- ## ## Core tests. ## ## ----------- ## configure:3055: checking build system type configure:3069: result: sandybridge-pc-mingw32 configure:3089: checking host system type configure:3102: result: sandybridge-pc-mingw32 configure:3139: checking for a BSD-compatible install configure:3207: result: /bin/install -c configure:3218: checking whether build environment is sane configure:3273: result: yes configure:3424: checking for a thread-safe mkdir -p configure:3463: result: /bin/mkdir -p configure:3470: checking for gawk configure:3486: found /bin/gawk configure:3497: result: gawk configure:3508: checking whether make sets $(MAKE) configure:3530: result: yes configure:3559: checking whether make supports nested variables configure:3576: result: yes configure:3705: checking whether to enable maintainer-specific portions of Makefiles configure:3714: result: no User: ABI= CC= CFLAGS=(unset) CPPFLAGS=(unset) MPN_PATH= GMP: abilist=64 x32 32 cclist=gcc icc cc configure:5749: gcc 2>&1 | grep xlc >/dev/null configure:5752: $? = 1 configure:5806: checking compiler gcc -O2 -pedantic -fomit-frame-pointer -m64 Test compile: configure:5820: gcc -O2 -pedantic -fomit-frame-pointer -m64 conftest.c >&5 conftest.c:1:0: sorry, unimplemented: 64-bit mode not compiled in configure:5823: $? = 1 failed program was: int main () { return 0; } configure:6909: result: no configure:5727: cc -c conftest.c >&5 configure:5730: $? = 0 configure:5733: checking whether cc is gcc configure:5735: result: yes configure:5749: cc 2>&1 | grep xlc >/dev/null configure:5752: $? = 1 configure:5806: checking compiler cc -O2 -pedantic -fomit-frame-pointer -m64 Test compile: configure:5820: cc -O2 -pedantic -fomit-frame-pointer -m64 conftest.c >&5 conftest.c:1:0: sorry, unimplemented: 64-bit mode not compiled in configure:5823: $? = 1 failed program was: int main () { return 0; } configure:6909: result: no configure:5749: gcc 2>&1 | grep xlc >/dev/null configure:5752: $? = 1 configure:5806: checking compiler gcc -O2 -pedantic -fomit-frame-pointer -mx32 Test compile: configure:5820: gcc -O2 -pedantic -fomit-frame-pointer -mx32 conftest.c >&5 cc1.exe: error: unrecognized command line option '-mx32' configure:5823: $? = 1 failed program was: int main () { return 0; } configure:6909: result: no configure:5727: cc -c conftest.c >&5 configure:5730: $? = 0 configure:5733: checking whether cc is gcc configure:5735: result: yes configure:5749: cc 2>&1 | grep xlc >/dev/null configure:5752: $? = 1 configure:5806: checking compiler cc -O2 -pedantic -fomit-frame-pointer -mx32 Test compile: configure:5820: cc -O2 -pedantic -fomit-frame-pointer -mx32 conftest.c >&5 cc1.exe: error: unrecognized command line option '-mx32' configure:5823: $? = 1 failed program was: int main () { return 0; } configure:6909: result: no configure:5749: gcc 2>&1 | grep xlc >/dev/null configure:5752: $? = 1 configure:5806: checking compiler gcc -m32 -O2 -pedantic -fomit-frame-pointer Test compile: configure:5820: gcc -m32 -O2 -pedantic -fomit-frame-pointer conftest.c >&5 configure:5823: $? = 0 configure:5828: ./a.out || ./b.out || ./a.exe || ./a_out.exe || ./conftest ./configure: line 5829: ./a.out: No such file or directory ./configure: line 5829: ./b.out: No such file or directory configure:5831: $? = 0 Test compile: function pointer return configure:5874: gcc -m32 -O2 -pedantic -fomit-frame-pointer conftest.c >&5 configure:5877: $? = 0 configure:5882: ./a.out || ./b.out || ./a.exe || ./a_out.exe || ./conftest ./configure: line 5883: ./a.out: No such file or directory ./configure: line 5883: ./b.out: No such file or directory configure:5885: $? = 0 Test compile: cmov instruction configure:5930: gcc -m32 -O2 -pedantic -fomit-frame-pointer conftest.c >&5 configure:5933: $? = 0 configure:5938: ./a.out || ./b.out || ./a.exe || ./a_out.exe || ./conftest ./configure: line 5939: ./a.out: No such file or directory ./configure: line 5939: ./b.out: No such file or directory configure:5941: $? = 0 Test compile: double -> ulong conversion configure:5987: gcc -m32 -O2 -pedantic -fomit-frame-pointer conftest.c >&5 configure:5990: $? = 0 configure:5995: ./a.out || ./b.out || ./a.exe || ./a_out.exe || ./conftest ./configure: line 5996: ./a.out: No such file or directory ./configure: line 5996: ./b.out: No such file or directory configure:5998: $? = 0 Test compile: double negation configure:6042: gcc -m32 -O2 -pedantic -fomit-frame-pointer conftest.c >&5 configure:6045: $? = 0 configure:6050: ./a.out || ./b.out || ./a.exe || ./a_out.exe || ./conftest ./configure: line 6051: ./a.out: No such file or directory ./configure: line 6051: ./b.out: No such file or directory configure:6053: $? = 0 Test compile: double -> float conversion configure:6098: gcc -m32 -O2 -pedantic -fomit-frame-pointer conftest.c >&5 configure:6101: $? = 0 configure:6106: ./a.out || ./b.out || ./a.exe || ./a_out.exe || ./conftest ./configure: line 6107: ./a.out: No such file or directory ./configure: line 6107: ./b.out: No such file or directory configure:6109: $? = 0 Test compile: gnupro alpha ev6 char spilling configure:6183: gcc -m32 -O2 -pedantic -fomit-frame-pointer conftest.c >&5 configure:6186: $? = 0 configure:6191: ./a.out || ./b.out || ./a.exe || ./a_out.exe || ./conftest ./configure: line 6192: ./a.out: No such file or directory ./configure: line 6192: ./b.out: No such file or directory configure:6194: $? = 0 Test compile: __builtin_alloca availability configure:6234: gcc -m32 -O2 -pedantic -fomit-frame-pointer conftest.c >&5 c:/mingw/bin/../lib/gcc/mingw32/4.6.2/../../../libmingw32.a(main.o): In function `main': C:\MinGW\msys\1.0\src\mingwrt/../mingw/main.c:73: undefined reference to `WinMain@16' collect2: ld returned 1 exit status configure:6237: $? = 1 failed program was: int k; int foo () { __builtin_alloca (k); } Test compile: abs int -> double conversion configure:6358: gcc -m32 -O2 -pedantic -fomit-frame-pointer conftest.c >&5 configure:6361: $? = 0 configure:6366: ./a.out || ./b.out || ./a.exe || ./a_out.exe || ./conftest ./configure: line 6367: ./a.out: No such file or directory ./configure: line 6367: ./b.out: No such file or directory configure:6369: $? = 0 Test compile: long long reliability test 1 configure:6423: gcc -m32 -O2 -pedantic -fomit-frame-pointer conftest.c >&5 conftest.c:6:23: warning: ISO C90 does not support 'long long' [-Wlong-long] configure:6426: $? = 0 configure:6431: ./a.out || ./b.out || ./a.exe || ./a_out.exe || ./conftest ./configure: line 6432: ./a.out: No such file or directory ./configure: line 6432: ./b.out: No such file or directory configure:6434: $? = 0 Test compile: long long reliability test 2 configure:6484: gcc -m32 -O2 -pedantic -fomit-frame-pointer conftest.c >&5 conftest.c: In function 'f': conftest.c:7:26: warning: ISO C90 does not support 'long long' [-Wlong-long] configure:6487: $? = 0 configure:6492: ./a.out || ./b.out || ./a.exe || ./a_out.exe || ./conftest ./configure: line 6493: ./a.out: No such file or directory ./configure: line 6493: ./b.out: No such file or directory configure:6495: $? = 0 Test compile: freebsd hacked gcc configure:6545: gcc -m32 -O2 -pedantic -fomit-frame-pointer conftest.c >&5 configure:6548: $? = 0 configure:6553: ./a.out || ./b.out || ./a.exe || ./a_out.exe || ./conftest ./configure: line 6554: ./a.out: No such file or directory ./configure: line 6554: ./b.out: No such file or directory configure:6556: $? = 0 Test compile: mpn_lshift_com optimization configure:6644: gcc -m32 -O2 -pedantic -fomit-frame-pointer conftest.c >&5 configure:6647: $? = 0 configure:6652: ./a.out || ./b.out || ./a.exe || ./a_out.exe || ./conftest ./configure: line 6653: ./a.out: No such file or directory ./configure: line 6653: ./b.out: No such file or directory configure:6655: $? = 0 Test compile: mpn_lshift_com optimization 2 configure:6752: gcc -m32 -O2 -pedantic -fomit-frame-pointer conftest.c >&5 configure:6755: $? = 0 configure:6760: ./a.out || ./b.out || ./a.exe || ./a_out.exe || ./conftest ./configure: line 6761: ./a.out: No such file or directory ./configure: line 6761: ./b.out: No such file or directory configure:6763: $? = 0 configure:6909: result: yes configure: testlist sizeof-long-4 configure:7084: checking compiler gcc -m32 -O2 -pedantic -fomit-frame-pointer has sizeof(long)==4 configure:7097: gcc -m32 -O2 -pedantic -fomit-frame-pointer -c conftest.c >&5 configure:7100: $? = 0 configure:7105: result: yes configure:7423: checking compiler gcc -m32 -O2 -pedantic -fomit-frame-pointer -mtune=sandybridge Test compile: configure:7437: gcc -m32 -O2 -pedantic -fomit-frame-pointer -mtune=sandybridge conftest.c >&5 conftest.c:1:0: error: bad value (sandybridge) for -mtune= switch configure:7440: $? = 1 failed program was: int main () { return 0; } configure:8526: result: no configure:7423: checking compiler gcc -m32 -O2 -pedantic -fomit-frame-pointer -mtune=corei7 Test compile: configure:7437: gcc -m32 -O2 -pedantic -fomit-frame-pointer -mtune=corei7 conftest.c >&5 configure:7440: $? = 0 configure:7445: ./a.out || ./b.out || ./a.exe || ./a_out.exe || ./conftest ./configure: line 7446: ./a.out: No such file or directory ./configure: line 7446: ./b.out: No such file or directory configure:7448: $? = 0 Test compile: function pointer return configure:7491: gcc -m32 -O2 -pedantic -fomit-frame-pointer -mtune=corei7 conftest.c >&5 configure:7494: $? = 0 configure:7499: ./a.out || ./b.out || ./a.exe || ./a_out.exe || ./conftest ./configure: line 7500: ./a.out: No such file or directory ./configure: line 7500: ./b.out: No such file or directory configure:7502: $? = 0 Test compile: cmov instruction configure:7547: gcc -m32 -O2 -pedantic -fomit-frame-pointer -mtune=corei7 conftest.c >&5 configure:7550: $? = 0 configure:7555: ./a.out || ./b.out || ./a.exe || ./a_out.exe || ./conftest ./configure: line 7556: ./a.out: No such file or directory ./configure: line 7556: ./b.out: No such file or directory configure:7558: $? = 0 Test compile: double -> ulong conversion configure:7604: gcc -m32 -O2 -pedantic -fomit-frame-pointer -mtune=corei7 conftest.c >&5 configure:7607: $? = 0 configure:7612: ./a.out || ./b.out || ./a.exe || ./a_out.exe || ./conftest ./configure: line 7613: ./a.out: No such file or directory ./configure: line 7613: ./b.out: No such file or directory configure:7615: $? = 0 Test compile: double negation configure:7659: gcc -m32 -O2 -pedantic -fomit-frame-pointer -mtune=corei7 conftest.c >&5 configure:7662: $? = 0 configure:7667: ./a.out || ./b.out || ./a.exe || ./a_out.exe || ./conftest ./configure: line 7668: ./a.out: No such file or directory ./configure: line 7668: ./b.out: No such file or directory configure:7670: $? = 0 Test compile: double -> float conversion configure:7715: gcc -m32 -O2 -pedantic -fomit-frame-pointer -mtune=corei7 conftest.c >&5 configure:7718: $? = 0 configure:7723: ./a.out || ./b.out || ./a.exe || ./a_out.exe || ./conftest ./configure: line 7724: ./a.out: No such file or directory ./configure: line 7724: ./b.out: No such file or directory configure:7726: $? = 0 Test compile: gnupro alpha ev6 char spilling configure:7800: gcc -m32 -O2 -pedantic -fomit-frame-pointer -mtune=corei7 conftest.c >&5 configure:7803: $? = 0 configure:7808: ./a.out || ./b.out || ./a.exe || ./a_out.exe || ./conftest ./configure: line 7809: ./a.out: No such file or directory ./configure: line 7809: ./b.out: No such file or directory configure:7811: $? = 0 Test compile: __builtin_alloca availability configure:7851: gcc -m32 -O2 -pedantic -fomit-frame-pointer -mtune=corei7 conftest.c >&5 c:/mingw/bin/../lib/gcc/mingw32/4.6.2/../../../libmingw32.a(main.o): In function `main': C:\MinGW\msys\1.0\src\mingwrt/../mingw/main.c:73: undefined reference to `WinMain@16' collect2: ld returned 1 exit status configure:7854: $? = 1 failed program was: int k; int foo () { __builtin_alloca (k); } Test compile: abs int -> double conversion configure:7975: gcc -m32 -O2 -pedantic -fomit-frame-pointer -mtune=corei7 conftest.c >&5 configure:7978: $? = 0 configure:7983: ./a.out || ./b.out || ./a.exe || ./a_out.exe || ./conftest ./configure: line 7984: ./a.out: No such file or directory ./configure: line 7984: ./b.out: No such file or directory configure:7986: $? = 0 Test compile: long long reliability test 1 configure:8040: gcc -m32 -O2 -pedantic -fomit-frame-pointer -mtune=corei7 conftest.c >&5 conftest.c:6:23: warning: ISO C90 does not support 'long long' [-Wlong-long] configure:8043: $? = 0 configure:8048: ./a.out || ./b.out || ./a.exe || ./a_out.exe || ./conftest ./configure: line 8049: ./a.out: No such file or directory ./configure: line 8049: ./b.out: No such file or directory configure:8051: $? = 0 Test compile: long long reliability test 2 configure:8101: gcc -m32 -O2 -pedantic -fomit-frame-pointer -mtune=corei7 conftest.c >&5 conftest.c: In function 'f': conftest.c:7:26: warning: ISO C90 does not support 'long long' [-Wlong-long] configure:8104: $? = 0 configure:8109: ./a.out || ./b.out || ./a.exe || ./a_out.exe || ./conftest ./configure: line 8110: ./a.out: No such file or directory ./configure: line 8110: ./b.out: No such file or directory configure:8112: $? = 0 Test compile: freebsd hacked gcc configure:8162: gcc -m32 -O2 -pedantic -fomit-frame-pointer -mtune=corei7 conftest.c >&5 configure:8165: $? = 0 configure:8170: ./a.out || ./b.out || ./a.exe || ./a_out.exe || ./conftest ./configure: line 8171: ./a.out: No such file or directory ./configure: line 8171: ./b.out: No such file or directory configure:8173: $? = 0 Test compile: mpn_lshift_com optimization configure:8261: gcc -m32 -O2 -pedantic -fomit-frame-pointer -mtune=corei7 conftest.c >&5 configure:8264: $? = 0 configure:8269: ./a.out || ./b.out || ./a.exe || ./a_out.exe || ./conftest ./configure: line 8270: ./a.out: No such file or directory ./configure: line 8270: ./b.out: No such file or directory configure:8272: $? = 0 Test compile: mpn_lshift_com optimization 2 configure:8369: gcc -m32 -O2 -pedantic -fomit-frame-pointer -mtune=corei7 conftest.c >&5 configure:8372: $? = 0 configure:8377: ./a.out || ./b.out || ./a.exe || ./a_out.exe || ./conftest ./configure: line 8378: ./a.out: No such file or directory ./configure: line 8378: ./b.out: No such file or directory configure:8380: $? = 0 configure:8526: result: yes configure:7423: checking compiler gcc -m32 -O2 -pedantic -fomit-frame-pointer -mtune=corei7 -march=sandybridge Test compile: configure:7437: gcc -m32 -O2 -pedantic -fomit-frame-pointer -mtune=corei7 -march=sandybridge conftest.c >&5 conftest.c:1:0: error: bad value (sandybridge) for -march= switch configure:7440: $? = 1 failed program was: int main () { return 0; } configure:8526: result: no configure:7423: checking compiler gcc -m32 -O2 -pedantic -fomit-frame-pointer -mtune=corei7 -march=corei7 Test compile: configure:7437: gcc -m32 -O2 -pedantic -fomit-frame-pointer -mtune=corei7 -march=corei7 conftest.c >&5 configure:7440: $? = 0 configure:7445: ./a.out || ./b.out || ./a.exe || ./a_out.exe || ./conftest ./configure: line 7446: ./a.out: No such file or directory ./configure: line 7446: ./b.out: No such file or directory configure:7448: $? = 0 Test compile: function pointer return configure:7491: gcc -m32 -O2 -pedantic -fomit-frame-pointer -mtune=corei7 -march=corei7 conftest.c >&5 configure:7494: $? = 0 configure:7499: ./a.out || ./b.out || ./a.exe || ./a_out.exe || ./conftest ./configure: line 7500: ./a.out: No such file or directory ./configure: line 7500: ./b.out: No such file or directory configure:7502: $? = 0 Test compile: cmov instruction configure:7547: gcc -m32 -O2 -pedantic -fomit-frame-pointer -mtune=corei7 -march=corei7 conftest.c >&5 configure:7550: $? = 0 configure:7555: ./a.out || ./b.out || ./a.exe || ./a_out.exe || ./conftest ./configure: line 7556: ./a.out: No such file or directory ./configure: line 7556: ./b.out: No such file or directory configure:7558: $? = 0 Test compile: double -> ulong conversion configure:7604: gcc -m32 -O2 -pedantic -fomit-frame-pointer -mtune=corei7 -march=corei7 conftest.c >&5 configure:7607: $? = 0 configure:7612: ./a.out || ./b.out || ./a.exe || ./a_out.exe || ./conftest ./configure: line 7613: ./a.out: No such file or directory ./configure: line 7613: ./b.out: No such file or directory configure:7615: $? = 0 Test compile: double negation configure:7659: gcc -m32 -O2 -pedantic -fomit-frame-pointer -mtune=corei7 -march=corei7 conftest.c >&5 configure:7662: $? = 0 configure:7667: ./a.out || ./b.out || ./a.exe || ./a_out.exe || ./conftest ./configure: line 7668: ./a.out: No such file or directory ./configure: line 7668: ./b.out: No such file or directory configure:7670: $? = 0 Test compile: double -> float conversion configure:7715: gcc -m32 -O2 -pedantic -fomit-frame-pointer -mtune=corei7 -march=corei7 conftest.c >&5 configure:7718: $? = 0 configure:7723: ./a.out || ./b.out || ./a.exe || ./a_out.exe || ./conftest ./configure: line 7724: ./a.out: No such file or directory ./configure: line 7724: ./b.out: No such file or directory configure:7726: $? = 0 Test compile: gnupro alpha ev6 char spilling configure:7800: gcc -m32 -O2 -pedantic -fomit-frame-pointer -mtune=corei7 -march=corei7 conftest.c >&5 configure:7803: $? = 0 configure:7808: ./a.out || ./b.out || ./a.exe || ./a_out.exe || ./conftest ./configure: line 7809: ./a.out: No such file or directory ./configure: line 7809: ./b.out: No such file or directory configure:7811: $? = 0 Test compile: __builtin_alloca availability configure:7851: gcc -m32 -O2 -pedantic -fomit-frame-pointer -mtune=corei7 -march=corei7 conftest.c >&5 c:/mingw/bin/../lib/gcc/mingw32/4.6.2/../../../libmingw32.a(main.o): In function `main': C:\MinGW\msys\1.0\src\mingwrt/../mingw/main.c:73: undefined reference to `WinMain@16' collect2: ld returned 1 exit status configure:7854: $? = 1 failed program was: int k; int foo () { __builtin_alloca (k); } Test compile: abs int -> double conversion configure:7975: gcc -m32 -O2 -pedantic -fomit-frame-pointer -mtune=corei7 -march=corei7 conftest.c >&5 configure:7978: $? = 0 configure:7983: ./a.out || ./b.out || ./a.exe || ./a_out.exe || ./conftest ./configure: line 7984: ./a.out: No such file or directory ./configure: line 7984: ./b.out: No such file or directory configure:7986: $? = 0 Test compile: long long reliability test 1 configure:8040: gcc -m32 -O2 -pedantic -fomit-frame-pointer -mtune=corei7 -march=corei7 conftest.c >&5 conftest.c:6:23: warning: ISO C90 does not support 'long long' [-Wlong-long] configure:8043: $? = 0 configure:8048: ./a.out || ./b.out || ./a.exe || ./a_out.exe || ./conftest ./configure: line 8049: ./a.out: No such file or directory ./configure: line 8049: ./b.out: No such file or directory configure:8051: $? = 0 Test compile: long long reliability test 2 configure:8101: gcc -m32 -O2 -pedantic -fomit-frame-pointer -mtune=corei7 -march=corei7 conftest.c >&5 conftest.c: In function 'f': conftest.c:7:26: warning: ISO C90 does not support 'long long' [-Wlong-long] configure:8104: $? = 0 configure:8109: ./a.out || ./b.out || ./a.exe || ./a_out.exe || ./conftest ./configure: line 8110: ./a.out: No such file or directory ./configure: line 8110: ./b.out: No such file or directory configure:8112: $? = 0 Test compile: freebsd hacked gcc configure:8162: gcc -m32 -O2 -pedantic -fomit-frame-pointer -mtune=corei7 -march=corei7 conftest.c >&5 configure:8165: $? = 0 configure:8170: ./a.out || ./b.out || ./a.exe || ./a_out.exe || ./conftest ./configure: line 8171: ./a.out: No such file or directory ./configure: line 8171: ./b.out: No such file or directory configure:8173: $? = 0 Test compile: mpn_lshift_com optimization configure:8261: gcc -m32 -O2 -pedantic -fomit-frame-pointer -mtune=corei7 -march=corei7 conftest.c >&5 configure:8264: $? = 0 configure:8269: ./a.out || ./b.out || ./a.exe || ./a_out.exe || ./conftest ./configure: line 8270: ./a.out: No such file or directory ./configure: line 8270: ./b.out: No such file or directory configure:8272: $? = 0 Test compile: mpn_lshift_com optimization 2 configure:8369: gcc -m32 -O2 -pedantic -fomit-frame-pointer -mtune=corei7 -march=corei7 conftest.c >&5 configure:8372: $? = 0 configure:8377: ./a.out || ./b.out || ./a.exe || ./a_out.exe || ./conftest ./configure: line 8378: ./a.out: No such file or directory ./configure: line 8378: ./b.out: No such file or directory configure:8380: $? = 0 configure:8526: result: yes configure:7423: checking compiler gcc -m32 -O2 -pedantic -fomit-frame-pointer -mtune=corei7 -march=corei7 -mno-cygwin Test compile: configure:7437: gcc -m32 -O2 -pedantic -fomit-frame-pointer -mtune=corei7 -march=corei7 -mno-cygwin conftest.c >&5 cc1.exe: error: unrecognized command line option '-mno-cygwin' configure:7440: $? = 1 failed program was: int main () { return 0; } configure:8526: result: no configure:8679: checking for gcc configure:8706: result: gcc configure:8935: checking for C compiler version configure:8944: gcc --version >&5 gcc.exe (GCC) 4.6.2 Copyright (C) 2011 Free Software Foundation, Inc. This is free software; see the source for copying conditions. There is NO warranty; not even for MERCHANTABILITY or FITNESS FOR A PARTICULAR PURPOSE. configure:8955: $? = 0 configure:8944: gcc -v >&5 Using built-in specs. COLLECT_GCC=c:\MinGW\bin\gcc.exe COLLECT_LTO_WRAPPER=c:/mingw/bin/../libexec/gcc/mingw32/4.6.2/lto-wrapper.exe Target: mingw32 Configured with: ../gcc-4.6.2/configure --enable-languages=c,c++,ada,fortran,objc,obj-c++ --disable-sjlj-exceptions --with-dwarf2 --enable-shared --enable-libgomp --disable-win32-registry --enable-libstdcxx-debug --enable-version-specific-runtime-libs --build=mingw32 --prefix=/mingw Thread model: win32 gcc version 4.6.2 (GCC) configure:8955: $? = 0 configure:8944: gcc -V >&5 gcc.exe: error: unrecognized option '-V' gcc.exe: fatal error: no input files compilation terminated. configure:8955: $? = 1 configure:8944: gcc -qversion >&5 gcc.exe: error: unrecognized option '-qversion' gcc.exe: fatal error: no input files compilation terminated. configure:8955: $? = 1 configure:8975: checking whether the C compiler works configure:8997: gcc -m32 -O2 -pedantic -fomit-frame-pointer -mtune=corei7 -march=corei7 D:\gmp-6.1.0 conftest.c >&5 c:/mingw/bin/../lib/gcc/mingw32/4.6.2/../../../../mingw32/bin/ld.exe: cannot find D:\gmp-6.1.0: Permission denied collect2: ld returned 1 exit status configure:9001: $? = 1 configure:9039: result: no configure: failed program was: | /* confdefs.h */ | #define PACKAGE_NAME "GNU MP" | #define PACKAGE_TARNAME "gmp" | #define PACKAGE_VERSION "6.1.0" | #define PACKAGE_STRING "GNU MP 6.1.0" | #define PACKAGE_BUGREPORT "gmp-bugs@gmplib.org, see https://gmplib.org/manual/Reporting-Bugs.html" | #define PACKAGE_URL "http://www.gnu.org/software/gmp/" | #define PACKAGE "gmp" | #define VERSION "6.1.0" | #define WANT_ASSEMBLY 1 | #define WANT_FFT 1 | #define HAVE_HOST_CPU_sandybridge 1 | #define HOST_DOS64 1 | #define HAVE_SPEED_CYCLECOUNTER 2 | #define HAVE_CALLING_CONVENTIONS 1 | /* end confdefs.h. */ | | int | main () | { | | ; | return 0; | } configure:9044: error: in `/d/gmp-6.1.0': configure:9046: error: C compiler cannot create executables See `config.log' for more details ## ---------------- ## ## Cache variables. ## ## ---------------- ## ac_cv_build=sandybridge-pc-mingw32 ac_cv_env_ABI_set= ac_cv_env_ABI_value= ac_cv_env_CCC_set= ac_cv_env_CCC_value= ac_cv_env_CC_FOR_BUILD_set= ac_cv_env_CC_FOR_BUILD_value= ac_cv_env_CC_set= ac_cv_env_CC_value= ac_cv_env_CFLAGS_set= ac_cv_env_CFLAGS_value= ac_cv_env_CPPFLAGS_set= ac_cv_env_CPPFLAGS_value= ac_cv_env_CPP_FOR_BUILD_set= ac_cv_env_CPP_FOR_BUILD_value= ac_cv_env_CPP_set= ac_cv_env_CPP_value= ac_cv_env_CXXCPP_set= ac_cv_env_CXXCPP_value= ac_cv_env_CXXFLAGS_set= ac_cv_env_CXXFLAGS_value= ac_cv_env_CXX_set= ac_cv_env_CXX_value= ac_cv_env_LDFLAGS_set=set ac_cv_env_LDFLAGS_value='D:\gmp-6.1.0' ac_cv_env_LIBS_set= ac_cv_env_LIBS_value= ac_cv_env_LT_SYS_LIBRARY_PATH_set= ac_cv_env_LT_SYS_LIBRARY_PATH_value= ac_cv_env_M4_set= ac_cv_env_M4_value= ac_cv_env_YACC_set= ac_cv_env_YACC_value= ac_cv_env_YFLAGS_set= ac_cv_env_YFLAGS_value= ac_cv_env_build_alias_set= ac_cv_env_build_alias_value= ac_cv_env_host_alias_set= ac_cv_env_host_alias_value= ac_cv_env_target_alias_set= ac_cv_env_target_alias_value= ac_cv_host=sandybridge-pc-mingw32 ac_cv_path_install='/bin/install -c' ac_cv_path_mkdir=/bin/mkdir ac_cv_prog_AWK=gawk ac_cv_prog_ac_ct_CC=gcc ac_cv_prog_make_make_set=yes am_cv_make_support_nested_variables=yes ## ----------------- ## ## Output variables. ## ## ----------------- ## ABI='32' ACLOCAL='${SHELL} /d/gmp-6.1.0/missing aclocal-1.15' AMTAR='$${TAR-tar}' AM_BACKSLASH='\' AM_DEFAULT_V='$(AM_DEFAULT_VERBOSITY)' AM_DEFAULT_VERBOSITY='1' AM_V='$(V)' AR='' AS='' ASMFLAGS='' AUTOCONF='${SHELL} /d/gmp-6.1.0/missing autoconf' AUTOHEADER='${SHELL} /d/gmp-6.1.0/missing autoheader' AUTOMAKE='${SHELL} /d/gmp-6.1.0/missing automake-1.15' AWK='gawk' CALLING_CONVENTIONS_OBJS='x86call.lo x86check$U.lo' CC='gcc' CCAS='' CC_FOR_BUILD='' CFLAGS='-m32 -O2 -pedantic -fomit-frame-pointer -mtune=corei7 -march=corei7' CPP='' CPPFLAGS='' CPP_FOR_BUILD='' CXX='' CXXCPP='' CXXFLAGS='' CYGPATH_W='echo' DEFN_LONG_LONG_LIMB='/* #undef _LONG_LONG_LIMB */' DEFS='' DLLTOOL='' DSYMUTIL='' DUMPBIN='' ECHO_C='' ECHO_N='-n' ECHO_T='' EGREP='' ENABLE_STATIC_FALSE='' ENABLE_STATIC_TRUE='' EXEEXT='' EXEEXT_FOR_BUILD='' FGREP='' GMP_LDFLAGS='' GMP_LIMB_BITS='' GMP_NAIL_BITS='0' GREP='' HAVE_CLOCK_01='' HAVE_CPUTIME_01='' HAVE_GETRUSAGE_01='' HAVE_GETTIMEOFDAY_01='' HAVE_HOST_CPU_FAMILY_power='0' HAVE_HOST_CPU_FAMILY_powerpc='0' HAVE_SIGACTION_01='' HAVE_SIGALTSTACK_01='' HAVE_SIGSTACK_01='' HAVE_STACK_T_01='' HAVE_SYS_RESOURCE_H_01='' INSTALL_DATA='${INSTALL} -m 644' INSTALL_PROGRAM='${INSTALL}' INSTALL_SCRIPT='${INSTALL}' INSTALL_STRIP_PROGRAM='$(install_sh) -c -s' LD='' LDFLAGS='D:\gmp-6.1.0' LEX='' LEXLIB='' LEX_OUTPUT_ROOT='' LIBCURSES='' LIBGMPXX_LDFLAGS='' LIBGMP_DLL='' LIBGMP_LDFLAGS='' LIBM='' LIBM_FOR_BUILD='' LIBOBJS='' LIBREADLINE='' LIBS='' LIBTOOL='' LIPO='' LN_S='' LTLIBOBJS='' LT_SYS_LIBRARY_PATH='' M4='' MAINT='#' MAINTAINER_MODE_FALSE='' MAINTAINER_MODE_TRUE='#' MAKEINFO='${SHELL} /d/gmp-6.1.0/missing makeinfo' MANIFEST_TOOL='' MKDIR_P='/bin/mkdir -p' NM='' NMEDIT='' OBJDUMP='' OBJEXT='' OTOOL64='' OTOOL='' PACKAGE='gmp' PACKAGE_BUGREPORT='gmp-bugs@gmplib.org, see https://gmplib.org/manual/Reporting-Bugs.html' PACKAGE_NAME='GNU MP' PACKAGE_STRING='GNU MP 6.1.0' PACKAGE_TARNAME='gmp' PACKAGE_URL='http://www.gnu.org/software/gmp/' PACKAGE_VERSION='6.1.0' PATH_SEPARATOR=':' RANLIB='' SED='' SET_MAKE='' SHELL='/bin/sh' SPEED_CYCLECOUNTER_OBJ='pentium.lo' STRIP='' TAL_OBJECT='' TUNE_LIBS='' TUNE_SQR_OBJ='' U_FOR_BUILD='' VERSION='6.1.0' WANT_CXX_FALSE='' WANT_CXX_TRUE='' WITH_READLINE_01='' YACC='' YFLAGS='' ac_ct_AR='' ac_ct_CC='gcc' ac_ct_CXX='' ac_ct_DUMPBIN='' am__EXEEXT_FALSE='' am__EXEEXT_TRUE='' am__isrc='' am__leading_dot='.' am__tar='$${TAR-tar} chof - "$$tardir"' am__untar='$${TAR-tar} xf -' bindir='${exec_prefix}/bin' build='sandybridge-pc-mingw32' build_alias='' build_cpu='sandybridge' build_os='mingw32' build_vendor='pc' datadir='${datarootdir}' datarootdir='${prefix}/share' docdir='${datarootdir}/doc/${PACKAGE_TARNAME}' dvidir='${docdir}' exec_prefix='NONE' gmp_srclinks='' host='sandybridge-pc-mingw32' host_alias='' host_cpu='sandybridge' host_os='mingw32' host_vendor='pc' htmldir='${docdir}' includedir='${prefix}/include' infodir='${datarootdir}/info' install_sh='${SHELL} /d/gmp-6.1.0/install-sh' libdir='${exec_prefix}/lib' libexecdir='${exec_prefix}/libexec' localedir='${datarootdir}/locale' localstatedir='${prefix}/var' mandir='${datarootdir}/man' mkdir_p='$(MKDIR_P)' mpn_objects='' mpn_objs_in_libgmp='' oldincludedir='/usr/include' pdfdir='${docdir}' prefix='NONE' program_transform_name='s,x,x,' psdir='${docdir}' sbindir='${exec_prefix}/sbin' sharedstatedir='${prefix}/com' sysconfdir='${prefix}/etc' target_alias='' ## ----------- ## ## confdefs.h. ## ## ----------- ## /* confdefs.h */ #define PACKAGE_NAME "GNU MP" #define PACKAGE_TARNAME "gmp" #define PACKAGE_VERSION "6.1.0" #define PACKAGE_STRING "GNU MP 6.1.0" #define PACKAGE_BUGREPORT "gmp-bugs@gmplib.org, see https://gmplib.org/manual/Reporting-Bugs.html" #define PACKAGE_URL "http://www.gnu.org/software/gmp/" #define PACKAGE "gmp" #define VERSION "6.1.0" #define WANT_ASSEMBLY 1 #define WANT_FFT 1 #define HAVE_HOST_CPU_sandybridge 1 #define HOST_DOS64 1 #define HAVE_SPEED_CYCLECOUNTER 2 #define HAVE_CALLING_CONVENTIONS 1 configure: exit 77
ubuntu18.04 python3.6 pip安装mysqlclient报错
ubuntu18.04 python3.6 pip安装mysqlclient报错 求大佬解答 ``` Building wheels for collected packages: mysqlclient Running setup.py bdist_wheel for mysqlclient ... error Complete output from command /usr/bin/python3 -u -c "import setuptools, tokenize;__file__='/tmp/pip-build-njxuuzpo/mysqlclient/setup.py';f=getattr(tokenize, 'open', open)(__file__);code=f.read().replace('\r\n', '\n');f.close();exec(compile(code, __file__, 'exec'))" bdist_wheel -d /tmp/tmpzs54ny_2pip-wheel- --python-tag cp36: running bdist_wheel running build running build_py creating build creating build/lib.linux-x86_64-3.6 creating build/lib.linux-x86_64-3.6/MySQLdb copying MySQLdb/__init__.py -> build/lib.linux-x86_64-3.6/MySQLdb copying MySQLdb/_exceptions.py -> build/lib.linux-x86_64-3.6/MySQLdb copying MySQLdb/compat.py -> build/lib.linux-x86_64-3.6/MySQLdb copying MySQLdb/connections.py -> build/lib.linux-x86_64-3.6/MySQLdb copying MySQLdb/converters.py -> build/lib.linux-x86_64-3.6/MySQLdb copying MySQLdb/cursors.py -> build/lib.linux-x86_64-3.6/MySQLdb copying MySQLdb/release.py -> build/lib.linux-x86_64-3.6/MySQLdb copying MySQLdb/times.py -> build/lib.linux-x86_64-3.6/MySQLdb creating build/lib.linux-x86_64-3.6/MySQLdb/constants copying MySQLdb/constants/__init__.py -> build/lib.linux-x86_64-3.6/MySQLdb/constants copying MySQLdb/constants/CLIENT.py -> build/lib.linux-x86_64-3.6/MySQLdb/constants copying MySQLdb/constants/CR.py -> build/lib.linux-x86_64-3.6/MySQLdb/constants copying MySQLdb/constants/ER.py -> build/lib.linux-x86_64-3.6/MySQLdb/constants copying MySQLdb/constants/FIELD_TYPE.py -> build/lib.linux-x86_64-3.6/MySQLdb/constants copying MySQLdb/constants/FLAG.py -> build/lib.linux-x86_64-3.6/MySQLdb/constants running build_ext building 'MySQLdb._mysql' extension creating build/temp.linux-x86_64-3.6 creating build/temp.linux-x86_64-3.6/MySQLdb x86_64-linux-gnu-gcc -pthread -DNDEBUG -g -fwrapv -O2 -Wall -g -fstack-protector-strong -Wformat -Werror=format-security -Wdate-time -D_FORTIFY_SOURCE=2 -fPIC -Dversion_info=(1,4,5,'final',0) -D__version__=1.4.5 -I/usr/include/mysql -I/usr/include/python3.6m -c MySQLdb/_mysql.c -o build/temp.linux-x86_64-3.6/MySQLdb/_mysql.o x86_64-linux-gnu-gcc -pthread -shared -Wl,-O1 -Wl,-Bsymbolic-functions -Wl,-Bsymbolic-functions -Wl,-z,relro -Wl,-Bsymbolic-functions -Wl,-z,relro -g -fstack-protector-strong -Wformat -Werror=format-security -Wdate-time -D_FORTIFY_SOURCE=2 build/temp.linux-x86_64-3.6/MySQLdb/_mysql.o -lmysqlclient -lpthread -lz -lm -lrt -latomic -lssl -lcrypto -ldl -o build/lib.linux-x86_64-3.6/MySQLdb/_mysql.cpython-36m-x86_64-linux-gnu.so /usr/bin/ld: cannot find -lssl /usr/bin/ld: cannot find -lcrypto collect2: error: ld returned 1 exit status error: command 'x86_64-linux-gnu-gcc' failed with exit status 1 ---------------------------------------- Failed building wheel for mysqlclient Running setup.py clean for mysqlclient Failed to build mysqlclient Installing collected packages: mysqlclient Running setup.py install for mysqlclient ... error Complete output from command /usr/bin/python3 -u -c "import setuptools, tokenize;__file__='/tmp/pip-build-njxuuzpo/mysqlclient/setup.py';f=getattr(tokenize, 'open', open)(__file__);code=f.read().replace('\r\n', '\n');f.close();exec(compile(code, __file__, 'exec'))" install --record /tmp/pip-ldoqhl56-record/install-record.txt --single-version-externally-managed --compile --user --prefix=: running install running build running build_py creating build creating build/lib.linux-x86_64-3.6 creating build/lib.linux-x86_64-3.6/MySQLdb copying MySQLdb/__init__.py -> build/lib.linux-x86_64-3.6/MySQLdb copying MySQLdb/_exceptions.py -> build/lib.linux-x86_64-3.6/MySQLdb copying MySQLdb/compat.py -> build/lib.linux-x86_64-3.6/MySQLdb copying MySQLdb/connections.py -> build/lib.linux-x86_64-3.6/MySQLdb copying MySQLdb/converters.py -> build/lib.linux-x86_64-3.6/MySQLdb copying MySQLdb/cursors.py -> build/lib.linux-x86_64-3.6/MySQLdb copying MySQLdb/release.py -> build/lib.linux-x86_64-3.6/MySQLdb copying MySQLdb/times.py -> build/lib.linux-x86_64-3.6/MySQLdb creating build/lib.linux-x86_64-3.6/MySQLdb/constants copying MySQLdb/constants/__init__.py -> build/lib.linux-x86_64-3.6/MySQLdb/constants copying MySQLdb/constants/CLIENT.py -> build/lib.linux-x86_64-3.6/MySQLdb/constants copying MySQLdb/constants/CR.py -> build/lib.linux-x86_64-3.6/MySQLdb/constants copying MySQLdb/constants/ER.py -> build/lib.linux-x86_64-3.6/MySQLdb/constants copying MySQLdb/constants/FIELD_TYPE.py -> build/lib.linux-x86_64-3.6/MySQLdb/constants copying MySQLdb/constants/FLAG.py -> build/lib.linux-x86_64-3.6/MySQLdb/constants running build_ext building 'MySQLdb._mysql' extension creating build/temp.linux-x86_64-3.6 creating build/temp.linux-x86_64-3.6/MySQLdb x86_64-linux-gnu-gcc -pthread -DNDEBUG -g -fwrapv -O2 -Wall -g -fstack-protector-strong -Wformat -Werror=format-security -Wdate-time -D_FORTIFY_SOURCE=2 -fPIC -Dversion_info=(1,4,5,'final',0) -D__version__=1.4.5 -I/usr/include/mysql -I/usr/include/python3.6m -c MySQLdb/_mysql.c -o build/temp.linux-x86_64-3.6/MySQLdb/_mysql.o x86_64-linux-gnu-gcc -pthread -shared -Wl,-O1 -Wl,-Bsymbolic-functions -Wl,-Bsymbolic-functions -Wl,-z,relro -Wl,-Bsymbolic-functions -Wl,-z,relro -g -fstack-protector-strong -Wformat -Werror=format-security -Wdate-time -D_FORTIFY_SOURCE=2 build/temp.linux-x86_64-3.6/MySQLdb/_mysql.o -lmysqlclient -lpthread -lz -lm -lrt -latomic -lssl -lcrypto -ldl -o build/lib.linux-x86_64-3.6/MySQLdb/_mysql.cpython-36m-x86_64-linux-gnu.so /usr/bin/ld: cannot find -lssl /usr/bin/ld: cannot find -lcrypto collect2: error: ld returned 1 exit status error: command 'x86_64-linux-gnu-gcc' failed with exit status 1 ---------------------------------------- Command "/usr/bin/python3 -u -c "import setuptools, tokenize;__file__='/tmp/pip-build-njxuuzpo/mysqlclient/setup.py';f=getattr(tokenize, 'open', open)(__file__);code=f.read().replace('\r\n', '\n');f.close();exec(compile(code, __file__, 'exec'))" install --record /tmp/pip-ldoqhl56-record/install-record.txt --single-version-externally-managed --compile --user --prefix=" failed with error code 1 in /tmp/pip-build-njxuuzpo/mysqlclient/ ```
用msys编译GMP、PBC库是出现错误,求万能的大神帮忙解决!
用msys编译GMP、PBC库是出现如下错误,求万能的大神帮忙解决! ![图片说明](https://img-ask.csdn.net/upload/201512/14/1450093275_306813.jpg) ![图片说明](https://img-ask.csdn.net/upload/201512/15/1450154311_902355.jpg) Config.log如下: This file contains any messages produced by compilers while running configure, to aid debugging if configure makes a mistake. It was created by GNU MP configure 6.1.0, which was generated by GNU Autoconf 2.69. Invocation command line was $ ./configure CPPGLAGS=-D_USE_MINGW_ANSI_STDIO=0--enable-static --disable-shared --------- Platform. ## --------- hostname = Mr-Chen uname -m = i686 uname -r = 1.0.17(0.48/3/2) uname -s = MINGW32_NT-6.1 uname -v = 2011-04-24 23:39 /usr/bin/ uname -p = unknown /bin/ uname -X = unknown /bin/arch = unknown /usr/bin/arch -k = unknown /usr/convex/getsysinfo = unknown /usr/bin/hostinfo = unknown /bin/machine = unknown /usr/bin/oslevel = unknown /bin/universe = unknown PATH: . PATH: /usr/local/bin PATH: /mingw/bin PATH: /bin PATH: /d/ActivePerl/site/bin PATH: /d/ActivePerl/bin PATH: /c/Program Files (x86)/NVIDIA Corporation/PhysX/Common PATH: /c/Windows/system32 PATH: /c/Windows PATH: /c/Windows/System32/Wbem PATH: /c/Windows/System32/WindowsPowerShell/v1.0/ PATH: %QUARTUS_ROOTDIR%/bin PATH: /c/Program Files (x86)/Common Files/Ulead Systems/MPEG PATH: /c/Program Files (x86)/Microsoft SQL Server/80/Tools/Binn/ PATH: /d/Latex/CTEX/UserData/miktex/bin PATH: /d/Latex/CTEX/MiKTeX/miktex/bin PATH: /d/Latex/CTEX/CTeX/ctex/bin PATH: /d/Latex/CTEX/CTeX/cct/bin PATH: /d/Latex/CTEX/CTeX/ty/bin PATH: /d/Latex/CTEX/Ghostscript/gs9.05/bin PATH: /d/Latex/CTEX/GSview/gsview PATH: /d/Latex/CTEX/WinEdt PATH: /c/Program Files/Microsoft SQL Server/110/Tools/Binn/ PATH: /c/MinGW/bin/ PATH: /d/ActivePerl/site/bin/ PATH: /d/ActivePerl/bin/ PATH: /c/Program Files (x86)/Microsoft SQL Server/100/Tools/Binn/ PATH: /c/Program Files/Microsoft SQL Server/100/Tools/Binn/ PATH: /c/Program Files/Microsoft SQL Server/100/DTS/Binn/ PATH: /d/VS2010/VC/bin/ PATH: /d/MinGw/bin ----------- Core tests. ----------- configure:3055: checking build system type configure:3069: result: sandybridge-pc-mingw32 configure:3089: checking host system type configure:3102: result: sandybridge-pc-mingw32 configure:3139: checking for a BSD-compatible install configure:3207: result: /bin/install -c configure:3218: checking whether build environment is sane configure:3273: result: yes configure:3424: checking for a thread-safe mkdir -p configure:3463: result: /bin/mkdir -p configure:3470: checking for gawk configure:3486: found /bin/gawk configure:3497: result: gawk configure:3508: checking whether make sets $(MAKE) configure:3530: result: yes configure:3559: checking whether make supports nested variables configure:3576: result: yes configure:3705: checking whether to enable maintainer-specific portions of Makefiles configure:3714: result: no User: ABI= CC= CFLAGS=(unset) CPPFLAGS=(unset) MPN_PATH= GMP: abilist=64 x32 32 cclist=gcc icc cc configure:5749: gcc 2>&1 | grep xlc >/dev/null configure:5752: $? = 1 configure:5806: checking compiler gcc -O2 -pedantic -fomit-frame-pointer -m64 Test compile: configure:5820: gcc -O2 -pedantic -fomit-frame-pointer -m64 conftest.c >&5 conftest.c:1:0: sorry, unimplemented: 64-bit mode not compiled in configure:5823: $? = 1 failed program was: int main () { return 0; } configure:6909: result: no configure:5727: cc -c conftest.c >&5 configure:5730: $? = 0 configure:5733: checking whether cc is gcc configure:5735: result: yes configure:5749: cc 2>&1 | grep xlc >/dev/null configure:5752: $? = 1 configure:5806: checking compiler cc -O2 -pedantic -fomit-frame-pointer -m64 Test compile: configure:5820: cc -O2 -pedantic -fomit-frame-pointer -m64 conftest.c >&5 conftest.c:1:0: sorry, unimplemented: 64-bit mode not compiled in configure:5823: $? = 1 failed program was: int main () { return 0; } configure:6909: result: no configure:5749: gcc 2>&1 | grep xlc >/dev/null configure:5752: $? = 1 configure:5806: checking compiler gcc -O2 -pedantic -fomit-frame-pointer -mx32 Test compile: configure:5820: gcc -O2 -pedantic -fomit-frame-pointer -mx32 conftest.c >&5 cc1.exe: error: unrecognized command line option '-mx32' configure:5823: $? = 1 failed program was: int main () { return 0; } configure:6909: result: no configure:5727: cc -c conftest.c >&5 configure:5730: $? = 0 configure:5733: checking whether cc is gcc configure:5735: result: yes configure:5749: cc 2>&1 | grep xlc >/dev/null configure:5752: $? = 1 configure:5806: checking compiler cc -O2 -pedantic -fomit-frame-pointer -mx32 Test compile: configure:5820: cc -O2 -pedantic -fomit-frame-pointer -mx32 conftest.c >&5 cc1.exe: error: unrecognized command line option '-mx32' configure:5823: $? = 1 failed program was: int main () { return 0; } configure:6909: result: no configure:5749: gcc 2>&1 | grep xlc >/dev/null configure:5752: $? = 1 configure:5806: checking compiler gcc -m32 -O2 -pedantic -fomit-frame-pointer Test compile: configure:5820: gcc -m32 -O2 -pedantic -fomit-frame-pointer conftest.c >&5 configure:5823: $? = 0 configure:5828: ./a.out || ./b.out || ./a.exe || ./a_out.exe || ./conftest ./configure: line 5829: ./a.out: No such file or directory ./configure: line 5829: ./b.out: No such file or directory configure:5831: $? = 0 Test compile: function pointer return configure:5874: gcc -m32 -O2 -pedantic -fomit-frame-pointer conftest.c >&5 configure:5877: $? = 0 configure:5882: ./a.out || ./b.out || ./a.exe || ./a_out.exe || ./conftest ./configure: line 5883: ./a.out: No such file or directory ./configure: line 5883: ./b.out: No such file or directory configure:5885: $? = 0 Test compile: cmov instruction configure:5930: gcc -m32 -O2 -pedantic -fomit-frame-pointer conftest.c >&5 configure:5933: $? = 0 configure:5938: ./a.out || ./b.out || ./a.exe || ./a_out.exe || ./conftest ./configure: line 5939: ./a.out: No such file or directory ./configure: line 5939: ./b.out: No such file or directory configure:5941: $? = 0 Test compile: double -> ulong conversion configure:5987: gcc -m32 -O2 -pedantic -fomit-frame-pointer conftest.c >&5 configure:5990: $? = 0 configure:5995: ./a.out || ./b.out || ./a.exe || ./a_out.exe || ./conftest ./configure: line 5996: ./a.out: No such file or directory ./configure: line 5996: ./b.out: No such file or directory configure:5998: $? = 0 Test compile: double negation configure:6042: gcc -m32 -O2 -pedantic -fomit-frame-pointer conftest.c >&5 configure:6045: $? = 0 configure:6050: ./a.out || ./b.out || ./a.exe || ./a_out.exe || ./conftest ./configure: line 6051: ./a.out: No such file or directory ./configure: line 6051: ./b.out: No such file or directory configure:6053: $? = 0 Test compile: double -> float conversion configure:6098: gcc -m32 -O2 -pedantic -fomit-frame-pointer conftest.c >&5 configure:6101: $? = 0 configure:6106: ./a.out || ./b.out || ./a.exe || ./a_out.exe || ./conftest ./configure: line 6107: ./a.out: No such file or directory ./configure: line 6107: ./b.out: No such file or directory configure:6109: $? = 0 Test compile: gnupro alpha ev6 char spilling configure:6183: gcc -m32 -O2 -pedantic -fomit-frame-pointer conftest.c >&5 configure:6186: $? = 0 configure:6191: ./a.out || ./b.out || ./a.exe || ./a_out.exe || ./conftest ./configure: line 6192: ./a.out: No such file or directory ./configure: line 6192: ./b.out: No such file or directory configure:6194: $? = 0 Test compile: __builtin_alloca availability configure:6234: gcc -m32 -O2 -pedantic -fomit-frame-pointer conftest.c >&5 c:/mingw/bin/../lib/gcc/mingw32/4.6.2/../../../libmingw32.a(main.o): In function main': C:\MinGW\msys\1.0\src\mingwrt/../mingw/main.c:73: undefined reference toWinMain@16' collect2: ld returned 1 exit status configure:6237: $? = 1 failed program was: int k; int foo () { __builtin_alloca (k); } Test compile: abs int -> double conversion configure:6358: gcc -m32 -O2 -pedantic -fomit-frame-pointer conftest.c >&5 configure:6361: $? = 0 configure:6366: ./a.out || ./b.out || ./a.exe || ./a_out.exe || ./conftest ./configure: line 6367: ./a.out: No such file or directory ./configure: line 6367: ./b.out: No such file or directory configure:6369: $? = 0 Test compile: long long reliability test 1 configure:6423: gcc -m32 -O2 -pedantic -fomit-frame-pointer conftest.c >&5 conftest.c:6:23: warning: ISO C90 does not support 'long long' [-Wlong-long] configure:6426: $? = 0 configure:6431: ./a.out || ./b.out || ./a.exe || ./a_out.exe || ./conftest ./configure: line 6432: ./a.out: No such file or directory ./configure: line 6432: ./b.out: No such file or directory configure:6434: $? = 0 Test compile: long long reliability test 2 configure:6484: gcc -m32 -O2 -pedantic -fomit-frame-pointer conftest.c >&5 conftest.c: In function 'f': conftest.c:7:26: warning: ISO C90 does not support 'long long' [-Wlong-long] configure:6487: $? = 0 configure:6492: ./a.out || ./b.out || ./a.exe || ./a_out.exe || ./conftest ./configure: line 6493: ./a.out: No such file or directory ./configure: line 6493: ./b.out: No such file or directory configure:6495: $? = 0 Test compile: freebsd hacked gcc configure:6545: gcc -m32 -O2 -pedantic -fomit-frame-pointer conftest.c >&5 configure:6548: $? = 0 configure:6553: ./a.out || ./b.out || ./a.exe || ./a_out.exe || ./conftest ./configure: line 6554: ./a.out: No such file or directory ./configure: line 6554: ./b.out: No such file or directory configure:6556: $? = 0 Test compile: mpn_lshift_com optimization configure:6644: gcc -m32 -O2 -pedantic -fomit-frame-pointer conftest.c >&5 configure:6647: $? = 0 configure:6652: ./a.out || ./b.out || ./a.exe || ./a_out.exe || ./conftest ./configure: line 6653: ./a.out: No such file or directory ./configure: line 6653: ./b.out: No such file or directory configure:6655: $? = 0 Test compile: mpn_lshift_com optimization 2 configure:6752: gcc -m32 -O2 -pedantic -fomit-frame-pointer conftest.c >&5 configure:6755: $? = 0 configure:6760: ./a.out || ./b.out || ./a.exe || ./a_out.exe || ./conftest ./configure: line 6761: ./a.out: No such file or directory ./configure: line 6761: ./b.out: No such file or directory configure:6763: $? = 0 configure:6909: result: yes configure: testlist sizeof-long-4 configure:7084: checking compiler gcc -m32 -O2 -pedantic -fomit-frame-pointer has sizeof(long)==4 configure:7097: gcc -m32 -O2 -pedantic -fomit-frame-pointer -c conftest.c >&5 configure:7100: $? = 0 configure:7105: result: yes configure:7423: checking compiler gcc -m32 -O2 -pedantic -fomit-frame-pointer -mtune=sandybridge Test compile: configure:7437: gcc -m32 -O2 -pedantic -fomit-frame-pointer -mtune=sandybridge conftest.c >&5 conftest.c:1:0: error: bad value (sandybridge) for -mtune= switch configure:7440: $? = 1 failed program was: int main () { return 0; } configure:8526: result: no configure:7423: checking compiler gcc -m32 -O2 -pedantic -fomit-frame-pointer -mtune=corei7 Test compile: configure:7437: gcc -m32 -O2 -pedantic -fomit-frame-pointer -mtune=corei7 conftest.c >&5 configure:7440: $? = 0 configure:7445: ./a.out || ./b.out || ./a.exe || ./a_out.exe || ./conftest ./configure: line 7446: ./a.out: No such file or directory ./configure: line 7446: ./b.out: No such file or directory configure:7448: $? = 0 Test compile: function pointer return configure:7491: gcc -m32 -O2 -pedantic -fomit-frame-pointer -mtune=corei7 conftest.c >&5 configure:7494: $? = 0 configure:7499: ./a.out || ./b.out || ./a.exe || ./a_out.exe || ./conftest ./configure: line 7500: ./a.out: No such file or directory ./configure: line 7500: ./b.out: No such file or directory configure:7502: $? = 0 Test compile: cmov instruction configure:7547: gcc -m32 -O2 -pedantic -fomit-frame-pointer -mtune=corei7 conftest.c >&5 configure:7550: $? = 0 configure:7555: ./a.out || ./b.out || ./a.exe || ./a_out.exe || ./conftest ./configure: line 7556: ./a.out: No such file or directory ./configure: line 7556: ./b.out: No such file or directory configure:7558: $? = 0 Test compile: double -> ulong conversion configure:7604: gcc -m32 -O2 -pedantic -fomit-frame-pointer -mtune=corei7 conftest.c >&5 configure:7607: $? = 0 configure:7612: ./a.out || ./b.out || ./a.exe || ./a_out.exe || ./conftest ./configure: line 7613: ./a.out: No such file or directory ./configure: line 7613: ./b.out: No such file or directory configure:7615: $? = 0 Test compile: double negation configure:7659: gcc -m32 -O2 -pedantic -fomit-frame-pointer -mtune=corei7 conftest.c >&5 configure:7662: $? = 0 configure:7667: ./a.out || ./b.out || ./a.exe || ./a_out.exe || ./conftest ./configure: line 7668: ./a.out: No such file or directory ./configure: line 7668: ./b.out: No such file or directory configure:7670: $? = 0 Test compile: double -> float conversion configure:7715: gcc -m32 -O2 -pedantic -fomit-frame-pointer -mtune=corei7 conftest.c >&5 configure:7718: $? = 0 configure:7723: ./a.out || ./b.out || ./a.exe || ./a_out.exe || ./conftest ./configure: line 7724: ./a.out: No such file or directory ./configure: line 7724: ./b.out: No such file or directory configure:7726: $? = 0 Test compile: gnupro alpha ev6 char spilling configure:7800: gcc -m32 -O2 -pedantic -fomit-frame-pointer -mtune=corei7 conftest.c >&5 configure:7803: $? = 0 configure:7808: ./a.out || ./b.out || ./a.exe || ./a_out.exe || ./conftest ./configure: line 7809: ./a.out: No such file or directory ./configure: line 7809: ./b.out: No such file or directory configure:7811: $? = 0 Test compile: __builtin_alloca availability configure:7851: gcc -m32 -O2 -pedantic -fomit-frame-pointer -mtune=corei7 conftest.c >&5 c:/mingw/bin/../lib/gcc/mingw32/4.6.2/../../../libmingw32.a(main.o): In function main': C:\MinGW\msys\1.0\src\mingwrt/../mingw/main.c:73: undefined reference toWinMain@16' collect2: ld returned 1 exit status configure:7854: $? = 1 failed program was: int k; int foo () { __builtin_alloca (k); } Test compile: abs int -> double conversion configure:7975: gcc -m32 -O2 -pedantic -fomit-frame-pointer -mtune=corei7 conftest.c >&5 configure:7978: $? = 0 configure:7983: ./a.out || ./b.out || ./a.exe || ./a_out.exe || ./conftest ./configure: line 7984: ./a.out: No such file or directory ./configure: line 7984: ./b.out: No such file or directory configure:7986: $? = 0 Test compile: long long reliability test 1 configure:8040: gcc -m32 -O2 -pedantic -fomit-frame-pointer -mtune=corei7 conftest.c >&5 conftest.c:6:23: warning: ISO C90 does not support 'long long' [-Wlong-long] configure:8043: $? = 0 configure:8048: ./a.out || ./b.out || ./a.exe || ./a_out.exe || ./conftest ./configure: line 8049: ./a.out: No such file or directory ./configure: line 8049: ./b.out: No such file or directory configure:8051: $? = 0 Test compile: long long reliability test 2 configure:8101: gcc -m32 -O2 -pedantic -fomit-frame-pointer -mtune=corei7 conftest.c >&5 conftest.c: In function 'f': conftest.c:7:26: warning: ISO C90 does not support 'long long' [-Wlong-long] configure:8104: $? = 0 configure:8109: ./a.out || ./b.out || ./a.exe || ./a_out.exe || ./conftest ./configure: line 8110: ./a.out: No such file or directory ./configure: line 8110: ./b.out: No such file or directory configure:8112: $? = 0 Test compile: freebsd hacked gcc configure:8162: gcc -m32 -O2 -pedantic -fomit-frame-pointer -mtune=corei7 conftest.c >&5 configure:8165: $? = 0 configure:8170: ./a.out || ./b.out || ./a.exe || ./a_out.exe || ./conftest ./configure: line 8171: ./a.out: No such file or directory ./configure: line 8171: ./b.out: No such file or directory configure:8173: $? = 0 Test compile: mpn_lshift_com optimization configure:8261: gcc -m32 -O2 -pedantic -fomit-frame-pointer -mtune=corei7 conftest.c >&5 configure:8264: $? = 0 configure:8269: ./a.out || ./b.out || ./a.exe || ./a_out.exe || ./conftest ./configure: line 8270: ./a.out: No such file or directory ./configure: line 8270: ./b.out: No such file or directory configure:8272: $? = 0 Test compile: mpn_lshift_com optimization 2 configure:8369: gcc -m32 -O2 -pedantic -fomit-frame-pointer -mtune=corei7 conftest.c >&5 configure:8372: $? = 0 configure:8377: ./a.out || ./b.out || ./a.exe || ./a_out.exe || ./conftest ./configure: line 8378: ./a.out: No such file or directory ./configure: line 8378: ./b.out: No such file or directory configure:8380: $? = 0 configure:8526: result: yes configure:7423: checking compiler gcc -m32 -O2 -pedantic -fomit-frame-pointer -mtune=corei7 -march=sandybridge Test compile: configure:7437: gcc -m32 -O2 -pedantic -fomit-frame-pointer -mtune=corei7 -march=sandybridge conftest.c >&5 conftest.c:1:0: error: bad value (sandybridge) for -march= switch configure:7440: $? = 1 failed program was: int main () { return 0; } configure:8526: result: no configure:7423: checking compiler gcc -m32 -O2 -pedantic -fomit-frame-pointer -mtune=corei7 -march=corei7 Test compile: configure:7437: gcc -m32 -O2 -pedantic -fomit-frame-pointer -mtune=corei7 -march=corei7 conftest.c >&5 configure:7440: $? = 0 configure:7445: ./a.out || ./b.out || ./a.exe || ./a_out.exe || ./conftest ./configure: line 7446: ./a.out: No such file or directory ./configure: line 7446: ./b.out: No such file or directory configure:7448: $? = 0 Test compile: function pointer return configure:7491: gcc -m32 -O2 -pedantic -fomit-frame-pointer -mtune=corei7 -march=corei7 conftest.c >&5 configure:7494: $? = 0 configure:7499: ./a.out || ./b.out || ./a.exe || ./a_out.exe || ./conftest ./configure: line 7500: ./a.out: No such file or directory ./configure: line 7500: ./b.out: No such file or directory configure:7502: $? = 0 Test compile: cmov instruction configure:7547: gcc -m32 -O2 -pedantic -fomit-frame-pointer -mtune=corei7 -march=corei7 conftest.c >&5 configure:7550: $? = 0 configure:7555: ./a.out || ./b.out || ./a.exe || ./a_out.exe || ./conftest ./configure: line 7556: ./a.out: No such file or directory ./configure: line 7556: ./b.out: No such file or directory configure:7558: $? = 0 Test compile: double -> ulong conversion configure:7604: gcc -m32 -O2 -pedantic -fomit-frame-pointer -mtune=corei7 -march=corei7 conftest.c >&5 configure:7607: $? = 0 configure:7612: ./a.out || ./b.out || ./a.exe || ./a_out.exe || ./conftest ./configure: line 7613: ./a.out: No such file or directory ./configure: line 7613: ./b.out: No such file or directory configure:7615: $? = 0 Test compile: double negation configure:7659: gcc -m32 -O2 -pedantic -fomit-frame-pointer -mtune=corei7 -march=corei7 conftest.c >&5 configure:7662: $? = 0 configure:7667: ./a.out || ./b.out || ./a.exe || ./a_out.exe || ./conftest ./configure: line 7668: ./a.out: No such file or directory ./configure: line 7668: ./b.out: No such file or directory configure:7670: $? = 0 Test compile: double -> float conversion configure:7715: gcc -m32 -O2 -pedantic -fomit-frame-pointer -mtune=corei7 -march=corei7 conftest.c >&5 configure:7718: $? = 0 configure:7723: ./a.out || ./b.out || ./a.exe || ./a_out.exe || ./conftest ./configure: line 7724: ./a.out: No such file or directory ./configure: line 7724: ./b.out: No such file or directory configure:7726: $? = 0 Test compile: gnupro alpha ev6 char spilling configure:7800: gcc -m32 -O2 -pedantic -fomit-frame-pointer -mtune=corei7 -march=corei7 conftest.c >&5 configure:7803: $? = 0 configure:7808: ./a.out || ./b.out || ./a.exe || ./a_out.exe || ./conftest ./configure: line 7809: ./a.out: No such file or directory ./configure: line 7809: ./b.out: No such file or directory configure:7811: $? = 0 Test compile: __builtin_alloca availability configure:7851: gcc -m32 -O2 -pedantic -fomit-frame-pointer -mtune=corei7 -march=corei7 conftest.c >&5 c:/mingw/bin/../lib/gcc/mingw32/4.6.2/../../../libmingw32.a(main.o): In function main': C:\MinGW\msys\1.0\src\mingwrt/../mingw/main.c:73: undefined reference toWinMain@16' collect2: ld returned 1 exit status configure:7854: $? = 1 failed program was: int k; int foo () { __builtin_alloca (k); } Test compile: abs int -> double conversion configure:7975: gcc -m32 -O2 -pedantic -fomit-frame-pointer -mtune=corei7 -march=corei7 conftest.c >&5 configure:7978: $? = 0 configure:7983: ./a.out || ./b.out || ./a.exe || ./a_out.exe || ./conftest ./configure: line 7984: ./a.out: No such file or directory ./configure: line 7984: ./b.out: No such file or directory configure:7986: $? = 0 Test compile: long long reliability test 1 configure:8040: gcc -m32 -O2 -pedantic -fomit-frame-pointer -mtune=corei7 -march=corei7 conftest.c >&5 conftest.c:6:23: warning: ISO C90 does not support 'long long' [-Wlong-long] configure:8043: $? = 0 configure:8048: ./a.out || ./b.out || ./a.exe || ./a_out.exe || ./conftest ./configure: line 8049: ./a.out: No such file or directory ./configure: line 8049: ./b.out: No such file or directory configure:8051: $? = 0 Test compile: long long reliability test 2 configure:8101: gcc -m32 -O2 -pedantic -fomit-frame-pointer -mtune=corei7 -march=corei7 conftest.c >&5 conftest.c: In function 'f': conftest.c:7:26: warning: ISO C90 does not support 'long long' [-Wlong-long] configure:8104: $? = 0 configure:8109: ./a.out || ./b.out || ./a.exe || ./a_out.exe || ./conftest ./configure: line 8110: ./a.out: No such file or directory ./configure: line 8110: ./b.out: No such file or directory configure:8112: $? = 0 Test compile: freebsd hacked gcc configure:8162: gcc -m32 -O2 -pedantic -fomit-frame-pointer -mtune=corei7 -march=corei7 conftest.c >&5 configure:8165: $? = 0 configure:8170: ./a.out || ./b.out || ./a.exe || ./a_out.exe || ./conftest ./configure: line 8171: ./a.out: No such file or directory ./configure: line 8171: ./b.out: No such file or directory configure:8173: $? = 0 Test compile: mpn_lshift_com optimization configure:8261: gcc -m32 -O2 -pedantic -fomit-frame-pointer -mtune=corei7 -march=corei7 conftest.c >&5 configure:8264: $? = 0 configure:8269: ./a.out || ./b.out || ./a.exe || ./a_out.exe || ./conftest ./configure: line 8270: ./a.out: No such file or directory ./configure: line 8270: ./b.out: No such file or directory configure:8272: $? = 0 Test compile: mpn_lshift_com optimization 2 configure:8369: gcc -m32 -O2 -pedantic -fomit-frame-pointer -mtune=corei7 -march=corei7 conftest.c >&5 configure:8372: $? = 0 configure:8377: ./a.out || ./b.out || ./a.exe || ./a_out.exe || ./conftest ./configure: line 8378: ./a.out: No such file or directory ./configure: line 8378: ./b.out: No such file or directory configure:8380: $? = 0 configure:8526: result: yes configure:7423: checking compiler gcc -m32 -O2 -pedantic -fomit-frame-pointer -mtune=corei7 -march=corei7 -mno-cygwin Test compile: configure:7437: gcc -m32 -O2 -pedantic -fomit-frame-pointer -mtune=corei7 -march=corei7 -mno-cygwin conftest.c >&5 cc1.exe: error: unrecognized command line option '-mno-cygwin' configure:7440: $? = 1 failed program was: int main () { return 0; } configure:8526: result: no configure:8679: checking for gcc configure:8706: result: gcc configure:8935: checking for C compiler version configure:8944: gcc --version >&5 gcc.exe (GCC) 4.6.2 Copyright (C) 2011 Free Software Foundation, Inc. This is free software; see the source for copying conditions. There is NO warranty; not even for MERCHANTABILITY or FITNESS FOR A PARTICULAR PURPOSE. configure:8955: $? = 0 configure:8944: gcc -v >&5 Using built-in specs. COLLECT_GCC=c:\MinGW\bin\gcc.exe COLLECT_LTO_WRAPPER=c:/mingw/bin/../libexec/gcc/mingw32/4.6.2/lto-wrapper.exe Target: mingw32 Configured with: ../gcc-4.6.2/configure --enable-languages=c,c++,ada,fortran,objc,obj-c++ --disable-sjlj-exceptions --with-dwarf2 --enable-shared --enable-libgomp --disable-win32-registry --enable-libstdcxx-debug --enable-version-specific-runtime-libs --build=mingw32 --prefix=/mingw Thread model: win32 gcc version 4.6.2 (GCC) configure:8955: $? = 0 configure:8944: gcc -V >&5 gcc.exe: error: unrecognized option '-V' gcc.exe: fatal error: no input files compilation terminated. configure:8955: $? = 1 configure:8944: gcc -qversion >&5 gcc.exe: error: unrecognized option '-qversion' gcc.exe: fatal error: no input files compilation terminated. configure:8955: $? = 1 configure:8975: checking whether the C compiler works configure:8997: gcc -m32 -O2 -pedantic -fomit-frame-pointer -mtune=corei7 -march=corei7 D:\gmp-6.1.0 conftest.c >&5 c:/mingw/bin/../lib/gcc/mingw32/4.6.2/../../../../mingw32/bin/ld.exe: cannot find D:\gmp-6.1.0: Permission denied collect2: ld returned 1 exit status configure:9001: $? = 1 configure:9039: result: no configure: failed program was: | /* confdefs.h / | #define PACKAGE_NAME "GNU MP" | #define PACKAGE_TARNAME "gmp" | #define PACKAGE_VERSION "6.1.0" | #define PACKAGE_STRING "GNU MP 6.1.0" | #define PACKAGE_BUGREPORT "gmp-bugs@gmplib.org, see https://gmplib.org/manual/Reporting-Bugs.html" | #define PACKAGE_URL "http://www.gnu.org/software/gmp/" | #define PACKAGE "gmp" | #define VERSION "6.1.0" | #define WANT_ASSEMBLY 1 | #define WANT_FFT 1 | #define HAVE_HOST_CPU_sandybridge 1 | #define HOST_DOS64 1 | #define HAVE_SPEED_CYCLECOUNTER 2 | #define HAVE_CALLING_CONVENTIONS 1 | / end confdefs.h. */ | | int | main () | { | | ; | return 0; | } configure:9044: error: in /d/gmp-6.1.0': configure:9046: error: C compiler cannot create executables Seeconfig.log' for more details ---------------- Cache variables. ---------------- ac_cv_build=sandybridge-pc-mingw32 ac_cv_env_ABI_set= ac_cv_env_ABI_value= ac_cv_env_CCC_set= ac_cv_env_CCC_value= ac_cv_env_CC_FOR_BUILD_set= ac_cv_env_CC_FOR_BUILD_value= ac_cv_env_CC_set= ac_cv_env_CC_value= ac_cv_env_CFLAGS_set= ac_cv_env_CFLAGS_value= ac_cv_env_CPPFLAGS_set= ac_cv_env_CPPFLAGS_value= ac_cv_env_CPP_FOR_BUILD_set= ac_cv_env_CPP_FOR_BUILD_value= ac_cv_env_CPP_set= ac_cv_env_CPP_value= ac_cv_env_CXXCPP_set= ac_cv_env_CXXCPP_value= ac_cv_env_CXXFLAGS_set= ac_cv_env_CXXFLAGS_value= ac_cv_env_CXX_set= ac_cv_env_CXX_value= ac_cv_env_LDFLAGS_set=set ac_cv_env_LDFLAGS_value='D:\gmp-6.1.0' ac_cv_env_LIBS_set= ac_cv_env_LIBS_value= ac_cv_env_LT_SYS_LIBRARY_PATH_set= ac_cv_env_LT_SYS_LIBRARY_PATH_value= ac_cv_env_M4_set= ac_cv_env_M4_value= ac_cv_env_YACC_set= ac_cv_env_YACC_value= ac_cv_env_YFLAGS_set= ac_cv_env_YFLAGS_value= ac_cv_env_build_alias_set= ac_cv_env_build_alias_value= ac_cv_env_host_alias_set= ac_cv_env_host_alias_value= ac_cv_env_target_alias_set= ac_cv_env_target_alias_value= ac_cv_host=sandybridge-pc-mingw32 ac_cv_path_install='/bin/install -c' ac_cv_path_mkdir=/bin/mkdir ac_cv_prog_AWK=gawk ac_cv_prog_ac_ct_CC=gcc ac_cv_prog_make_make_set=yes am_cv_make_support_nested_variables=yes ----------------- Output variables. ----------------- ABI='32' ACLOCAL='${SHELL} /d/gmp-6.1.0/missing aclocal-1.15' AMTAR='$${TAR-tar}' AM_BACKSLASH='\' AM_DEFAULT_V='$(AM_DEFAULT_VERBOSITY)' AM_DEFAULT_VERBOSITY='1' AM_V='$(V)' AR='' AS='' ASMFLAGS='' AUTOCONF='${SHELL} /d/gmp-6.1.0/missing autoconf' AUTOHEADER='${SHELL} /d/gmp-6.1.0/missing autoheader' AUTOMAKE='${SHELL} /d/gmp-6.1.0/missing automake-1.15' AWK='gawk' CALLING_CONVENTIONS_OBJS='x86call.lo x86check$U.lo' CC='gcc' CCAS='' CC_FOR_BUILD='' CFLAGS='-m32 -O2 -pedantic -fomit-frame-pointer -mtune=corei7 -march=corei7' CPP='' CPPFLAGS='' CPP_FOR_BUILD='' CXX='' CXXCPP='' CXXFLAGS='' CYGPATH_W='echo' DEFN_LONG_LONG_LIMB='/* #undef LONG_LONG_LIMB */' DEFS='' DLLTOOL='' DSYMUTIL='' DUMPBIN='' ECHO_C='' ECHO_N='-n' ECHO_T='' EGREP='' ENABLE_STATIC_FALSE='' ENABLE_STATIC_TRUE='' EXEEXT='' EXEEXT_FOR_BUILD='' FGREP='' GMP_LDFLAGS='' GMP_LIMB_BITS='' GMP_NAIL_BITS='0' GREP='' HAVE_CLOCK_01='' HAVE_CPUTIME_01='' HAVE_GETRUSAGE_01='' HAVE_GETTIMEOFDAY_01='' HAVE_HOST_CPU_FAMILY_power='0' HAVE_HOST_CPU_FAMILY_powerpc='0' HAVE_SIGACTION_01='' HAVE_SIGALTSTACK_01='' HAVE_SIGSTACK_01='' HAVE_STACK_T_01='' HAVE_SYS_RESOURCE_H_01='' INSTALL_DATA='${INSTALL} -m 644' INSTALL_PROGRAM='${INSTALL}' INSTALL_SCRIPT='${INSTALL}' INSTALL_STRIP_PROGRAM='$(install_sh) -c -s' LD='' LDFLAGS='D:\gmp-6.1.0' LEX='' LEXLIB='' LEX_OUTPUT_ROOT='' LIBCURSES='' LIBGMPXX_LDFLAGS='' LIBGMP_DLL='' LIBGMP_LDFLAGS='' LIBM='' LIBM_FOR_BUILD='' LIBOBJS='' LIBREADLINE='' LIBS='' LIBTOOL='' LIPO='' LN_S='' LTLIBOBJS='' LT_SYS_LIBRARY_PATH='' M4='' MAINT='#' MAINTAINER_MODE_FALSE='' MAINTAINER_MODE_TRUE='#' MAKEINFO='${SHELL} /d/gmp-6.1.0/missing makeinfo' MANIFEST_TOOL='' MKDIR_P='/bin/mkdir -p' NM='' NMEDIT='' OBJDUMP='' OBJEXT='' OTOOL64='' OTOOL='' PACKAGE='gmp' PACKAGE_BUGREPORT='gmp-bugs@gmplib.org, see https://gmplib.org/manual/Reporting-Bugs.html' PACKAGE_NAME='GNU MP' PACKAGE_STRING='GNU MP 6.1.0' PACKAGE_TARNAME='gmp' PACKAGE_URL='http://www.gnu.org/software/gmp/' PACKAGE_VERSION='6.1.0' PATH_SEPARATOR=':' RANLIB='' SED='' SET_MAKE='' SHELL='/bin/sh' SPEED_CYCLECOUNTER_OBJ='pentium.lo' STRIP='' TAL_OBJECT='' TUNE_LIBS='' TUNE_SQR_OBJ='' U_FOR_BUILD='' VERSION='6.1.0' WANT_CXX_FALSE='' WANT_CXX_TRUE='' WITH_READLINE_01='' YACC='' YFLAGS='' ac_ct_AR='' ac_ct_CC='gcc' ac_ct_CXX='' ac_ct_DUMPBIN='' am_EXEEXT_FALSE='' am__EXEEXT_TRUE='' am__isrc='' am__leading_dot='.' am__tar='$${TAR-tar} chof - "$$tardir"' am__untar='$${TAR-tar} xf -' bindir='${exec_prefix}/bin' build='sandybridge-pc-mingw32' build_alias='' build_cpu='sandybridge' build_os='mingw32' build_vendor='pc' datadir='${datarootdir}' datarootdir='${prefix}/share' docdir='${datarootdir}/doc/${PACKAGE_TARNAME}' dvidir='${docdir}' exec_prefix='NONE' gmp_srclinks='' host='sandybridge-pc-mingw32' host_alias='' host_cpu='sandybridge' host_os='mingw32' host_vendor='pc' htmldir='${docdir}' includedir='${prefix}/include' infodir='${datarootdir}/info' install_sh='${SHELL} /d/gmp-6.1.0/install-sh' libdir='${exec_prefix}/lib' libexecdir='${exec_prefix}/libexec' localedir='${datarootdir}/locale' localstatedir='${prefix}/var' mandir='${datarootdir}/man' mkdir_p='$(MKDIR_P)' mpn_objects='' mpn_objs_in_libgmp='' oldincludedir='/usr/include' pdfdir='${docdir}' prefix='NONE' program_transform_name='s,x,x,' psdir='${docdir}' sbindir='${exec_prefix}/sbin' sharedstatedir='${prefix}/com' sysconfdir='${prefix}/etc' target_alias='' ----------- confdefs.h. ----------- /* confdefs.h */ #define PACKAGE_NAME "GNU MP" #define PACKAGE_TARNAME "gmp" #define PACKAGE_VERSION "6.1.0" #define PACKAGE_STRING "GNU MP 6.1.0" #define PACKAGE_BUGREPORT "gmp-bugs@gmplib.org, see https://gmplib.org/manual/Reporting-Bugs.html" #define PACKAGE_URL "http://www.gnu.org/software/gmp/" #define PACKAGE "gmp" #define VERSION "6.1.0" #define WANT_ASSEMBLY 1 #define WANT_FFT 1 #define HAVE_HOST_CPU_sandybridge 1 #define HOST_DOS64 1 #define HAVE_SPEED_CYCLECOUNTER 2 #define HAVE_CALLING_CONVENTIONS 1 configure: exit 77
关于python安装pymssql报错,求大神指点,在ubuntu14.04下
报错内容: ``` (pyenvdata)lin@lin-ThinkPad:~$ pip install pymssql Downloading/unpacking pymssql Downloading pymssql-2.1.1.tar.gz (2.4MB): 2.4MB downloaded Running setup.py (path:/home/lin/pyenvdata/build/pymssql/setup.py) egg_info for package pymssql setup.py: platform.system() => 'Linux' setup.py: platform.architecture() => ('64bit', 'ELF') setup.py: platform.linux_distribution() => ('Ubuntu', '14.04', 'trusty') setup.py: platform.libc_ver() => ('glibc', '2.4') setup.py: Not using bundled FreeTDS setup.py: include_dirs = ['/usr/local/include'] setup.py: library_dirs = ['/usr/local/lib'] Installed /home/lin/pyenvdata/build/pymssql/setuptools_git-1.1-py2.7.egg Installing collected packages: pymssql Running setup.py install for pymssql setup.py: platform.system() => 'Linux' setup.py: platform.architecture() => ('64bit', 'ELF') setup.py: platform.linux_distribution() => ('Ubuntu', '14.04', 'trusty') setup.py: platform.libc_ver() => ('glibc', '2.4') setup.py: Not using bundled FreeTDS setup.py: include_dirs = ['/usr/local/include'] setup.py: library_dirs = ['/usr/local/lib'] building '_mssql' extension x86_64-linux-gnu-gcc -pthread -fno-strict-aliasing -DNDEBUG -g -fwrapv -O2 -Wall -Wstrict-prototypes -fPIC -I/usr/local/include -I/usr/include/python2.7 -c _mssql.c -o build/temp.linux-x86_64-2.7/_mssql.o -DMSDBLIB _mssql.c:314:22: fatal error: sqlfront.h: 没有那个文件或目录 #include "sqlfront.h" ^ compilation terminated. error: command 'x86_64-linux-gnu-gcc' failed with exit status 1 Complete output from command /home/lin/pyenvdata/bin/python -c "import setuptools, tokenize;__file__='/home/lin/pyenvdata/build/pymssql/setup.py';exec(compile(getattr(tokenize, 'open', open)(__file__).read().replace('\r\n', '\n'), __file__, 'exec'))" install --record /tmp/pip-c75p_h-record/install-record.txt --single-version-externally-managed --compile --install-headers /home/lin/pyenvdata/include/site/python2.7: setup.py: platform.system() => 'Linux' setup.py: platform.architecture() => ('64bit', 'ELF') setup.py: platform.linux_distribution() => ('Ubuntu', '14.04', 'trusty') setup.py: platform.libc_ver() => ('glibc', '2.4') setup.py: Not using bundled FreeTDS setup.py: include_dirs = ['/usr/local/include'] setup.py: library_dirs = ['/usr/local/lib'] running install running build running build_ext building '_mssql' extension creating build creating build/temp.linux-x86_64-2.7 x86_64-linux-gnu-gcc -pthread -fno-strict-aliasing -DNDEBUG -g -fwrapv -O2 -Wall -Wstrict-prototypes -fPIC -I/usr/local/include -I/usr/include/python2.7 -c _mssql.c -o build/temp.linux-x86_64-2.7/_mssql.o -DMSDBLIB _mssql.c:314:22: fatal error: sqlfront.h: 没有那个文件或目录 #include "sqlfront.h" ^ compilation terminated. error: command 'x86_64-linux-gnu-gcc' failed with exit status 1 ---------------------------------------- Cleaning up... Command /home/lin/pyenvdata/bin/python -c "import setuptools, tokenize;__file__='/home/lin/pyenvdata/build/pymssql/setup.py';exec(compile(getattr(tokenize, 'open', open)(__file__).read().replace('\r\n', '\n'), __file__, 'exec'))" install --record /tmp/pip-c75p_h-record/install-record.txt --single-version-externally-managed --compile --install-headers /home/lin/pyenvdata/include/site/python2.7 failed with error code 1 in /home/lin/pyenvdata/build/pymssql Traceback (most recent call last): File "/home/lin/pyenvdata/bin/pip", line 11, in <module> sys.exit(main()) File "/home/lin/pyenvdata/local/lib/python2.7/site-packages/pip/__init__.py", line 185, in main return command.main(cmd_args) File "/home/lin/pyenvdata/local/lib/python2.7/site-packages/pip/basecommand.py", line 161, in main text = '\n'.join(complete_log) UnicodeDecodeError: 'ascii' codec can't decode byte 0xe6 in position 46: ordinal not in range(128) ```
mac编译安装pyodbc失败
我想在 mac 中使用 python+odbc 的方式实现远程访问 oracle 数据库,所以下载了 pyodbc-3.0.7的源码在本地编译。 按 README 中的方法执行 python setup.py build install 时遇到报错如下: ``` www:pyodbc-3.0.7 Philip$ python setup.py build install running build running build_ext building 'pyodbc' extension cc -fno-strict-aliasing -fno-common -dynamic -arch x86_64 -arch i386 -g -Os -pipe -fno-common -fno-strict-aliasing -fwrapv -DENABLE_DTRACE -DMACOSX -DNDEBUG -Wall -Wstrict-prototypes -Wshorten-64-to-32 -DNDEBUG -g -fwrapv -Os -Wall -Wstrict-prototypes -DENABLE_DTRACE -arch x86_64 -arch i386 -pipe -DPYODBC_VERSION=3.0.7 -UMAC_OS_X_VERSION_10_7 -I/System/Library/Frameworks/Python.framework/Versions/2.7/include/python2.7 -c /Users/Philip/workspaces/pyodbc-3.0.7/src/buffer.cpp -o build/temp.macosx-10.10-intel-2.7/Users/Philip/workspaces/pyodbc-3.0.7/src/buffer.o -Wno-write-strings -Wno-deprecated-declarations In file included from /Users/Philip/workspaces/pyodbc-3.0.7/src/buffer.cpp:12: /Users/Philip/workspaces/pyodbc-3.0.7/src/pyodbc.h:52:10: fatal error: 'sql.h' file not found #include <sql.h> ^ 1 error generated. error: command 'cc' failed with exit status 1 www:pyodbc-3.0.7 Philip$ ``` 我的系统版本是osx10.10.1,之前从未装过第三方的数据库或者数据库客户端。gcc 是自己用 homebrew 安装的 ``` www:pyodbc-3.0.7 Philip$ which gcc /usr/local/bin/gcc www:pyodbc-3.0.7 Philip$ gcc --version gcc (Homebrew gcc 4.9.2_1) 4.9.2 Copyright (C) 2014 Free Software Foundation, Inc. This is free software; see the source for copying conditions. There is NO warranty; not even for MERCHANTABILITY or FITNESS FOR A PARTICULAR PURPOSE. www:pyodbc-3.0.7 Philip$ ``` 请问这个报错到底是什么原因导致的?是 gcc 编译器没有安装好,还是缺少数据库包? 烦劳大家帮忙分析一下。
RTEMS移植GUI (MicroWindows) 的过程中出错
执行./do_it后: 错误是: configure: error: in `/home/Joshua/rtems-graphics-toolkit/libpng-1.5.12': configure: error: C compiler cannot create executables See `config.log' for more details ERROR: Could not configure libpng-1.5.12 下面是libpng下得config.log内容: This file contains any messages produced by compilers while running configure, to aid debugging if configure makes a mistake. It was created by libpng configure 1.5.12, which was generated by GNU Autoconf 2.68. Invocation command line was $ ./configure --host=i386-rtems4.11 --prefix=/opt/rtems-4.11/i386-rtems4.11/pc686 --includedir=/opt/rtems-4.11/i386-rtems4.11/pc686/lib/include --libdir=/opt/rtems-4.11/i386-rtems4.11/pc686/lib --disable-shared ## --------- ## ## Platform. ## ## --------- ## hostname = localhost.localdomain uname -m = i686 uname -r = 3.9.5-301.fc19.i686 uname -s = Linux uname -v = #1 SMP Tue Jun 11 20:01:50 UTC 2013 /usr/bin/uname -p = i686 /bin/uname -X = unknown /bin/arch = i686 /usr/bin/arch -k = unknown /usr/convex/getsysinfo = unknown /usr/bin/hostinfo = unknown /bin/machine = unknown /usr/bin/oslevel = unknown /bin/universe = unknown PATH: /usr/local/sbin PATH: /usr/local/bin PATH: /sbin PATH: /bin PATH: /usr/sbin PATH: /usr/bin PATH: /root/bin ## ----------- ## ## Core tests. ## ## ----------- ## configure:2321: checking for a BSD-compatible install configure:2389: result: /bin/install -c configure:2400: checking whether build environment is sane configure:2450: result: yes configure:2499: checking for i386-rtems4.11-strip configure:2529: result: no configure:2539: checking for strip configure:2555: found /bin/strip configure:2566: result: strip configure:2591: checking for a thread-safe mkdir -p configure:2630: result: /bin/mkdir -p configure:2643: checking for gawk configure:2659: found /bin/gawk configure:2670: result: gawk configure:2681: checking whether make sets $(MAKE) configure:2703: result: yes configure:2784: checking whether to enable maintainer-specific portions of Makefiles configure:2793: result: no configure:2832: checking for i386-rtems4.11-gcc configure:2862: result: no configure:2872: checking for gcc configure:2888: found /bin/gcc configure:2899: result: gcc configure:3128: checking for C compiler version configure:3137: gcc --version >&5 gcc (GCC) 4.8.2 20131017 (Red Hat 4.8.2-1) Copyright (C) 2013 Free Software Foundation, Inc. This is free software; see the source for copying conditions. There is NO warranty; not even for MERCHANTABILITY or FITNESS FOR A PARTICULAR PURPOSE. configure:3148: $? = 0 configure:3137: gcc -v >&5 Using built-in specs. COLLECT_GCC=gcc COLLECT_LTO_WRAPPER=/usr/libexec/gcc/i686-redhat-linux/4.8.2/lto-wrapper Target: i686-redhat-linux Configured with: ../configure --prefix=/usr --mandir=/usr/share/man --infodir=/usr/share/info --with-bugurl=http://bugzilla.redhat.com/bugzilla --enable-bootstrap --enable-shared --enable-threads=posix --enable-checking=release --with-system-zlib --enable-__cxa_atexit --disable-libunwind-exceptions --enable-gnu-unique-object --enable-linker-build-id --with-linker-hash-style=gnu --enable-languages=c,c++,objc,obj-c++,java,fortran,ada,go,lto --enable-plugin --enable-initfini-array --enable-java-awt=gtk --disable-dssi --with-java-home=/usr/lib/jvm/java-1.5.0-gcj-1.5.0.0/jre --enable-libgcj-multifile --enable-java-maintainer-mode --with-ecj-jar=/usr/share/java/eclipse-ecj.jar --disable-libjava-multilib --with-isl=/builddir/build/BUILD/gcc-4.8.2-20131017/obj-i686-redhat-linux/isl-install --with-cloog=/builddir/build/BUILD/gcc-4.8.2-20131017/obj-i686-redhat-linux/cloog-install --with-tune=generic --with-arch=i686 --build=i686-redhat-linux Thread model: posix gcc version 4.8.2 20131017 (Red Hat 4.8.2-1) (GCC) configure:3148: $? = 0 configure:3137: gcc -V >&5 gcc: error: unrecognized command line option '-V' gcc: fatal error: no input files compilation terminated. configure:3148: $? = 4 configure:3137: gcc -qversion >&5 gcc: error: unrecognized command line option '-qversion' gcc: fatal error: no input files compilation terminated. configure:3148: $? = 4 configure:3168: checking whether the C compiler works configure:3190: gcc --pipe -B/opt/rtems-4.11/i386-rtems4.11/pc686/lib/ -specs bsp_specs -qrtems -mtune=pentiumpro conftest.c >&5 /bin/ld: cannot find -lgcc_s /bin/ld: cannot find -lc /bin/ld: cannot find -lgcc_s collect2: error: ld returned 1 exit status configure:3194: $? = 1 configure:3232: result: no configure: failed program was: | /* confdefs.h */ | #define PACKAGE_NAME "libpng" | #define PACKAGE_TARNAME "libpng" | #define PACKAGE_VERSION "1.5.12" | #define PACKAGE_STRING "libpng 1.5.12" | #define PACKAGE_BUGREPORT "png-mng-implement@lists.sourceforge.net" | #define PACKAGE_URL "" | #define PACKAGE "libpng" | #define VERSION "1.5.12" | /* end confdefs.h. */ | | int | main () | { | | ; | return 0; | } configure:3237: error: in `/home/Joshua/rtems-graphics-toolkit/libpng-1.5.12': configure:3239: error: C compiler cannot create executables See `config.log' for more details ## ---------------- ## ## Cache variables. ## ## ---------------- ## ac_cv_env_CCASFLAGS_set= ac_cv_env_CCASFLAGS_value= ac_cv_env_CCAS_set= ac_cv_env_CCAS_value= ac_cv_env_CC_set= ac_cv_env_CC_value= ac_cv_env_CFLAGS_set=set ac_cv_env_CFLAGS_value=' --pipe -B/opt/rtems-4.11/i386-rtems4.11/pc686/lib/ -specs bsp_specs -qrtems -mtune=pentiumpro' ac_cv_env_CPPFLAGS_set= ac_cv_env_CPPFLAGS_value= ac_cv_env_CPP_set= ac_cv_env_CPP_value= ac_cv_env_LDFLAGS_set= ac_cv_env_LDFLAGS_value= ac_cv_env_LIBS_set= ac_cv_env_LIBS_value= ac_cv_env_build_alias_set= ac_cv_env_build_alias_value= ac_cv_env_host_alias_set=set ac_cv_env_host_alias_value=i386-rtems4.11 ac_cv_env_target_alias_set= ac_cv_env_target_alias_value= ac_cv_path_install='/bin/install -c' ac_cv_path_mkdir=/bin/mkdir ac_cv_prog_AWK=gawk ac_cv_prog_ac_ct_CC=gcc ac_cv_prog_ac_ct_STRIP=strip ac_cv_prog_make_make_set=yes ## ----------------- ## ## Output variables. ## ## ----------------- ## ACLOCAL='${SHELL} /home/Joshua/rtems-graphics-toolkit/libpng-1.5.12/missing --run aclocal-1.11' AMDEPBACKSLASH='' AMDEP_FALSE='' AMDEP_TRUE='' AMTAR='${SHELL} /home/Joshua/rtems-graphics-toolkit/libpng-1.5.12/missing --run tar' AM_CCASFLAGS='' AR='' AS='' AUTOCONF='${SHELL} /home/Joshua/rtems-graphics-toolkit/libpng-1.5.12/missing --run autoconf' AUTOHEADER='${SHELL} /home/Joshua/rtems-graphics-toolkit/libpng-1.5.12/missing --run autoheader' AUTOMAKE='${SHELL} /home/Joshua/rtems-graphics-toolkit/libpng-1.5.12/missing --run automake-1.11' AWK='gawk' CC='gcc' CCAS='' CCASDEPMODE='' CCASFLAGS='' CCDEPMODE='' CFLAGS=' --pipe -B/opt/rtems-4.11/i386-rtems4.11/pc686/lib/ -specs bsp_specs -qrtems -mtune=pentiumpro' CPP='' CPPFLAGS='' CYGPATH_W='echo' DEFS='' DEPDIR='' DFNCPP='' DLLTOOL='' DSYMUTIL='' DUMPBIN='' ECHO_C='' ECHO_N='-n' ECHO_T='' EGREP='' EXEEXT='' FGREP='' GREP='' HAVE_LD_VERSION_SCRIPT_FALSE='' HAVE_LD_VERSION_SCRIPT_TRUE='' HAVE_SOLARIS_LD_FALSE='' HAVE_SOLARIS_LD_TRUE='' INSTALL_DATA='${INSTALL} -m 644' INSTALL_PROGRAM='${INSTALL}' INSTALL_SCRIPT='${INSTALL}' INSTALL_STRIP_PROGRAM='$(install_sh) -c -s' LD='' LDFLAGS='' LIBOBJS='' LIBPNG_DEFINES='' LIBS='' LIBTOOL='' LIPO='' LN_S='' LTLIBOBJS='' MAINT='#' MAINTAINER_MODE_FALSE='' MAINTAINER_MODE_TRUE='#' MAKEINFO='${SHELL} /home/Joshua/rtems-graphics-toolkit/libpng-1.5.12/missing --run makeinfo' MANIFEST_TOOL='' MKDIR_P='/bin/mkdir -p' NM='' NMEDIT='' OBJDUMP='' OBJEXT='' OTOOL64='' OTOOL='' PACKAGE='libpng' PACKAGE_BUGREPORT='png-mng-implement@lists.sourceforge.net' PACKAGE_NAME='libpng' PACKAGE_STRING='libpng 1.5.12' PACKAGE_TARNAME='libpng' PACKAGE_URL='' PACKAGE_VERSION='1.5.12' PATH_SEPARATOR=':' PNGLIB_MAJOR='1' PNGLIB_MINOR='5' PNGLIB_RELEASE='12' PNGLIB_VERSION='1.5.12' PNG_ARM_NEON_FALSE='' PNG_ARM_NEON_TRUE='' POW_LIB='' RANLIB='' SED='' SET_MAKE='' SHELL='/bin/sh' STRIP='strip' SYMBOL_PREFIX='' VERSION='1.5.12' ac_ct_AR='' ac_ct_CC='gcc' ac_ct_DUMPBIN='' am__EXEEXT_FALSE='' am__EXEEXT_TRUE='' am__fastdepCCAS_FALSE='' am__fastdepCCAS_TRUE='' am__fastdepCC_FALSE='' am__fastdepCC_TRUE='' am__include='' am__isrc='' am__leading_dot='.' am__nodep='' am__quote='' am__tar='${AMTAR} chof - "$$tardir"' am__untar='${AMTAR} xf -' binconfigs='' bindir='${exec_prefix}/bin' build='' build_alias='' build_cpu='' build_os='' build_vendor='' datadir='${datarootdir}' datarootdir='${prefix}/share' docdir='${datarootdir}/doc/${PACKAGE_TARNAME}' dvidir='${docdir}' exec_prefix='NONE' host='i386-rtems4.11' host_alias='i386-rtems4.11' host_cpu='' host_os='' host_vendor='' htmldir='${docdir}' includedir='/opt/rtems-4.11/i386-rtems4.11/pc686/lib/include' infodir='${datarootdir}/info' install_sh='${SHELL} /home/Joshua/rtems-graphics-toolkit/libpng-1.5.12/install-sh' libdir='/opt/rtems-4.11/i386-rtems4.11/pc686/lib' libexecdir='${exec_prefix}/libexec' localedir='${datarootdir}/locale' localstatedir='${prefix}/var' mandir='${datarootdir}/man' mkdir_p='/bin/mkdir -p' oldincludedir='/usr/include' pdfdir='${docdir}' pkgconfigdir='' prefix='/opt/rtems-4.11/i386-rtems4.11/pc686' program_transform_name='s,x,x,' psdir='${docdir}' sbindir='${exec_prefix}/sbin' sharedstatedir='${prefix}/com' sysconfdir='${prefix}/etc' target_alias='' ## ----------- ## ## confdefs.h. ## ## ----------- ## /* confdefs.h */ #define PACKAGE_NAME "libpng" #define PACKAGE_TARNAME "libpng" #define PACKAGE_VERSION "1.5.12" #define PACKAGE_STRING "libpng 1.5.12" #define PACKAGE_BUGREPORT "png-mng-implement@lists.sourceforge.net" #define PACKAGE_URL "" #define PACKAGE "libpng" #define VERSION "1.5.12" configure: exit 77
Samba在Ubuntu下安装问题
Samba安装配置./configure --prefix=/usr/local 提示error: could not find Python headers 在终端机输入如下命令之后 sudo apt-get install python-dev 仍是同样报错提示,求解? “/home/nelson/software/Python-2.6.5/Objects/complexobject.c:149: undefined reference to `log' /usr/local/lib/libpython2.6.a(complexobject.o): In function `_Py_c_abs': /home/nelson/software/Python-2.6.5/Objects/complexobject.c:214: undefined reference to `hypot' collect2: ld returned 1 exit status ['/usr/bin/gcc', 'default/test_1.o', '-o', '/home/nelson/software/samba-4.2.0/bin/.conf_check_0/testbuild/default/testprog', '-L/usr/local/lib', '-Wl,-Bdynamic', '-lm', '-lpthread', '-ldl', '-lutil', '-lpython2.6'] command returned 'Build failed: -> task failed (err #1): \n\t{task: cc_link test_1.o -> testprog}'Could not find the python development headers ”
在Linux下编译Unity的mono一直卡在这里
![图片说明](https://img-ask.csdn.net/upload/201707/25/1500967374_925546.png) 看日志有两个地方比较可疑,一个是这里 configure:3745: checking whether to enable maintainer-specific portions of Makefiles configure:3754: result: no 说没有开启maintainer-specific portions,但我不知道怎么开启,不知道是不是原因 另一处是arm-linux-androideabi-gcc: error: unrecognized command line option '-V' 这个好像和下面的 collect2: error: ld returned 1 exit status configure:4569: $? = 1 configure:4607: result: no configure: failed program was: | /* confdefs.h */ | #define PACKAGE_NAME "" | #define PACKAGE_TARNAME "" | #define PACKAGE_VERSION "" | #define PACKAGE_STRING "" | #define PACKAGE_BUGREPORT "" | #define PACKAGE_URL "" | #define PACKAGE "mono" | #define VERSION "2.6.5" | /* end confdefs.h. */ | | int | main () | { | | ; | return 0; | } 这个有关configure:4607: result: no这个意思好像是configure的4607行返回了一个no,文件夹内的确有一个configure文件,之后打开configure,4607行是这样的 4606 if test -z "$ac_file"; then : 4607 { $as_echo "$as_me:${as_lineno-$LINENO}: result: no" >&5 4608 $as_echo "no" >&6; } 4609 $as_echo "$as_me: failed program was:" >&5 4610 sed 's/^/| /' conftest.$ac_ext >&5 4611 4612 { { $as_echo "$as_me:${as_lineno-$LINENO}: error: in \`$ac_pwd':" >&5 4613 $as_echo "$as_me: error: in \`$ac_pwd':" >&2;} 4614 as_fn_error 77 "C compiler cannot create executables 4615 See \`config.log' for more details" "$LINENO" 5; } 4616 else 4617 { $as_echo "$as_me:${as_lineno-$LINENO}: result: yes" >&5 4618 $as_echo "yes" >&6; } 4619 fi 这种语言没学过,看不懂什么意思,求大神指点,卡这很久了 下面是日志 This file contains any messages produced by compilers while running configure, to aid debugging if configure makes a mistake. It was created by configure, which was generated by GNU Autoconf 2.69. Invocation command line was $ ./configure --prefix=/home/jimmy/mono-unity-5.6/builds/android --cache-file=android_cross.cache --host=arm-eabi-linux --disable-mcs-build --disable-parallel-mark --disable-shared-handles --with-sigaltstack=no --with-tls=pthread --with-glib=embedded --enable-nls=no mono_cv_uscore=yes PATH=/home/jimmy/android-ndk_auto-r10e/toolchains/arm-linux-androideabi-4.8/prebuilt/linux-x86/bin:/usr/local/sbin:/usr/local/bin:/usr/sbin:/usr/bin:/sbin:/bin CC=/home/jimmy/android-ndk_auto-r10e/toolchains/arm-linux-androideabi-4.8/prebuilt/linux-x86/bin/arm-linux-androideabi-gcc --sysroot=/home/jimmy/android-ndk_auto-r10e/platforms/android-9/arch-arm CXX=/home/jimmy/android-ndk_auto-r10e/toolchains/arm-linux-androideabi-4.8/prebuilt/linux-x86/bin/arm-linux-androideabi-g++ --sysroot=/home/jimmy/android-ndk_auto-r10e/platforms/android-9/arch-arm CPP=/home/jimmy/android-ndk_auto-r10e/toolchains/arm-linux-androideabi-4.8/prebuilt/linux-x86/bin/arm-linux-androideabi-cpp CXXCPP=/home/jimmy/android-ndk_auto-r10e/toolchains/arm-linux-androideabi-4.8/prebuilt/linux-x86/bin/arm-linux-androideabi-cpp CFLAGS=-DANDROID -DPLATFORM_ANDROID -DLINUX -D__linux__ -DHAVE_USR_INCLUDE_MALLOC_H -DPAGE_SIZE=0x1000 -D_POSIX_PATH_MAX=256 -DS_IWRITE=S_IWUSR -DHAVE_PTHREAD_MUTEX_TIMEDLOCK -fpic -g -funwind-tables -ffunction-sections -fdata-sections -DARM_FPU_NONE=1 -march=armv5te -mtune=xscale -msoft-float CPPFLAGS=-DANDROID -DPLATFORM_ANDROID -DLINUX -D__linux__ -DHAVE_USR_INCLUDE_MALLOC_H -DPAGE_SIZE=0x1000 -D_POSIX_PATH_MAX=256 -DS_IWRITE=S_IWUSR -DHAVE_PTHREAD_MUTEX_TIMEDLOCK -fpic -g -funwind-tables -ffunction-sections -fdata-sections -DARM_FPU_NONE=1 -march=armv5te -mtune=xscale -msoft-float CXXFLAGS=-DANDROID -DPLATFORM_ANDROID -DLINUX -D__linux__ -DHAVE_USR_INCLUDE_MALLOC_H -DPAGE_SIZE=0x1000 -D_POSIX_PATH_MAX=256 -DS_IWRITE=S_IWUSR -DHAVE_PTHREAD_MUTEX_TIMEDLOCK -fpic -g -funwind-tables -ffunction-sections -fdata-sections -DARM_FPU_NONE=1 -march=armv5te -mtune=xscale -msoft-float LDFLAGS=-Wl,--wrap,sigaction -L/home/jimmy/mono-unity-5.6/../../android_krait_signal_handler/build/obj/local/armeabi -lkrait-signal-handler -Wl,--no-undefined -Wl,--gc-sections -Wl,-rpath-link=/home/jimmy/android-ndk_auto-r10e/platforms/android-9/arch-arm/usr/lib -ldl -lm -llog -lc LD=/home/jimmy/android-ndk_auto-r10e/toolchains/arm-linux-androideabi-4.8/prebuilt/linux-x86/bin/arm-linux-androideabi-ld AR=/home/jimmy/android-ndk_auto-r10e/toolchains/arm-linux-androideabi-4.8/prebuilt/linux-x86/bin/arm-linux-androideabi-ar AS=/home/jimmy/android-ndk_auto-r10e/toolchains/arm-linux-androideabi-4.8/prebuilt/linux-x86/bin/arm-linux-androideabi-as RANLIB=/home/jimmy/android-ndk_auto-r10e/toolchains/arm-linux-androideabi-4.8/prebuilt/linux-x86/bin/arm-linux-androideabi-ranlib STRIP=/home/jimmy/android-ndk_auto-r10e/toolchains/arm-linux-androideabi-4.8/prebuilt/linux-x86/bin/arm-linux-androideabi-strip CPATH=/home/jimmy/android-ndk_auto-r10e/platforms/android-9/arch-arm/usr/include ## --------- ## ## Platform. ## ## --------- ## hostname = ubuntu uname -m = x86_64 uname -r = 4.4.0-21-generic uname -s = Linux uname -v = #37-Ubuntu SMP Mon Apr 18 18:33:37 UTC 2016 /usr/bin/uname -p = unknown /bin/uname -X = unknown /bin/arch = unknown /usr/bin/arch -k = unknown /usr/convex/getsysinfo = unknown /usr/bin/hostinfo = unknown /bin/machine = unknown /usr/bin/oslevel = unknown /bin/universe = unknown PATH: /home/jimmy/android-ndk_auto-r10e/toolchains/arm-linux-androideabi-4.8/prebuilt/linux-x86/bin PATH: /usr/local/sbin PATH: /usr/local/bin PATH: /usr/sbin PATH: /usr/bin PATH: /sbin PATH: /bin ## ----------- ## ## Core tests. ## ## ----------- ## configure:2828: creating cache android_cross.cache configure:2934: checking build system type configure:2948: result: x86_64-pc-linux-gnu configure:2968: checking host system type configure:2981: result: arm-eabi-linux-gnu configure:3001: checking target system type configure:3014: result: arm-eabi-linux-gnu configure:3064: checking for a BSD-compatible install configure:3132: result: /usr/bin/install -c configure:3143: checking whether build environment is sane configure:3198: result: yes configure:3257: checking for arm-eabi-linux-strip configure:3284: result: /home/jimmy/android-ndk_auto-r10e/toolchains/arm-linux-androideabi-4.8/prebuilt/linux-x86/bin/arm-linux-androideabi-strip configure:3349: checking for a thread-safe mkdir -p configure:3388: result: /bin/mkdir -p configure:3395: checking for gawk configure:3411: found /usr/bin/gawk configure:3422: result: gawk configure:3433: checking whether make sets $(MAKE) configure:3455: result: yes configure:3484: checking whether make supports nested variables configure:3501: result: yes configure:3591: checking whether UID '0' is supported by ustar format configure:3594: result: yes configure:3601: checking whether GID '0' is supported by ustar format configure:3604: result: yes configure:3612: checking how to create a ustar tar archive configure:3623: tar --version tar (GNU tar) 1.28 Copyright (C) 2014 Free Software Foundation, Inc. License GPLv3+: GNU GPL version 3 or later <http://gnu.org/licenses/gpl.html>. This is free software: you are free to change and redistribute it. There is NO WARRANTY, to the extent permitted by law. Written by John Gilmore and Jay Fenlason. configure:3626: $? = 0 configure:3666: tardir=conftest.dir && eval tar --format=ustar -chf - "$tardir" >conftest.tar configure:3669: $? = 0 configure:3673: tar -xf - <conftest.tar configure:3676: $? = 0 configure:3678: cat conftest.dir/file GrepMe configure:3681: $? = 0 configure:3694: result: gnutar configure:3745: checking whether to enable maintainer-specific portions of Makefiles configure:3754: result: no configure:3771: checking whether ln -s works configure:3775: result: yes configure:3847: checking host platform characteristics configure:4065: result: ok configure:4110: checking for arm-eabi-linux-gcc configure:4137: result: /home/jimmy/android-ndk_auto-r10e/toolchains/arm-linux-androideabi-4.8/prebuilt/linux-x86/bin/arm-linux-androideabi-gcc --sysroot=/home/jimmy/android-ndk_auto-r10e/platforms/android-9/arch-arm configure:4207: checking for arm-eabi-linux-gcc configure:4234: result: /home/jimmy/android-ndk_auto-r10e/toolchains/arm-linux-androideabi-4.8/prebuilt/linux-x86/bin/arm-linux-androideabi-gcc --sysroot=/home/jimmy/android-ndk_auto-r10e/platforms/android-9/arch-arm configure:4503: checking for C compiler version configure:4512: /home/jimmy/android-ndk_auto-r10e/toolchains/arm-linux-androideabi-4.8/prebuilt/linux-x86/bin/arm-linux-androideabi-gcc --sysroot=/home/jimmy/android-ndk_auto-r10e/platforms/android-9/arch-arm --version >&5 arm-linux-androideabi-gcc (GCC) 4.8 Copyright (C) 2013 Free Software Foundation, Inc. This is free software; see the source for copying conditions. There is NO warranty; not even for MERCHANTABILITY or FITNESS FOR A PARTICULAR PURPOSE. configure:4523: $? = 0 configure:4512: /home/jimmy/android-ndk_auto-r10e/toolchains/arm-linux-androideabi-4.8/prebuilt/linux-x86/bin/arm-linux-androideabi-gcc --sysroot=/home/jimmy/android-ndk_auto-r10e/platforms/android-9/arch-arm -v >&5 Using built-in specs. COLLECT_GCC=/home/jimmy/android-ndk_auto-r10e/toolchains/arm-linux-androideabi-4.8/prebuilt/linux-x86/bin/arm-linux-androideabi-gcc COLLECT_LTO_WRAPPER=/home/jimmy/android-ndk_auto-r10e/toolchains/arm-linux-androideabi-4.8/prebuilt/linux-x86/bin/../libexec/gcc/arm-linux-androideabi/4.8/lto-wrapper Target: arm-linux-androideabi Configured with: /s/ndk-toolchain/src/build/../gcc/gcc-4.8/configure --prefix=/tmp/ndk-andrewhsieh/build/toolchain/prefix --target=arm-linux-androideabi --host=x86_64-linux-gnu --build=x86_64-linux-gnu --with-gnu-as --with-gnu-ld --enable-languages=c,c++ --with-gmp=/tmp/ndk-andrewhsieh/build/toolchain/temp-install --with-mpfr=/tmp/ndk-andrewhsieh/build/toolchain/temp-install --with-mpc=/tmp/ndk-andrewhsieh/build/toolchain/temp-install --with-cloog=/tmp/ndk-andrewhsieh/build/toolchain/temp-install --with-isl=/tmp/ndk-andrewhsieh/build/toolchain/temp-install --with-ppl=/tmp/ndk-andrewhsieh/build/toolchain/temp-install --disable-ppl-version-check --disable-cloog-version-check --disable-isl-version-check --enable-cloog-backend=isl --with-host-libstdcxx='-static-libgcc -Wl,-Bstatic,-lstdc++,-Bdynamic -lm' --disable-libssp --enable-threads --disable-nls --disable-libmudflap --disable-libgomp --disable-libstdc__-v3 --disable-sjlj-exceptions --disable-shared --disable-tls --disable-libitm --with-float=soft --with-fpu=vfp --with-arch=armv5te --enable-target-optspace --enable-initfini-array --disable-nls --prefix=/tmp/ndk-andrewhsieh/build/toolchain/prefix --with-sysroot=/tmp/ndk-andrewhsieh/build/toolchain/prefix/sysroot --with-binutils-version=2.25 --with-mpfr-version=3.1.1 --with-mpc-version=1.0.1 --with-gmp-version=5.0.5 --with-gcc-version=4.8 --with-gdb-version=7.7 --with-python=/usr/local/google/home/andrewhsieh/mydroid/ndk/prebuilt/linux-x86/bin/python-config.sh --with-gxx-include-dir=/tmp/ndk-andrewhsieh/build/toolchain/prefix/include/c++/4.8 --with-bugurl=http://source.android.com/source/report-bugs.html --enable-languages=c,c++ --disable-bootstrap --enable-plugins --enable-libgomp --enable-gnu-indirect-function --disable-libsanitizer --enable-gold --enable-threads --enable-graphite=yes --with-cloog-version=0.18.0 --with-isl-version=0.11.1 --enable-eh-frame-hdr-for-static --with-arch=armv5te --program-transform-name='s&^&arm-linux-androideabi-&' --enable-gold=default Thread model: posix gcc version 4.8 (GCC) configure:4523: $? = 0 configure:4512: /home/jimmy/android-ndk_auto-r10e/toolchains/arm-linux-androideabi-4.8/prebuilt/linux-x86/bin/arm-linux-androideabi-gcc --sysroot=/home/jimmy/android-ndk_auto-r10e/platforms/android-9/arch-arm -V >&5 arm-linux-androideabi-gcc: error: unrecognized command line option '-V' arm-linux-androideabi-gcc: fatal error: no input files compilation terminated. configure:4523: $? = 1 configure:4512: /home/jimmy/android-ndk_auto-r10e/toolchains/arm-linux-androideabi-4.8/prebuilt/linux-x86/bin/arm-linux-androideabi-gcc --sysroot=/home/jimmy/android-ndk_auto-r10e/platforms/android-9/arch-arm -qversion >&5 arm-linux-androideabi-gcc: error: unrecognized command line option '-qversion' arm-linux-androideabi-gcc: fatal error: no input files compilation terminated. configure:4523: $? = 1 configure:4543: checking whether the C compiler works configure:4565: /home/jimmy/android-ndk_auto-r10e/toolchains/arm-linux-androideabi-4.8/prebuilt/linux-x86/bin/arm-linux-androideabi-gcc --sysroot=/home/jimmy/android-ndk_auto-r10e/platforms/android-9/arch-arm -DANDROID -DPLATFORM_ANDROID -DLINUX -D__linux__ -DHAVE_USR_INCLUDE_MALLOC_H -DPAGE_SIZE=0x1000 -D_POSIX_PATH_MAX=256 -DS_IWRITE=S_IWUSR -DHAVE_PTHREAD_MUTEX_TIMEDLOCK -fpic -g -funwind-tables -ffunction-sections -fdata-sections -DARM_FPU_NONE=1 -march=armv5te -mtune=xscale -msoft-float -DANDROID -DPLATFORM_ANDROID -DLINUX -D__linux__ -DHAVE_USR_INCLUDE_MALLOC_H -DPAGE_SIZE=0x1000 -D_POSIX_PATH_MAX=256 -DS_IWRITE=S_IWUSR -DHAVE_PTHREAD_MUTEX_TIMEDLOCK -fpic -g -funwind-tables -ffunction-sections -fdata-sections -DARM_FPU_NONE=1 -march=armv5te -mtune=xscale -msoft-float -DGC_LINUX_THREADS -D_GNU_SOURCE -D_REENTRANT -DUSE_MMAP -DUSE_MUNMAP -Wl,--wrap,sigaction -L/home/jimmy/mono-unity-5.6/../../android_krait_signal_handler/build/obj/local/armeabi -lkrait-signal-handler -Wl,--no-undefined -Wl,--gc-sections -Wl,-rpath-link=/home/jimmy/android-ndk_auto-r10e/platforms/android-9/arch-arm/usr/lib -ldl -lm -llog -lc conftest.c >&5 /home/jimmy/android-ndk_auto-r10e/toolchains/arm-linux-androideabi-4.8/prebuilt/linux-x86/bin/../lib/gcc/arm-linux-androideabi/4.8/../../../../arm-linux-androideabi/bin/ld: error: cannot find -lkrait-signal-handler collect2: error: ld returned 1 exit status configure:4569: $? = 1 configure:4607: result: no configure: failed program was: | /* confdefs.h */ | #define PACKAGE_NAME "" | #define PACKAGE_TARNAME "" | #define PACKAGE_VERSION "" | #define PACKAGE_STRING "" | #define PACKAGE_BUGREPORT "" | #define PACKAGE_URL "" | #define PACKAGE "mono" | #define VERSION "2.6.5" | /* end confdefs.h. */ | | int | main () | { | | ; | return 0; | } configure:4612: error: in `/home/jimmy/mono-unity-5.6': configure:4614: error: C compiler cannot create executables See `config.log' for more details ## ---------------- ## ## Cache variables. ## ## ---------------- ## ac_cv_build=x86_64-pc-linux-gnu ac_cv_env_CCASFLAGS_set= ac_cv_env_CCASFLAGS_value= ac_cv_env_CCAS_set= ac_cv_env_CCAS_value= ac_cv_env_CCC_set= ac_cv_env_CCC_value= ac_cv_env_CC_set=set ac_cv_env_CC_value='/home/jimmy/android-ndk_auto-r10e/toolchains/arm-linux-androideabi-4.8/prebuilt/linux-x86/bin/arm-linux-androideabi-gcc --sysroot=/home/jimmy/android-ndk_auto-r10e/platforms/android-9/arch-arm' ac_cv_env_CFLAGS_set=set ac_cv_env_CFLAGS_value='-DANDROID -DPLATFORM_ANDROID -DLINUX -D__linux__ -DHAVE_USR_INCLUDE_MALLOC_H -DPAGE_SIZE=0x1000 -D_POSIX_PATH_MAX=256 -DS_IWRITE=S_IWUSR -DHAVE_PTHREAD_MUTEX_TIMEDLOCK -fpic -g -funwind-tables -ffunction-sections -fdata-sections -DARM_FPU_NONE=1 -march=armv5te -mtune=xscale -msoft-float' ac_cv_env_CPPFLAGS_set=set ac_cv_env_CPPFLAGS_value='-DANDROID -DPLATFORM_ANDROID -DLINUX -D__linux__ -DHAVE_USR_INCLUDE_MALLOC_H -DPAGE_SIZE=0x1000 -D_POSIX_PATH_MAX=256 -DS_IWRITE=S_IWUSR -DHAVE_PTHREAD_MUTEX_TIMEDLOCK -fpic -g -funwind-tables -ffunction-sections -fdata-sections -DARM_FPU_NONE=1 -march=armv5te -mtune=xscale -msoft-float' ac_cv_env_CPP_set=set ac_cv_env_CPP_value=/home/jimmy/android-ndk_auto-r10e/toolchains/arm-linux-androideabi-4.8/prebuilt/linux-x86/bin/arm-linux-androideabi-cpp ac_cv_env_CXXCPP_set=set ac_cv_env_CXXCPP_value=/home/jimmy/android-ndk_auto-r10e/toolchains/arm-linux-androideabi-4.8/prebuilt/linux-x86/bin/arm-linux-androideabi-cpp ac_cv_env_CXXFLAGS_set=set ac_cv_env_CXXFLAGS_value='-DANDROID -DPLATFORM_ANDROID -DLINUX -D__linux__ -DHAVE_USR_INCLUDE_MALLOC_H -DPAGE_SIZE=0x1000 -D_POSIX_PATH_MAX=256 -DS_IWRITE=S_IWUSR -DHAVE_PTHREAD_MUTEX_TIMEDLOCK -fpic -g -funwind-tables -ffunction-sections -fdata-sections -DARM_FPU_NONE=1 -march=armv5te -mtune=xscale -msoft-float' ac_cv_env_CXX_set=set ac_cv_env_CXX_value='/home/jimmy/android-ndk_auto-r10e/toolchains/arm-linux-androideabi-4.8/prebuilt/linux-x86/bin/arm-linux-androideabi-g++ --sysroot=/home/jimmy/android-ndk_auto-r10e/platforms/android-9/arch-arm' ac_cv_env_LDFLAGS_set=set ac_cv_env_LDFLAGS_value='-Wl,--wrap,sigaction -L/home/jimmy/mono-unity-5.6/../../android_krait_signal_handler/build/obj/local/armeabi -lkrait-signal-handler -Wl,--no-undefined -Wl,--gc-sections -Wl,-rpath-link=/home/jimmy/android-ndk_auto-r10e/platforms/android-9/arch-arm/usr/lib -ldl -lm -llog -lc ' ac_cv_env_LIBS_set= ac_cv_env_LIBS_value= ac_cv_env_LT_SYS_LIBRARY_PATH_set= ac_cv_env_LT_SYS_LIBRARY_PATH_value= ac_cv_env_XMKMF_set= ac_cv_env_XMKMF_value= ac_cv_env_build_alias_set= ac_cv_env_build_alias_value= ac_cv_env_host_alias_set=set ac_cv_env_host_alias_value=arm-eabi-linux ac_cv_env_target_alias_set= ac_cv_env_target_alias_value= ac_cv_host=arm-eabi-linux-gnu ac_cv_path_install='/usr/bin/install -c' ac_cv_path_mkdir=/bin/mkdir ac_cv_prog_AWK=gawk ac_cv_prog_CC='/home/jimmy/android-ndk_auto-r10e/toolchains/arm-linux-androideabi-4.8/prebuilt/linux-x86/bin/arm-linux-androideabi-gcc --sysroot=/home/jimmy/android-ndk_auto-r10e/platforms/android-9/arch-arm' ac_cv_prog_STRIP=/home/jimmy/android-ndk_auto-r10e/toolchains/arm-linux-androideabi-4.8/prebuilt/linux-x86/bin/arm-linux-androideabi-strip ac_cv_prog_make_make_set=yes ac_cv_target=arm-eabi-linux-gnu am_cv_make_support_nested_variables=yes am_cv_prog_tar_ustar=gnutar mono_cv_uscore=yes ## ----------------- ## ## Output variables. ## ## ----------------- ## ACLOCAL='${SHELL} /home/jimmy/mono-unity-5.6/missing aclocal-1.15' ALPHA_FALSE='' ALPHA_TRUE='' AMD64_FALSE='' AMD64_TRUE='' AMDEPBACKSLASH='' AMDEP_FALSE='' AMDEP_TRUE='' AMTAR='$${TAR-tar}' AM_BACKSLASH='\' AM_DEFAULT_V='$(AM_DEFAULT_VERBOSITY)' AM_DEFAULT_VERBOSITY='1' AM_V='$(V)' API_VER='1.0' AR='/home/jimmy/android-ndk_auto-r10e/toolchains/arm-linux-androideabi-4.8/prebuilt/linux-x86/bin/arm-linux-androideabi-ar' ARM_FALSE='' ARM_TRUE='' AS='/home/jimmy/android-ndk_auto-r10e/toolchains/arm-linux-androideabi-4.8/prebuilt/linux-x86/bin/arm-linux-androideabi-as' AUTOCONF='${SHELL} /home/jimmy/mono-unity-5.6/missing autoconf' AUTOHEADER='${SHELL} /home/jimmy/mono-unity-5.6/missing autoheader' AUTOMAKE='${SHELL} /home/jimmy/mono-unity-5.6/missing automake-1.15' AWK='gawk' BISON='' BUILD_EXEEXT='' BUILD_GLIB_CFLAGS='' BUILD_GLIB_LIBS='' BUILD_MCS_FALSE='' BUILD_MCS_TRUE='' CC='/home/jimmy/android-ndk_auto-r10e/toolchains/arm-linux-androideabi-4.8/prebuilt/linux-x86/bin/arm-linux-androideabi-gcc --sysroot=/home/jimmy/android-ndk_auto-r10e/platforms/android-9/arch-arm' CCAS='' CCASDEPMODE='' CCASFLAGS='' CCDEPMODE='' CC_FOR_BUILD='' CFLAGS='-DANDROID -DPLATFORM_ANDROID -DLINUX -D__linux__ -DHAVE_USR_INCLUDE_MALLOC_H -DPAGE_SIZE=0x1000 -D_POSIX_PATH_MAX=256 -DS_IWRITE=S_IWUSR -DHAVE_PTHREAD_MUTEX_TIMEDLOCK -fpic -g -funwind-tables -ffunction-sections -fdata-sections -DARM_FPU_NONE=1 -march=armv5te -mtune=xscale -msoft-float' CFLAGS_FOR_BUILD='' CPP='/home/jimmy/android-ndk_auto-r10e/toolchains/arm-linux-androideabi-4.8/prebuilt/linux-x86/bin/arm-linux-androideabi-cpp' CPPFLAGS='-DANDROID -DPLATFORM_ANDROID -DLINUX -D__linux__ -DHAVE_USR_INCLUDE_MALLOC_H -DPAGE_SIZE=0x1000 -D_POSIX_PATH_MAX=256 -DS_IWRITE=S_IWUSR -DHAVE_PTHREAD_MUTEX_TIMEDLOCK -fpic -g -funwind-tables -ffunction-sections -fdata-sections -DARM_FPU_NONE=1 -march=armv5te -mtune=xscale -msoft-float -DGC_LINUX_THREADS -D_GNU_SOURCE -D_REENTRANT -DUSE_MMAP -DUSE_MUNMAP' CROSS_COMPILING_FALSE='' CROSS_COMPILING_TRUE='' CXX='/home/jimmy/android-ndk_auto-r10e/toolchains/arm-linux-androideabi-4.8/prebuilt/linux-x86/bin/arm-linux-androideabi-g++ --sysroot=/home/jimmy/android-ndk_auto-r10e/platforms/android-9/arch-arm' CXXCPP='/home/jimmy/android-ndk_auto-r10e/toolchains/arm-linux-androideabi-4.8/prebuilt/linux-x86/bin/arm-linux-androideabi-cpp' CXXDEPMODE='' CXXFLAGS='-DANDROID -DPLATFORM_ANDROID -DLINUX -D__linux__ -DHAVE_USR_INCLUDE_MALLOC_H -DPAGE_SIZE=0x1000 -D_POSIX_PATH_MAX=256 -DS_IWRITE=S_IWUSR -DHAVE_PTHREAD_MUTEX_TIMEDLOCK -fpic -g -funwind-tables -ffunction-sections -fdata-sections -DARM_FPU_NONE=1 -march=armv5te -mtune=xscale -msoft-float' CYGPATH_W='echo' DEFS='' DEPDIR='' DISABLE_JIT_FALSE='' DISABLE_JIT_TRUE='' DISABLE_MCS_DOCS_FALSE='' DISABLE_MCS_DOCS_TRUE='' DISABLE_PROFILER_FALSE='' DISABLE_PROFILER_TRUE='' DISABLE_SHARED_HANDLES='' DLLTOOL='' DOLT_BASH='' DSYMUTIL='' DTRACE='' DTRACEFLAGS='' DTRACE_G_REQUIRED_FALSE='' DTRACE_G_REQUIRED_TRUE='' DUMPBIN='' ECHO_C='' ECHO_N='-n' ECHO_T='' EGLIB_BUILD_FALSE='' EGLIB_BUILD_TRUE='' EGREP='' ENABLE_DTRACE_FALSE='' ENABLE_DTRACE_TRUE='' ENABLE_LLVM_FALSE='' ENABLE_LLVM_TRUE='' ENABLE_NUNIT_TESTS_FALSE='' ENABLE_NUNIT_TESTS_TRUE='' EXEEXT='' FGREP='' GETTEXT_MACRO_VERSION='' GLIB_CFLAGS='' GLIB_LIBS='' GMODULE_CFLAGS='' GMODULE_LIBS='' GMSGFMT='' GMSGFMT_015='' GREP='' HAVE_BOEHM_GC='' HAVE_MSGFMT='' HAVE_OPROFILE_FALSE='' HAVE_OPROFILE_TRUE='' HAVE_ZLIB_FALSE='' HAVE_ZLIB_TRUE='' HOST_CC='' HPPA_FALSE='' HPPA_TRUE='' IA64_FALSE='' IA64_TRUE='' INCLUDED_LIBGC_FALSE='' INCLUDED_LIBGC_TRUE='' INSTALL_2_0_FALSE='' INSTALL_2_0_TRUE='' INSTALL_2_1_FALSE='' INSTALL_2_1_TRUE='' INSTALL_4_0_FALSE='' INSTALL_4_0_TRUE='' INSTALL_DATA='${INSTALL} -m 644' INSTALL_MONOTOUCH_FALSE='' INSTALL_MONOTOUCH_TRUE='' INSTALL_PROGRAM='${INSTALL}' INSTALL_SCRIPT='${INSTALL}' INSTALL_STRIP_PROGRAM='$(install_sh) -c -s' INSTALL_UNITY_FALSE='' INSTALL_UNITY_TRUE='' INTERP_SUPPORTED_FALSE='' INTERP_SUPPORTED_TRUE='' INTL='' JIT_SUPPORTED_FALSE='' JIT_SUPPORTED_TRUE='' LD='/home/jimmy/android-ndk_auto-r10e/toolchains/arm-linux-androideabi-4.8/prebuilt/linux-x86/bin/arm-linux-androideabi-ld' LDFLAGS='-Wl,--wrap,sigaction -L/home/jimmy/mono-unity-5.6/../../android_krait_signal_handler/build/obj/local/armeabi -lkrait-signal-handler -Wl,--no-undefined -Wl,--gc-sections -Wl,-rpath-link=/home/jimmy/android-ndk_auto-r10e/platforms/android-9/arch-arm/usr/lib -ldl -lm -llog -lc ' LIBC='' LIBGC_CFLAGS='' LIBGC_LIBS='' LIBGC_STATIC_LIBS='' LIBOBJS='' LIBS='' LIBTOOL='' LIPO='' LLVM_CFLAGS='' LLVM_CONFIG='' LLVM_CXXFLAGS='' LLVM_LDFLAGS='' LLVM_LIBS='' LN_S='ln -s' LTCOMPILE='' LTCXXCOMPILE='' LTLIBOBJS='' LT_SYS_LIBRARY_PATH='' M68K_FALSE='' M68K_TRUE='' MAINT='#' MAINTAINER_MODE_FALSE='' MAINTAINER_MODE_TRUE='#' MAKEINFO='${SHELL} /home/jimmy/mono-unity-5.6/missing makeinfo' MANIFEST_TOOL='' MIPS_FALSE='' MIPS_GCC_FALSE='' MIPS_GCC_TRUE='' MIPS_SGI_FALSE='' MIPS_SGI_TRUE='' MIPS_TRUE='' MKDIR_P='/bin/mkdir -p' MONO_DEBUGGER_SUPPORTED_FALSE='' MONO_DEBUGGER_SUPPORTED_TRUE='' MONO_DL_NEED_USCORE='' MSGFMT='' MSGFMT_015='' MSGMERGE='' NM='' NMEDIT='' NO_VERSION_SCRIPT_FALSE='' NO_VERSION_SCRIPT_TRUE='' OBJDUMP='' OBJEXT='' OPROFILE_CFLAGS='' OPROFILE_LIBS='' OTOOL64='' OTOOL='' PACKAGE='mono' PACKAGE_BUGREPORT='' PACKAGE_NAME='' PACKAGE_STRING='' PACKAGE_TARNAME='' PACKAGE_URL='' PACKAGE_VERSION='' PATH_SEPARATOR=':' PKG_CONFIG='' PLATFORM_DARWIN_FALSE='' PLATFORM_DARWIN_TRUE='#' PLATFORM_LINUX_FALSE='#' PLATFORM_LINUX_TRUE='' PLATFORM_SIGPOSIX_FALSE='#' PLATFORM_SIGPOSIX_TRUE='' PLATFORM_WIN32_FALSE='' PLATFORM_WIN32_TRUE='#' POWERPC64_FALSE='' POWERPC64_TRUE='' POWERPC_FALSE='' POWERPC_TRUE='' RANLIB='/home/jimmy/android-ndk_auto-r10e/toolchains/arm-linux-androideabi-4.8/prebuilt/linux-x86/bin/arm-linux-androideabi-ranlib' S390_FALSE='' S390_TRUE='' S390x_FALSE='' S390x_TRUE='' SED='' SET_MAKE='' SHELL='/bin/bash' SPARC64_FALSE='' SPARC64_TRUE='' SPARC_FALSE='' SPARC_TRUE='' SQLITE3='' SQLITE='' STATIC_MONO_FALSE='' STATIC_MONO_TRUE='' STRIP='/home/jimmy/android-ndk_auto-r10e/toolchains/arm-linux-androideabi-4.8/prebuilt/linux-x86/bin/arm-linux-androideabi-strip' USE_BATCH_FILES_FALSE='' USE_BATCH_FILES_TRUE='' USE_JIT_FALSE='' USE_JIT_TRUE='' USE_NLS='' VERSION='2.6.5' X11='' X86_FALSE='' X86_TRUE='' XATTR_LIB='' XGETTEXT='' XGETTEXT_015='' XGETTEXT_EXTRA_OPTIONS='' XMKMF='' ac_ct_AR='' ac_ct_CC='' ac_ct_CXX='' ac_ct_DUMPBIN='' am__EXEEXT_FALSE='' am__EXEEXT_TRUE='' am__fastdepCCAS_FALSE='' am__fastdepCCAS_TRUE='' am__fastdepCC_FALSE='' am__fastdepCC_TRUE='' am__fastdepCXX_FALSE='' am__fastdepCXX_TRUE='' am__include='' am__isrc='' am__leading_dot='.' am__nodep='' am__quote='' am__tar='tar --format=ustar -chf - "$$tardir"' am__untar='tar -xf -' arch_target='' bindir='${exec_prefix}/bin' build='x86_64-pc-linux-gnu' build_alias='' build_cpu='x86_64' build_os='linux-gnu' build_vendor='pc' datadir='${datarootdir}' datarootdir='${prefix}/share' docdir='${datarootdir}/doc/${PACKAGE}' docs_dir='' dvidir='${docdir}' eglib_dir='' exec_prefix='NONE' export_ldflags='' host='arm-eabi-linux-gnu' host_alias='arm-eabi-linux' host_cpu='arm' host_os='linux-gnu' host_vendor='eabi' htmldir='${docdir}' ikvm_native_dir='' includedir='${prefix}/include' infodir='${datarootdir}/info' install_sh='${SHELL} /home/jimmy/mono-unity-5.6/install-sh' libdir='${exec_prefix}/lib' libexecdir='${exec_prefix}/libexec' libgc_dir='' libgdiplus_loc='' libmono_cflags='-D_REENTRANT' libmono_ldflags='' libsuffix='' localedir='${datarootdir}/locale' localstatedir='${prefix}/var' mandir='${datarootdir}/man' mcs_topdir='' mcs_topdir_from_srcdir='' mkdir_p='$(MKDIR_P)' mono_build_root='' mono_cfg_dir='' mono_runtime='' oldincludedir='/usr/include' pdfdir='${docdir}' prefix='/home/jimmy/mono-unity-5.6/builds/android' program_transform_name='s,x,x,' psdir='${docdir}' reloc_libdir='lib' runstatedir='${localstatedir}/run' sbindir='${exec_prefix}/sbin' sharedstatedir='${prefix}/com' subdirs='' sysconfdir='${prefix}/etc' target='arm-eabi-linux-gnu' target_alias='' target_cpu='arm' target_os='linux-gnu' target_vendor='eabi' ## ----------- ## ## confdefs.h. ## ## ----------- ## /* confdefs.h */ #define PACKAGE_NAME "" #define PACKAGE_TARNAME "" #define PACKAGE_VERSION "" #define PACKAGE_STRING "" #define PACKAGE_BUGREPORT "" #define PACKAGE_URL "" #define PACKAGE "mono" #define VERSION "2.6.5" configure: exit 77
急急急!!!!跪求大神帮助 faster-rcnn lib编译问题,win10系统下
本人电脑上安装了vs2015,cuda9.0+1060显卡,python3.6,系统win10,框架是mxnet以及pytorch0.4版本,近日在跑github上的faster-rcnn的程序时,发现在build cython模块时出现下面错误,网上似乎没有类似情况,希望有大神碰到类似情况的能帮帮我。 ``` Traceback (most recent call last): File "build.py", line 34, in <module> ffi.build() File "D:\anaconda\lib\site-packages\torch\utils\ffi\__init__.py", line 184, in build _build_extension(ffi, cffi_wrapper_name, target_dir, verbose) File "D:\anaconda\lib\site-packages\torch\utils\ffi\__init__.py", line 108, in _build_extension outfile = ffi.compile(tmpdir=tmpdir, verbose=verbose, target=libname) File "D:\anaconda\lib\site-packages\cffi\api.py", line 697, in compile compiler_verbose=verbose, debug=debug, **kwds) File "D:\anaconda\lib\site-packages\cffi\recompiler.py", line 1520, in recompile compiler_verbose, debug) File "D:\anaconda\lib\site-packages\cffi\ffiplatform.py", line 22, in compile outputfilename = _build(tmpdir, ext, compiler_verbose, debug) File "D:\anaconda\lib\site-packages\cffi\ffiplatform.py", line 51, in _build dist.run_command('build_ext') File "D:\anaconda\lib\distutils\dist.py", line 974, in run_command cmd_obj.run() File "D:\anaconda\lib\site-packages\setuptools\command\build_ext.py", line 78, in run _build_ext.run(self) File "D:\anaconda\lib\site-packages\Cython\Distutils\old_build_ext.py", line 186, in run _build_ext.build_ext.run(self) File "D:\anaconda\lib\distutils\command\build_ext.py", line 308, in run force=self.force) File "D:\anaconda\lib\distutils\ccompiler.py", line 1031, in new_compiler return klass(None, dry_run, force) File "D:\anaconda\lib\distutils\cygwinccompiler.py", line 285, in __init__ CygwinCCompiler.__init__ (self, verbose, dry_run, force) File "D:\anaconda\lib\distutils\cygwinccompiler.py", line 129, in __init__ if self.ld_version >= "2.10.90": TypeError: '>=' not supported between instances of 'NoneType' and 'str' ``` 后来我又试了试用gcc编译器,但是仍然存在一下问题(实在是没办法了。。。) ``` C:\MinGW\bin\g++.exe --shared -s build\temp.win-amd64-3.6\Release\gpu_nms.o build\temp.win-amd64-3.6\Release\gpu_nms.cp36-win_amd64.def -LD:\anaconda\libs -LD:\anaconda\PCbuild\amd64 -lcublas -lpython36 -lmsvcr140 -o build\lib.win-amd64-3.6\gpu_nms.cp36-win_amd64.pyd build\temp.win-amd64-3.6\Release\gpu_nms.o: file not recognized: File format not recognized collect2.exe: error: ld returned 1 exit status error: command 'C:\\MinGW\\bin\\g++.exe' failed with exit status 1 ```
在Xcode环境下无法配置gnu gsl库
在自动配置的时候遇到错误 有没有大神能告诉我如何自动配置或者手动配置的参数呢? 下面是config.log This file contains any messages produced by compilers while running configure, to aid debugging if configure makes a mistake. It was created by gsl configure 1.9, which was generated by GNU Autoconf 2.59. Invocation command line was $ ./configure ## --------- ## ## Platform. ## ## --------- ## hostname = admindeMac-Pro.local uname -m = x86_64 uname -r = 13.0.0 uname -s = Darwin uname -v = Darwin Kernel Version 13.0.0: Thu Sep 19 22:22:27 PDT 2013; root:xnu-2422.1.72~6/RELEASE_X86_64 /usr/bin/uname -p = i386 /bin/uname -X = unknown /bin/arch = unknown /usr/bin/arch -k = unknown /usr/convex/getsysinfo = unknown hostinfo = Mach kernel version: Darwin Kernel Version 13.0.0: Thu Sep 19 22:22:27 PDT 2013; root:xnu-2422.1.72~6/RELEASE_X86_64 Kernel configured for up to 8 processors. 4 processors are physically available. 8 processors are logically available. Processor type: i486 (Intel 80486) Processors active: 0 1 2 3 4 5 6 7 Primary memory available: 16.00 gigabytes Default processor set: 142 tasks, 528 threads, 8 processors Load average: 1.33, Mach factor: 6.66 /bin/machine = unknown /usr/bin/oslevel = unknown /bin/universe = unknown PATH: /usr/bin PATH: /bin PATH: /usr/sbin PATH: /sbin PATH: /usr/local/bin ## ----------- ## ## Core tests. ## ## ----------- ## configure:1521: checking for a BSD-compatible install configure:1576: result: /usr/bin/install -c configure:1587: checking whether build environment is sane configure:1630: result: yes configure:1695: checking for gawk configure:1724: result: no configure:1695: checking for mawk configure:1724: result: no configure:1695: checking for nawk configure:1724: result: no configure:1695: checking for awk configure:1711: found /usr/bin/awk configure:1721: result: awk configure:1731: checking whether make sets $(MAKE) configure:1751: result: yes configure:1921: checking whether to enable maintainer-specific portions of Makefiles configure:1930: result: no configure:1968: checking whether make sets $(MAKE) configure:1988: result: yes configure:2004: checking build system type configure:2022: result: i386-apple-darwin13.0.0 configure:2030: checking host system type configure:2044: result: i386-apple-darwin13.0.0 configure:2105: checking for gcc configure:2121: found /usr/bin/gcc configure:2131: result: gcc configure:2375: checking for C compiler version configure:2378: gcc --version </dev/null >&5 i686-apple-darwin11-llvm-gcc-4.2 (GCC) 4.2.1 (Based on Apple Inc. build 5658) (LLVM build 2336.11.00) Copyright (C) 2007 Free Software Foundation, Inc. This is free software; see the source for copying conditions. There is NO warranty; not even for MERCHANTABILITY or FITNESS FOR A PARTICULAR PURPOSE. configure:2381: $? = 0 configure:2383: gcc -v </dev/null >&5 Using built-in specs. Target: i686-apple-darwin11 Configured with: /private/var/tmp/llvmgcc42/llvmgcc42-2336.11~67/src/configure --disable-checking --enable-werror --prefix=/Applications/Xcode.app/Contents/Developer/usr/llvm-gcc-4.2 --mandir=/share/man --enable-languages=c,objc,c++,obj-c++ --program-prefix=llvm- --program-transform-name=/^[cg][^.-]*$/s/$/-4.2/ --with-slibdir=/usr/lib --build=i686-apple-darwin11 --enable-llvm=/private/var/tmp/llvmgcc42/llvmgcc42-2336.11~67/dst-llvmCore/Developer/usr/local --program-prefix=i686-apple-darwin11- --host=x86_64-apple-darwin11 --target=i686-apple-darwin11 --with-gxx-include-dir=/usr/include/c++/4.2.1 Thread model: posix gcc version 4.2.1 (Based on Apple Inc. build 5658) (LLVM build 2336.11.00) configure:2386: $? = 0 configure:2388: gcc -V </dev/null >&5 llvm-gcc-4.2: argument to `-V' is missing configure:2391: $? = 1 configure:2414: checking for C compiler default output file name configure:2417: gcc conftest.c >&5 ld: library not found for -lcrt1.10.6.o collect2: ld returned 1 exit status configure:2420: $? = 1 configure: failed program was: | /* confdefs.h. */ | | #define PACKAGE_NAME "gsl" | #define PACKAGE_TARNAME "gsl" | #define PACKAGE_VERSION "1.9" | #define PACKAGE_STRING "gsl 1.9" | #define PACKAGE_BUGREPORT "" | #define PACKAGE "gsl" | #define VERSION "1.9" | #define RELEASED 1 | /* end confdefs.h. */ | | int | main () | { | | ; | return 0; | } configure:2459: error: C compiler cannot create executables See `config.log' for more details. ## ---------------- ## ## Cache variables. ## ## ---------------- ## ac_cv_build=i386-apple-darwin13.0.0 ac_cv_build_alias=i386-apple-darwin13.0.0 ac_cv_env_CC_set= ac_cv_env_CC_value= ac_cv_env_CFLAGS_set= ac_cv_env_CFLAGS_value= ac_cv_env_CPPFLAGS_set= ac_cv_env_CPPFLAGS_value= ac_cv_env_CPP_set= ac_cv_env_CPP_value= ac_cv_env_LDFLAGS_set= ac_cv_env_LDFLAGS_value= ac_cv_env_build_alias_set= ac_cv_env_build_alias_value= ac_cv_env_host_alias_set= ac_cv_env_host_alias_value= ac_cv_env_target_alias_set= ac_cv_env_target_alias_value= ac_cv_host=i386-apple-darwin13.0.0 ac_cv_host_alias=i386-apple-darwin13.0.0 ac_cv_path_install='/usr/bin/install -c' ac_cv_prog_AWK=awk ac_cv_prog_ac_ct_CC=gcc ac_cv_prog_make_make_set=yes ## ----------------- ## ## Output variables. ## ## ----------------- ## ACLOCAL='${SHELL} /Users/admin/Downloads/gsl-1.9/missing --run aclocal-1.9' AMTAR='${SHELL} /Users/admin/Downloads/gsl-1.9/missing --run tar' AR='' AUTOCONF='${SHELL} /Users/admin/Downloads/gsl-1.9/missing --run autoconf' AUTOHEADER='${SHELL} /Users/admin/Downloads/gsl-1.9/missing --run autoheader' AUTOMAKE='${SHELL} /Users/admin/Downloads/gsl-1.9/missing --run automake-1.9' AWK='awk' CC='gcc' CFLAGS='' CPP='' CPPFLAGS='' CYGPATH_W='echo' DEFS='' ECHO='/bin/echo' ECHO_C='ECHO_N='' ECHO_T='' EGREP='' EXEEXT='' GSL_CFLAGS='' GSL_LIBS='' GSL_LT_CBLAS_VERSION='0:0:0' GSL_LT_VERSION='10:0:10' HAVE_AIX_IEEE_INTERFACE='' HAVE_DARWIN86_IEEE_INTERFACE='' HAVE_DARWIN_IEEE_INTERFACE='' HAVE_EXTENDED_PRECISION_REGISTERS='' HAVE_FREEBSD_IEEE_INTERFACE='' HAVE_GNUM68K_IEEE_INTERFACE='' HAVE_GNUPPC_IEEE_INTERFACE='' HAVE_GNUSPARC_IEEE_INTERFACE='' HAVE_GNUX86_IEEE_INTERFACE='' HAVE_HPUX11_IEEE_INTERFACE='' HAVE_HPUX_IEEE_INTERFACE='' HAVE_IEEE_COMPARISONS='' HAVE_IEEE_DENORMALS='' HAVE_INLINE='' HAVE_IRIX_IEEE_INTERFACE='' HAVE_NETBSD_IEEE_INTERFACE='' HAVE_OPENBSD_IEEE_INTERFACE='' HAVE_OS2EMX_IEEE_INTERFACE='' HAVE_PRINTF_LONGDOUBLE='' HAVE_SOLARIS_IEEE_INTERFACE='' HAVE_SUNOS4_IEEE_INTERFACE='' HAVE_TRU64_IEEE_INTERFACE='' INSTALL_DATA='${INSTALL} -m 644' INSTALL_PROGRAM='${INSTALL}' INSTALL_SCRIPT='${INSTALL}' INSTALL_STRIP_PROGRAM='${SHELL} $(install_sh) -c -s' LDFLAGS='' LIBOBJS='' LIBS='' LIBTOOL='' LN_S='' LTLIBOBJS='' MAINT='#' MAINTAINER_MODE_FALSE='' MAINTAINER_MODE_TRUE='#' MAKEINFO='${SHELL} /Users/admin/Downloads/gsl-1.9/missing --run makeinfo' OBJEXT='' PACKAGE='gsl' PACKAGE_BUGREPORT='' PACKAGE_NAME='gsl' PACKAGE_STRING='gsl 1.9' PACKAGE_TARNAME='gsl' PACKAGE_VERSION='1.9' PATH_SEPARATOR=':' RANLIB='' RELEASED='' SET_MAKE='' SHELL='/bin/sh' STRIP='' VERSION='1.9' ac_ct_AR='' ac_ct_CC='gcc' ac_ct_RANLIB='' ac_ct_STRIP='' am__leading_dot='.' am__tar='${AMTAR} chof - "$$tardir"' am__untar='${AMTAR} xf -' bindir='${exec_prefix}/bin' build='i386-apple-darwin13.0.0' build_alias='' build_cpu='i386' build_os='darwin13.0.0' build_vendor='apple' datadir='${prefix}/share' exec_prefix='NONE' host='i386-apple-darwin13.0.0' host_alias='' host_cpu='i386' host_os='darwin13.0.0' host_vendor='apple' includedir='${prefix}/include' infodir='${prefix}/info' install_sh='/Users/admin/Downloads/gsl-1.9/install-sh' libdir='${exec_prefix}/lib' libexecdir='${exec_prefix}/libexec' localstatedir='${prefix}/var' mandir='${prefix}/man' mkdir_p='$(mkinstalldirs)' oldincludedir='/usr/include' prefix='NONE' program_transform_name='s,x,x,' sbindir='${exec_prefix}/sbin' sharedstatedir='${prefix}/com' sysconfdir='${prefix}/etc' target_alias='' ## ----------- ## ## confdefs.h. ## ## ----------- ## #define PACKAGE "gsl" #define PACKAGE_BUGREPORT "" #define PACKAGE_NAME "gsl" #define PACKAGE_STRING "gsl 1.9" #define PACKAGE_TARNAME "gsl" #define PACKAGE_VERSION "1.9" #define RELEASED 1 #define VERSION "1.9" configure: exit 77
RK3328平台android8.1编译报错
-fPIC -no-canonical-prefixes -U_FORTIFY_SOURCE -D_FORTIFY_SOURCE=2 -fstack-protector -D__STDC_FORMAT_MACROS -D__STDC_CONSTANT_MACROS -O2 -g -fno-strict-aliasing --gcc-toolchain=prebuilts/gcc/linux-x86/host/x86_64-linux-glibc2.15-4.8 --sysroot prebuilts/gcc/linux-x86/host/x86_64-linux-glibc2.15-4.8/sysroot -fstack-protector-strong -m64 -DANDROID -fmessage-length=0 -W -Wall -Wno-unused -Winit-self -Wpointer-arith -DNDEBUG -UDEBUG -fdebug-prefix-map=/proc/self/cwd= -D__compiler_offsetof=__builtin_offsetof -Werror=int-conversion -Wno-reserved-id-macro -Wno-format-pedantic -Wno-unused-command-line-argument -fcolor-diagnostics -Wno-expansion-to-defined -fdebug-prefix-map=\$PWD/= -target x86_64-linux-gnu -Bprebuilts/gcc/linux-x86/host/x86_64-linux-glibc2.15-4.8/x86_64-linux/bin -Wsign-promo -Wno-inconsistent-missing-override -Wno-null-dereference -D_LIBCPP_ENABLE_THREAD_SAFETY_ANNOTATIONS -Wno-thread-safety-negative -isystem prebuilts/gcc/linux-x86/host/x86_64-linux-glibc2.15-4.8/x86_64-linux/include/c++/4.8 -isystem prebuilts/gcc/linux-x86/host/x86_64-linux-glibc2.15-4.8/x86_64-linux/include/c++/4.8/backward -isystem prebuilts/gcc/linux-x86/host/x86_64-linux-glibc2.15-4.8/x86_64-linux/include/c++/4.8/x86_64-linux -std=gnu++14 -Wall -Werror -fPIE -D_USING_LIBCXX -DANDROID_STRICT -nostdinc++ -Werror=int-to-pointer-cast -Werror=pointer-to-int-cast -Werror=address-of-temporary -Werror=return-type -MD -MF out/host/linux-x86/obj/EXECUTABLES/validatekeymaps_intermediates/Main.d -o out/host/linux-x86/obj/EXECUTABLES/validatekeymaps_intermediates/Main.o frameworks/base/tools/validatekeymaps/Main.cpp" Traceback (most recent call last): File "prebuilts/clang/host/linux-x86/clang-4053586/bin/clang++", line 4, in <module> import shlex ImportError: No module named shlex [ 0% 29/76723] host C++: conscrypt_ge...nts/src/gen/cpp/generate_constants.cpp FAILED: out/host/linux-x86/obj/EXECUTABLES/conscrypt_generate_constants_intermediates/constants/src/gen/cpp/generate_constants.o /bin/bash -c "PWD=/proc/self/cwd prebuilts/clang/host/linux-x86/clang-4053586/bin/clang++ -I external/conscrypt -I out/host/linux-x86/obj/EXECUTABLES/conscrypt_generate_constants_intermediates -I out/host/linux-x86/gen/EXECUTABLES/conscrypt_generate_constants_intermediates -I libnativehelper/include_deprecated \$(cat out/host/linux-x86/obj/EXECUTABLES/conscrypt_generate_constants_intermediates/import_includes) -I system/core/include -I system/media/audio/include -I hardware/libhardware/include -I hardware/libhardware_legacy/include -I hardware/ril/include -I libnativehelper/include -I frameworks/native/include -I frameworks/native/opengl/include -I frameworks/av/include -c -fno-exceptions -Wno-multichar -Wa,--noexecstack -fPIC -no-canonical-prefixes -U_FORTIFY_SOURCE -D_FORTIFY_SOURCE=2 -fstack-protector -D__STDC_FORMAT_MACROS -D__STDC_CONSTANT_MACROS -O2 -g -fno-strict-aliasing --gcc-toolchain=prebuilts/gcc/linux-x86/host/x86_64-linux-glibc2.15-4.8 --sysroot prebuilts/gcc/linux-x86/host/x86_64-linux-glibc2.15-4.8/sysroot -fstack-protector-strong -m64 -DANDROID -fmessage-length=0 -W -Wall -Wno-unused -Winit-self -Wpointer-arith -DNDEBUG -UDEBUG -fdebug-prefix-map=/proc/self/cwd= -D__compiler_offsetof=__builtin_offsetof -Werror=int-conversion -Wno-reserved-id-macro -Wno-format-pedantic -Wno-unused-command-line-argument -fcolor-diagnostics -Wno-expansion-to-defined -fdebug-prefix-map=\$PWD/= -target x86_64-linux-gnu -Bprebuilts/gcc/linux-x86/host/x86_64-linux-glibc2.15-4.8/x86_64-linux/bin -Wsign-promo -Wno-inconsistent-missing-override -Wno-null-dereference -D_LIBCPP_ENABLE_THREAD_SAFETY_ANNOTATIONS -Wno-thread-safety-negative -isystem prebuilts/gcc/linux-x86/host/x86_64-linux-glibc2.15-4.8/x86_64-linux/include/c++/4.8 -isystem prebuilts/gcc/linux-x86/host/x86_64-linux-glibc2.15-4.8/x86_64-linux/include/c++/4.8/backward -isystem prebuilts/gcc/linux-x86/host/x86_64-linux-glibc2.15-4.8/x86_64-linux/include/c++/4.8/x86_64-linux -std=gnu++14 -fPIE -D_USING_LIBCXX -nostdinc++ -Werror=int-to-pointer-cast -Werror=pointer-to-int-cast -Werror=address-of-temporary -Werror=return-type -MD -MF out/host/linux-x86/obj/EXECUTABLES/conscrypt_generate_constants_intermediates/constants/src/gen/cpp/generate_constants.d -o out/host/linux-x86/obj/EXECUTABLES/conscrypt_generate_constants_intermediates/constants/src/gen/cpp/generate_constants.o external/conscrypt/constants/src/gen/cpp/generate_constants.cpp" Traceback (most recent call last): File "prebuilts/clang/host/linux-x86/clang-4053586/bin/clang++", line 4, in <module> import shlex ImportError: No module named shlex [ 0% 30/76723] host C++: protoc-gen-j...tools/streaming_proto/string_utils.cpp FAILED: out/host/linux-x86/obj/EXECUTABLES/protoc-gen-javastream_intermediates/string_utils.o /bin/bash -c "PWD=/proc/self/cwd prebuilts/clang/host/linux-x86/clang-4053586/bin/clang++ -I frameworks/base/tools/streaming_proto -I out/host/linux-x86/obj/EXECUTABLES/protoc-gen-javastream_intermediates -I out/host/linux-x86/gen/EXECUTABLES/protoc-gen-javastream_intermediates -I libnativehelper/include_deprecated \$(cat out/host/linux-x86/obj/EXECUTABLES/protoc-gen-javastream_intermediates/import_includes) -I system/core/include -I system/media/audio/include -I hardware/libhardware/include -I hardware/libhardware_legacy/include -I hardware/ril/include -I libnativehelper/include -I frameworks/native/include -I frameworks/native/opengl/include -I frameworks/av/include -c -fno-exceptions -Wno-multichar -Wa,--noexecstack -fPIC -no-canonical-prefixes -U_FORTIFY_SOURCE -D_FORTIFY_SOURCE=2 -fstack-protector -D__STDC_FORMAT_MACROS -D__STDC_CONSTANT_MACROS -O2 -g -fno-strict-aliasing --gcc-toolchain=prebuilts/gcc/linux-x86/host/x86_64-linux-glibc2.15-4.8 --sysroot prebuilts/gcc/linux-x86/host/x86_64-linux-glibc2.15-4.8/sysroot -fstack-protector-strong -m64 -DANDROID -fmessage-length=0 -W -Wall -Wno-unused -Winit-self -Wpointer-arith -DNDEBUG -UDEBUG -fdebug-prefix-map=/proc/self/cwd= -D__compiler_offsetof=__builtin_offsetof -Werror=int-conversion -Wno-reserved-id-macro -Wno-format-pedantic -Wno-unused-command-line-argument -fcolor-diagnostics -Wno-expansion-to-defined -fdebug-prefix-map=\$PWD/= -target x86_64-linux-gnu -Bprebuilts/gcc/linux-x86/host/x86_64-linux-glibc2.15-4.8/x86_64-linux/bin -Wsign-promo -Wno-inconsistent-missing-override -Wno-null-dereference -D_LIBCPP_ENABLE_THREAD_SAFETY_ANNOTATIONS -Wno-thread-safety-negative -isystem prebuilts/gcc/linux-x86/host/x86_64-linux-glibc2.15-4.8/x86_64-linux/include/c++/4.8 -isystem prebuilts/gcc/linux-x86/host/x86_64-linux-glibc2.15-4.8/x86_64-linux/include/c++/4.8/backward -isystem prebuilts/gcc/linux-x86/host/x86_64-linux-glibc2.15-4.8/x86_64-linux/include/c++/4.8/x86_64-linux -std=gnu++14 -fPIE -D_USING_LIBCXX -DANDROID_STRICT -nostdinc++ -Werror=int-to-pointer-cast -Werror=pointer-to-int-cast -Werror=address-of-temporary -Werror=return-type -MD -MF out/host/linux-x86/obj/EXECUTABLES/protoc-gen-javastream_intermediates/string_utils.d -o out/host/linux-x86/obj/EXECUTABLES/protoc-gen-javastream_intermediates/string_utils.o frameworks/base/tools/streaming_proto/string_utils.cpp" Traceback (most recent call last): File "prebuilts/clang/host/linux-x86/clang-4053586/bin/clang++", line 4, in <module> import shlex ImportError: No module named shlex [ 0% 49/76723] build out/target/common/obj/all-event-log-tags.txt ninja: build stopped: subcommand failed. 17:38:37 ninja failed with: exit status 1 make: *** [run_soong_ui] Error 1 jda@jda-ubut12-ser:rk3328_8.1_box_190306$
嵌入式2.6.32内核挂载根文件系统root.cramfs失败
Copy linux kernel from 0x00030000 to 0x30008000, size = 0x00300000 ... done zImage magic = 0x016f2818 Setup linux parameters at 0x30000100 linux command line is: "noinitrd root=/dev/mtdblock3 init=/linuxrc console=ttyS"MACH_TYPE = 193 NOW, Booting Linux...... Uncompressing Linux.............................................................Linux version 2.6.32.63 (rival@ubuntu) (gcc version 4.4.3 (ctng-1.6.1) ) #7 Sat4CPU: ARM920T [41129200] revision 0 (ARMv4T), cr=c0007177 CPU: VIVT data cache, VIVT instruction cache Machine: SMDK2410 ATAG_INITRD is deprecated; please update your bootloader. Memory policy: ECC disabled, Data cache writeback CPU S3C2410A (id 0x32410002) S3C24XX Clocks, (c) 2004 Simtec Electronics S3C2410: core 200.000 MHz, memory 100.000 MHz, peripheral 50.000 MHz CLOCK: Slow mode (1.500 MHz), fast, MPLL on, UPLL on Built 1 zonelists in Zone order, mobility grouping on. Total pages: 16256 Kernel command line: noinitrd root=/dev/mtdblock3 init=/linuxrc console=ttySAC0sPID hash table entries: 256 (order: -2, 1024 bytes) Dentry cache hash table entries: 8192 (order: 3, 32768 bytes) Inode-cache hash table entries: 4096 (order: 2, 16384 bytes) Memory: 64MB = 64MB total Memory: 60664KB available (3708K code, 342K data, 156K init, 0K highmem) Hierarchical RCU implementation. NR_IRQS:99 irq: clearing pending ext status 00080000 irq: clearing subpending status 00000002 Console: colour dummy device 80x30 console [ttySAC0] enabled Calibrating delay loop... 99.53 BogoMIPS (lpj=248832) Mount-cache hash table entries: 512 CPU: Testing write buffer coherency: ok NET: Registered protocol family 16 S3C Power Management, Copyright 2004 Simtec Electronics S3C2410: Initialising architecture S3C24XX DMA Driver, (c) 2003-2004,2006 Simtec Electronics DMA channel 0 at c4808000, irq 33 DMA channel 1 at c4808040, irq 34 DMA channel 2 at c4808080, irq 35 DMA channel 3 at c48080c0, irq 36 bio: create slab <bio-0> at 0 SCSI subsystem initialized usbcore: registered new interface driver usbfs usbcore: registered new interface driver hub usbcore: registered new device driver usb s3c-i2c s3c2410-i2c: slave address 0x10 s3c-i2c s3c2410-i2c: bus frequency set to 97 KHz s3c-i2c s3c2410-i2c: i2c-0: S3C I2C adapter NET: Registered protocol family 2 IP route cache hash table entries: 1024 (order: 0, 4096 bytes) TCP established hash table entries: 2048 (order: 2, 16384 bytes) TCP bind hash table entries: 2048 (order: 1, 8192 bytes) TCP: Hash tables configured (established 2048 bind 2048) TCP reno registered NET: Registered protocol family 1 RPC: Registered udp transport module. RPC: Registered tcp transport module. RPC: Registered tcp NFSv4.1 backchannel transport module. NetWinder Floating Point Emulator V0.97 (extended precision) JFFS2 version 2.2. (NAND) (SUMMARY) .. 2001-2006 Red Hat, Inc. ROMFS MTD (C) 2007 Red Hat, Inc. msgmni has been set to 118 io scheduler noop registered io scheduler anticipatory registered (default) io scheduler deadline registered io scheduler cfq registered s3c2410-lcd s3c2410-lcd: no platform data for lcd, cannot attach s3c2410-lcd: probe of s3c2410-lcd failed with error -22 lp: driver loaded but no devices found ppdev: user-space parallel port driver Serial: 8250/16550 driver, 4 ports, IRQ sharing enabled s3c2410-uart.0: s3c2410_serial0 at MMIO 0x50000000 (irq = 70) is a S3C2410 s3c2410-uart.1: s3c2410_serial1 at MMIO 0x50004000 (irq = 73) is a S3C2410 s3c2410-uart.2: s3c2410_serial2 at MMIO 0x50008000 (irq = 76) is a S3C2410 brd: module loaded loop: module loaded Uniform Multi-Platform E-IDE driver ide-gd driver 1.18 ide-cd driver 5.00 S3C24XX NAND Driver, (c) 2004 Simtec Electronics s3c24xx-nand s3c2410-nand: Tacls=2, 20ns Twrph0=6 60ns, Twrph1=2 20ns s3c24xx-nand s3c2410-nand: NAND ECC disabled NAND device: Manufacturer ID: 0xec, Chip ID: 0x76 (Samsung NAND 64MiB 3,3V 8-bi)NAND_ECC_NONE selected by board driver. This is not recommended !! Scanning device for bad blocks Bad eraseblock 633 at 0x0000009e4000 Bad eraseblock 1824 at 0x000001c80000 Creating 6 MTD partitions on "NAND 64MiB 3,3V 8-bit": 0x000000000000-0x000000020000 : "vivi" 0x000000020000-0x000000030000 : "param" 0x000000030000-0x000000330000 : "kernel" 0x000000330000-0x000000630000 : "root" 0x000000630000-0x000003d30000 : "yaffs" 0x000003d30000-0x000003dfc000 : "ucos" dm9000 Ethernet Driver, V1.31 usbmon: debugfs is not available ohci_hcd: USB 1.1 'Open' Host Controller (OHCI) Driver s3c2410-ohci s3c2410-ohci: S3C24XX OHCI s3c2410-ohci s3c2410-ohci: new USB bus registered, assigned bus number 1 s3c2410-ohci s3c2410-ohci: irq 42, io mem 0x49000000 usb usb1: configuration #1 chosen from 1 choice hub 1-0:1.0: USB hub found hub 1-0:1.0: 2 ports detected usbcore: registered new interface driver libusual usbcore: registered new interface driver usbserial USB Serial support registered for generic usbcore: registered new interface driver usbserial_generic usbserial: USB Serial Driver core USB Serial support registered for FTDI USB Serial Device usbcore: registered new interface driver ftdi_sio ftdi_sio: v1.5.0:USB FTDI Serial Converters Driver USB Serial support registered for pl2303 usbcore: registered new interface driver pl2303 pl2303: Prolific PL2303 USB to serial adaptor driver mice: PS/2 mouse device common for all mice S3C24XX RTC, (c) 2004,2006 Simtec Electronics s3c2410-rtc s3c2410-rtc: rtc disabled, re-enabling s3c2410-rtc s3c2410-rtc: rtc core: registered s3c as rtc0 S3C2410 Watchdog Timer, (c) 2004 Simtec Electronics s3c2410-wdt s3c2410-wdt: watchdog inactive, reset disabled, irq enabled Advanced Linux Sound Architecture Driver Version 1.0.21. No device for DAI UDA134X No device for DAI s3c24xx-i2s ALSA device list: No soundcards found. TCP cubic registered NET: Registered protocol family 17 s3c2410-rtc s3c2410-rtc: hctosys: invalid date/time List of all partitions: 1f00 128 mtdblock0 (driver?) 1f01 64 mtdblock1 (driver?) 1f02 3072 mtdblock2 (driver?) 1f03 3072 mtdblock3 (driver?) 1f04 56320 mtdblock4 (driver?) 1f05 816 mtdblock5 (driver?) No filesystem could mount root, tried: cramfs Kernel panic - not syncing: VFS: Unable to mount root fs on unknown-block(31,3) Backtrace: [<c0033984>] (dump_backtrace+0x0/0x114) from [<c02f5a40>] (dump_stack+0x18/0x1c) r6:00008000 r5:c388b007 r4:c03f6ae4 [<c02f5a28>] (dump_stack+0x0/0x1c) from [<c02f5a90>] (panic+0x4c/0x11c) [<c02f5a44>] (panic+0x0/0x11c) from [<c00090fc>] (mount_block_root+0x1d8/0x218) r3:00000003 r2:80000000 r1:c381bf64 r0:c0372cc6 [<c0008f24>] (mount_block_root+0x0/0x218) from [<c0009200>] (mount_root+0xc4/0x)[<c000913c>] (mount_root+0x0/0xfc) from [<c00093a4>] (prepare_namespace+0x16c/0) r5:c0028829 r4:c03f6234 [<c0009238>] (prepare_namespace+0x0/0x1c0) from [<c0008630>] (kernel_init+0xe8/) r5:c0027104 r4:c03f6000 [<c0008548>] (kernel_init+0x0/0x120) from [<c005637c>] (do_exit+0x0/0x5dc) r5:00
终于明白阿里百度这样的大公司,为什么面试经常拿ThreadLocal考验求职者了
点击上面↑「爱开发」关注我们每晚10点,捕获技术思考和创业资源洞察什么是ThreadLocalThreadLocal是一个本地线程副本变量工具类,各个线程都拥有一份线程私...
《奇巧淫技》系列-python!!每天早上八点自动发送天气预报邮件到QQ邮箱
将代码部署服务器,每日早上定时获取到天气数据,并发送到邮箱。 也可以说是一个小人工智障。 思路可以运用在不同地方,主要介绍的是思路。
加快推动区块链技术和产业创新发展,2019可信区块链峰会在京召开
11月8日,由中国信息通信研究院、中国通信标准化协会、中国互联网协会、可信区块链推进计划联合主办,科技行者协办的2019可信区块链峰会将在北京悠唐皇冠假日酒店开幕。   区块链技术被认为是继蒸汽机、电力、互联网之后,下一代颠覆性的核心技术。如果说蒸汽机释放了人类的生产力,电力解决了人类基本的生活需求,互联网彻底改变了信息传递的方式,区块链作为构造信任的技术有重要的价值。   1...
阿里面试官问我:如何设计秒杀系统?我的回答让他比起大拇指
你知道的越多,你不知道的越多 点赞再看,养成习惯 GitHub上已经开源 https://github.com/JavaFamily 有一线大厂面试点脑图和个人联系方式,欢迎Star和指教 前言 Redis在互联网技术存储方面使用如此广泛,几乎所有的后端技术面试官都要在Redis的使用和原理方面对小伙伴们进行360°的刁难。 作为一个在互联网公司面一次拿一次Offer的面霸,打败了...
C语言魔塔游戏
很早就很想写这个,今天终于写完了。 游戏截图: 编译环境: VS2017 游戏需要一些图片,如果有想要的或者对游戏有什么看法的可以加我的QQ 2985486630 讨论,如果暂时没有回应,可以在博客下方留言,到时候我会看到。 下面我来介绍一下游戏的主要功能和实现方式 首先是玩家的定义,使用结构体,这个名字是可以自己改变的 struct gamerole { char n...
面试官问我:什么是消息队列?什么场景需要他?用了会出现什么问题?
你知道的越多,你不知道的越多 点赞再看,养成习惯 GitHub上已经开源 https://github.com/JavaFamily 有一线大厂面试点脑图、个人联系方式和人才交流群,欢迎Star和完善 前言 消息队列在互联网技术存储方面使用如此广泛,几乎所有的后端技术面试官都要在消息队列的使用和原理方面对小伙伴们进行360°的刁难。 作为一个在互联网公司面一次拿一次Offer的面霸...
Android性能优化(4):UI渲染机制以及优化
文章目录1. 渲染机制分析1.1 渲染机制1.2 卡顿现象1.3 内存抖动2. 渲染优化方式2.1 过度绘制优化2.1.1 Show GPU overdraw2.1.2 Profile GPU Rendering2.2 卡顿优化2.2.1 SysTrace2.2.2 TraceView 在从Android 6.0源码的角度剖析View的绘制原理一文中,我们了解到View的绘制流程有三个步骤,即m...
微服务中的Kafka与Micronaut
今天,我们将通过Apache Kafka主题构建一些彼此异步通信的微服务。我们使用Micronaut框架,它为与Kafka集成提供专门的库。让我们简要介绍一下示例系统的体系结构。我们有四个微型服务:订单服务,行程服务,司机服务和乘客服务。这些应用程序的实现非常简单。它们都有内存存储,并连接到同一个Kafka实例。 我们系统的主要目标是为客户安排行程。订单服务应用程序还充当网关。它接收来自客户的请求...
致 Python 初学者们!
作者| 许向武 责编 | 屠敏 出品 | CSDN 博客 前言 在 Python 进阶的过程中,相信很多同学应该大致上学习了很多 Python 的基础知识,也正在努力成长。在此期间,一定遇到了很多的困惑,对未来的学习方向感到迷茫。我非常理解你们所面临的处境。我从2007年开始接触 Python 这门编程语言,从2009年开始单一使用 Python 应对所有的开发工作,直至今...
究竟你适不适合买Mac?
我清晰的记得,刚买的macbook pro回到家,开机后第一件事情,就是上了淘宝网,花了500元钱,找了一个上门维修电脑的师傅,上门给我装了一个windows系统。。。。。。 表砍我。。。 当时买mac的初衷,只是想要个固态硬盘的笔记本,用来运行一些复杂的扑克软件。而看了当时所有的SSD笔记本后,最终决定,还是买个好(xiong)看(da)的。 已经有好几个朋友问我mba怎么样了,所以今天尽量客观...
程序员一般通过什么途径接私活?
二哥,你好,我想知道一般程序猿都如何接私活,我也想接,能告诉我一些方法吗? 上面是一个读者“烦不烦”问我的一个问题。其实不止是“烦不烦”,还有很多读者问过我类似这样的问题。 我接的私活不算多,挣到的钱也没有多少,加起来不到 20W。说实话,这个数目说出来我是有点心虚的,毕竟太少了,大家轻喷。但我想,恰好配得上“一般程序员”这个称号啊。毕竟苍蝇再小也是肉,我也算是有经验的人了。 唾弃接私活、做外...
字节跳动面试官这样问消息队列:分布式事务、重复消费、顺序消费,我整理了一下
你知道的越多,你不知道的越多 点赞再看,养成习惯 GitHub上已经开源 https://github.com/JavaFamily 有一线大厂面试点脑图、个人联系方式和人才交流群,欢迎Star和完善 前言 消息队列在互联网技术存储方面使用如此广泛,几乎所有的后端技术面试官都要在消息队列的使用和原理方面对小伙伴们进行360°的刁难。 作为一个在互联网公司面一次拿一次Offer的面霸...
Python爬虫爬取淘宝,京东商品信息
小编是一个理科生,不善长说一些废话。简单介绍下原理然后直接上代码。 使用的工具(Python+pycharm2019.3+selenium+xpath+chromedriver)其中要使用pycharm也可以私聊我selenium是一个框架可以通过pip下载 pip installselenium -ihttps://pypi.tuna.tsinghua.edu.cn/simple/ ...
阿里程序员写了一个新手都写不出的低级bug,被骂惨了。
这种新手都不会范的错,居然被一个工作好几年的小伙子写出来,差点被当场开除了。
Java工作4年来应聘要16K最后没要,细节如下。。。
前奏: 今天2B哥和大家分享一位前几天面试的一位应聘者,工作4年26岁,统招本科。 以下就是他的简历和面试情况。 基本情况: 专业技能: 1、&nbsp;熟悉Sping了解SpringMVC、SpringBoot、Mybatis等框架、了解SpringCloud微服务 2、&nbsp;熟悉常用项目管理工具:SVN、GIT、MAVEN、Jenkins 3、&nbsp;熟悉Nginx、tomca...
SpringBoot2.x系列教程(三十六)SpringBoot之Tomcat配置
Spring Boot默认内嵌的Tomcat为Servlet容器,关于Tomcat的所有属性都在ServerProperties配置类中。同时,也可以实现一些接口来自定义内嵌Servlet容器和内嵌Tomcat等的配置。 关于此配置,网络上有大量的资料,但都是基于SpringBoot1.5.x版本,并不适合当前最新版本。本文将带大家了解一下最新版本的使用。 ServerProperties的部分源...
Python绘图,圣诞树,花,爱心 | Turtle篇
每周每日,分享Python实战代码,入门资料,进阶资料,基础语法,爬虫,数据分析,web网站,机器学习,深度学习等等。 公众号回复【进群】沟通交流吧,QQ扫码进群学习吧 微信群 QQ群 1.画圣诞树 import turtle screen = turtle.Screen() screen.setup(800,600) circle = turtle.Turtle()...
作为一个程序员,CPU的这些硬核知识你必须会!
CPU对每个程序员来说,是个既熟悉又陌生的东西? 如果你只知道CPU是中央处理器的话,那可能对你并没有什么用,那么作为程序员的我们,必须要搞懂的就是CPU这家伙是如何运行的,尤其要搞懂它里面的寄存器是怎么一回事,因为这将让你从底层明白程序的运行机制。 随我一起,来好好认识下CPU这货吧 把CPU掰开来看 对于CPU来说,我们首先就要搞明白它是怎么回事,也就是它的内部构造,当然,CPU那么牛的一个东...
破14亿,Python分析我国存在哪些人口危机!
一、背景 二、爬取数据 三、数据分析 1、总人口 2、男女人口比例 3、人口城镇化 4、人口增长率 5、人口老化(抚养比) 6、各省人口 7、世界人口 四、遇到的问题 遇到的问题 1、数据分页,需要获取从1949-2018年数据,观察到有近20年参数:LAST20,由此推测获取近70年的参数可设置为:LAST70 2、2019年数据没有放上去,可以手动添加上去 3、将数据进行 行列转换 4、列名...
听说想当黑客的都玩过这个Monyer游戏(1~14攻略)
第零关 进入传送门开始第0关(游戏链接) 请点击链接进入第1关: 连接在左边→ ←连接在右边 看不到啊。。。。(只能看到一堆大佬做完的留名,也能看到菜鸡的我,在后面~~) 直接fn+f12吧 &lt;span&gt;连接在左边→&lt;/span&gt; &lt;a href="first.php"&gt;&lt;/a&gt; &lt;span&gt;←连接在右边&lt;/span&gt; o...
在家远程办公效率低?那你一定要收好这个「在家办公」神器!
相信大家都已经收到国务院延长春节假期的消息,接下来,在家远程办公可能将会持续一段时间。 但是问题来了。远程办公不是人在电脑前就当坐班了,相反,对于沟通效率,文件协作,以及信息安全都有着极高的要求。有着非常多的挑战,比如: 1在异地互相不见面的会议上,如何提高沟通效率? 2文件之间的来往反馈如何做到及时性?如何保证信息安全? 3如何规划安排每天工作,以及如何进行成果验收? ...... ...
作为一个程序员,内存和磁盘的这些事情,你不得不知道啊!!!
截止目前,我已经分享了如下几篇文章: 一个程序在计算机中是如何运行的?超级干货!!! 作为一个程序员,CPU的这些硬核知识你必须会! 作为一个程序员,内存的这些硬核知识你必须懂! 这些知识可以说是我们之前都不太重视的基础知识,可能大家在上大学的时候都学习过了,但是嘞,当时由于老师讲解的没那么有趣,又加上这些知识本身就比较枯燥,所以嘞,大家当初几乎等于没学。 再说啦,学习这些,也看不出来有什么用啊!...
这个世界上人真的分三六九等,你信吗?
偶然间,在知乎上看到一个问题 一时间,勾起了我深深的回忆。 以前在厂里打过两次工,做过家教,干过辅导班,做过中介。零下几度的晚上,贴过广告,满脸、满手地长冻疮。 再回首那段岁月,虽然苦,但让我学会了坚持和忍耐。让我明白了,在这个世界上,无论环境多么的恶劣,只要心存希望,星星之火,亦可燎原。 下文是原回答,希望能对你能有所启发。 如果我说,这个世界上人真的分三六九等,...
2020年全新Java学习路线图,含配套视频,学完即为中级Java程序员!!
新的一年来临,突如其来的疫情打破了平静的生活! 在家的你是否很无聊,如果无聊就来学习吧! 世上只有一种投资只赚不赔,那就是学习!!! 传智播客于2020年升级了Java学习线路图,硬核升级,免费放送! 学完你就是中级程序员,能更快一步找到工作! 一、Java基础 JavaSE基础是Java中级程序员的起点,是帮助你从小白到懂得编程的必经之路。 在Java基础板块中有6个子模块的学...
B 站上有哪些很好的学习资源?
哇说起B站,在小九眼里就是宝藏般的存在,放年假宅在家时一天刷6、7个小时不在话下,更别提今年的跨年晚会,我简直是跪着看完的!! 最早大家聚在在B站是为了追番,再后来我在上面刷欧美新歌和漂亮小姐姐的舞蹈视频,最近两年我和周围的朋友们已经把B站当作学习教室了,而且学习成本还免费,真是个励志的好平台ヽ(.◕ฺˇд ˇ◕ฺ;)ノ 下面我们就来盘点一下B站上优质的学习资源: 综合类 Oeasy: 综合...
爬取薅羊毛网站百度云资源
这是疫情期间无聊做的爬虫, 去获取暂时用不上的教程 import threading import time import pandas as pd import requests import re from threading import Thread, Lock # import urllib.request as request # req=urllib.request.Requ...
如何优雅地打印一个Java对象?
你好呀,我是沉默王二,一个和黄家驹一样身高,和刘德华一样颜值的程序员。虽然已经写了十多年的 Java 代码,但仍然觉得自己是个菜鸟(请允许我惭愧一下)。 在一个月黑风高的夜晚,我思前想后,觉得再也不能这么蹉跎下去了。于是痛下决心,准备通过输出的方式倒逼输入,以此来修炼自己的内功,从而进阶成为一名真正意义上的大神。与此同时,希望这些文章能够帮助到更多的读者,让大家在学习的路上不再寂寞、空虚和冷。 ...
雷火神山直播超两亿,Web播放器事件监听是怎么实现的?
Web播放器解决了在手机浏览器和PC浏览器上播放音视频数据的问题,让视音频内容可以不依赖用户安装App,就能进行播放以及在社交平台进行传播。在视频业务大数据平台中,播放数据的统计分析非常重要,所以Web播放器在使用过程中,需要对其内部的数据进行收集并上报至服务端,此时,就需要对发生在其内部的一些播放行为进行事件监听。 那么Web播放器事件监听是怎么实现的呢? 01 监听事件明细表 名...
3万字总结,Mysql优化之精髓
本文知识点较多,篇幅较长,请耐心学习 MySQL已经成为时下关系型数据库产品的中坚力量,备受互联网大厂的青睐,出门面试想进BAT,想拿高工资,不会点MySQL优化知识,拿offer的成功率会大大下降。 为什么要优化 系统的吞吐量瓶颈往往出现在数据库的访问速度上 随着应用程序的运行,数据库的中的数据会越来越多,处理时间会相应变慢 数据是存放在磁盘上的,读写速度无法和内存相比 如何优化 设计...
HTML5适合的情人节礼物有纪念日期功能
前言 利用HTML5,css,js实现爱心树 以及 纪念日期的功能 网页有播放音乐功能 以及打字倾诉感情的画面,非常适合情人节送给女朋友 具体的HTML代码 具体只要修改代码里面的男某某和女某某 文字段也可自行修改,还有代码下半部分的JS代码需要修改一下起始日期 注意月份为0~11月 也就是月份需要减一。 当然只有一部分HTML和JS代码不够运行的,文章最下面还附加了完整代码的下载地址 &lt;!...
Python新型冠状病毒疫情数据自动爬取+统计+发送报告+数据屏幕(三)发送篇
今天介绍的项目是使用 Itchat 发送统计报告 项目功能设计: 定时爬取疫情数据存入Mysql 进行数据分析制作疫情报告 使用itchat给亲人朋友发送分析报告 基于Django做数据屏幕 使用Tableau做数据分析 来看看最终效果 目前已经完成,预计2月12日前更新 使用 itchat 发送数据统计报告 itchat 是一个基于 web微信的一个框架,但微信官方并不允许使用这...
python沙箱逃逸
沙箱逃逸是CTF和实际场景中经常遇到的一种情况。需要利用python的特性来实现逃逸。本文详细介绍了关于python逃逸的基础以及一些构造payload方法,并且附加习题提供练习。
作为程序员的我,大学四年一直自学,全靠这些实用工具和学习网站!
我本人因为高中沉迷于爱情,导致学业荒废,后来高考,毫无疑问进入了一所普普通通的大学,实在惭愧???? 我又是那么好强,现在学历不行,没办法改变的事情了,所以,进入大学开始,我就下定决心,一定要让自己掌握更多的技能,尤其选择了计算机这个行业,一定要多学习技术。 在进入大学学习不久后,我就认清了一个现实:我这个大学的整体教学质量和学习风气,真的一言难尽,懂的人自然知道怎么回事? 怎么办?我该如何更好的提升自...
新来个技术总监,禁止我们使用Lombok!
我有个学弟,在一家小型互联网公司做Java后端开发,最近他们公司新来了一个技术总监,这位技术总监对技术细节很看重,一来公司之后就推出了很多"政策",比如定义了很多开发规范、日志规范、甚至是要求大家统一使用某一款IDE。 但是这些都不是我这个学弟和我吐槽的点,他真正和我吐槽的是,他很不能理解,这位新来的技术总监竟然禁止公司内部所有开发使用Lombok。但是又没给出十分明确的,可以让人信服的理由。 于...
相关热词 c# 为空 判断 委托 c#记事本颜色 c# 系统默认声音 js中调用c#方法参数 c#引入dll文件报错 c#根据名称实例化 c#从邮件服务器获取邮件 c# 保存文件夹 c#代码打包引用 c# 压缩效率
立即提问