安装libvirt是make的时候没问题,但是在make install是出现很多错误!
      /usr/bin/install -c -m 0644 ./$f /usr/local/share/doc/libvirt-1.2.2/html; done

/usr/bin/install: cannot stat ./404.html': No such file or directory
/usr/bin/install: cannot stat
./acl.html': No such file or directory
/usr/bin/install: cannot stat ./aclpolkit.html': No such file or directory
/usr/bin/install: cannot stat
./api.html': No such file or directory
/usr/bin/install: cannot stat ./api_extension.html': No such file or directory
/usr/bin/install: cannot stat
./apps.html': No such file or directory
/usr/bin/install: cannot stat ./archdomain.html': No such file or directory
/usr/bin/install: cannot stat
./architecture.html': No such file or directory
/usr/bin/install: cannot stat ./archnetwork.html': No such file or directory
/usr/bin/install: cannot stat
./archnode.html': No such file or directory
/usr/bin/install: cannot stat ./archstorage.html': No such file or directory
/usr/bin/install: cannot stat
./auditlog.html': No such file or directory
/usr/bin/install: cannot stat ./auth.html': No such file or directory
/usr/bin/install: cannot stat
./bindings.html': No such file or directory
/usr/bin/install: cannot stat ./bugs.html': No such file or directory
/usr/bin/install: cannot stat
./cgroups.html': No such file or directory
/usr/bin/install: cannot stat ./compiling.html': No such file or directory
/usr/bin/install: cannot stat
./contact.html': No such file or directory
/usr/bin/install: cannot stat ./csharp.html': No such file or directory
/usr/bin/install: cannot stat
./deployment.html': No such file or directory
/usr/bin/install: cannot stat ./devguide.html': No such file or directory
/usr/bin/install: cannot stat
./docs.html': No such file or directory
/usr/bin/install: cannot stat ./downloads.html': No such file or directory
/usr/bin/install: cannot stat
./drivers.html': No such file or directory
/usr/bin/install: cannot stat ./drvesx.html': No such file or directory
/usr/bin/install: cannot stat
./drvhyperv.html': No such file or directory
/usr/bin/install: cannot stat ./drvlxc.html': No such file or directory
/usr/bin/install: cannot stat
./drvopenvz.html': No such file or directory
/usr/bin/install: cannot stat ./drvparallels.html': No such file or directory
/usr/bin/install: cannot stat
./drvphyp.html': No such file or directory
/usr/bin/install: cannot stat ./drvqemu.html': No such file or directory
/usr/bin/install: cannot stat
./drvremote.html': No such file or directory
/usr/bin/install: cannot stat ./drvtest.html': No such file or directory
/usr/bin/install: cannot stat
./drvuml.html': No such file or directory
/usr/bin/install: cannot stat ./drvvbox.html': No such file or directory
/usr/bin/install: cannot stat
./drvvmware.html': No such file or directory
/usr/bin/install: cannot stat ./drvxen.html': No such file or directory
/usr/bin/install: cannot stat
./errors.html': No such file or directory
/usr/bin/install: cannot stat ./firewall.html': No such file or directory
/usr/bin/install: cannot stat
./format.html': No such file or directory
/usr/bin/install: cannot stat ./formatcaps.html': No such file or directory
/usr/bin/install: cannot stat
./formatdomain.html': No such file or directory
/usr/bin/install: cannot stat ./formatnetwork.html': No such file or directory
/usr/bin/install: cannot stat
./formatnode.html': No such file or directory
/usr/bin/install: cannot stat ./formatnwfilter.html': No such file or directory
/usr/bin/install: cannot stat
./formatsecret.html': No such file or directory
/usr/bin/install: cannot stat ./formatsnapshot.html': No such file or directory
/usr/bin/install: cannot stat
./formatstorage.html': No such file or directory
/usr/bin/install: cannot stat ./formatstorageencryption.html': No such file or directory
/usr/bin/install: cannot stat
./goals.html': No such file or directory
/usr/bin/install: cannot stat ./governance.html': No such file or directory
/usr/bin/install: cannot stat
./hacking.html': No such file or directory
/usr/bin/install: cannot stat ./hooks.html': No such file or directory
/usr/bin/install: cannot stat
./hvsupport.html': No such file or directory
/usr/bin/install: cannot stat ./index.html': No such file or directory
/usr/bin/install: cannot stat
./internals.html': No such file or directory
/usr/bin/install: cannot stat ./intro.html': No such file or directory
/usr/bin/install: cannot stat
./java.html': No such file or directory
/usr/bin/install: cannot stat ./locking.html': No such file or directory
/usr/bin/install: cannot stat
./logging.html': No such file or directory
/usr/bin/install: cannot stat ./migration.html': No such file or directory
/usr/bin/install: cannot stat
./news.html': No such file or directory
/usr/bin/install: cannot stat ./pending.html': No such file or directory
/usr/bin/install: cannot stat
./php.html': No such file or directory
/usr/bin/install: cannot stat ./python.html': No such file or directory
/usr/bin/install: cannot stat
./relatedlinks.html': No such file or directory
/usr/bin/install: cannot stat ./remote.html': No such file or directory
/usr/bin/install: cannot stat
./secureusage.html': No such file or directory
/usr/bin/install: cannot stat ./securityprocess.html': No such file or directory
/usr/bin/install: cannot stat
./sitemap.html': No such file or directory
/usr/bin/install: cannot stat ./storage.html': No such file or directory
/usr/bin/install: cannot stat
./testapi.html': No such file or directory
/usr/bin/install: cannot stat ./testsuites.html': No such file or directory
/usr/bin/install: cannot stat
./testtck.html': No such file or directory
/usr/bin/install: cannot stat ./todo.html': No such file or directory
/usr/bin/install: cannot stat
./uri.html': No such file or directory
/usr/bin/install: cannot stat ./virshcmdref.html': No such file or directory
/usr/bin/install: cannot stat
./windows.html': No such file or directory
/usr/bin/install: cannot stat ./todo.html': No such file or directory
/usr/bin/install: cannot stat
./hvsupport.html': No such file or directory
/bin/bash /root/libvirt/libvirt/build-aux/install-sh -d /usr/local/share/doc/libvirt-1.2.2/html/html
for h in html/index.html html/libvirt-libvirt.html html/libvirt-virterror.html; do \
/usr/bin/install -c -m 0644 ./$h /usr/local/share/doc/libvirt-1.2.2/html/html; done
for p in html/left.png html/up.png html/home.png html/right.png; do \
/usr/bin/install -c -m 0644 ./$p /usr/local/share/doc/libvirt-1.2.2/html/html; done
/bin/bash /root/libvirt/libvirt/build-aux/install-sh -d /usr/local/share/doc/libvirt-1.2.2/html/internals
for f in internals/command.html internals/locking.html internals/rpc.html; do \
/usr/bin/install -c -m 0644 ./$f /usr/local/share/doc/libvirt-1.2.2/html/internals; done
/usr/bin/install: cannot stat ./internals/command.html': No such file or directory
/usr/bin/install: cannot stat
./internals/locking.html': No such file or directory
/usr/bin/install: cannot stat ./internals/rpc.html': No such file or directory
make[3]: *** [install-data-local] Error 1
make[3]: Leaving directory
/root/libvirt/libvirt/docs'
make[2]: *** [install-am] Error 2
rm news.html.tmp formatstorage.html.tmp goals.html.tmp formatsecret.html.tmp hooks.html.tmp drvopenvz.html.tmp testtck.html.tmp drvesx.html.tmp apps.html.tmp internals/locking.html.tmp formatdomain.html.tmp internals/command.html.tmp drvvbox.html.tmp csharp.html.tmp java.html.tmp archnetwork.html.tmp formatstorageencryption.html.tmp php.html.tmp drvhyperv.html.tmp errors.html.tmp aclpolkit.html.tmp hacking.html.tmp storage.html.tmp testsuites.html.tmp format.html.tmp cgroups.html.tmp drvlxc.html.tmp windows.html.tmp api.html.tmp internals/rpc.html.tmp formatnwfilter.html.tmp relatedlinks.html.tmp formatcaps.html.tmp archdomain.html.tmp contact.html.tmp auth.html.tmp drivers.html.tmp archnode.html.tmp bugs.html.tmp downloads.html.tmp drvphyp.html.tmp logging.html.tmp locking.html.tmp testapi.html.tmp remote.html.tmp drvuml.html.tmp intro.html.tmp migration.html.tmp acl.html.tmp hvsupport.html.tmp sitemap.html.tmp drvqemu.html.tmp drvparallels.html.tmp drvxen.html.tmp deployment.html.tmp uri.html.tmp index.html.tmp bindings.html.tmp drvvmware.html.tmp devguide.html.tmp drvtest.html.tmp firewall.html.tmp architecture.html.tmp archstorage.html.tmp todo.html.tmp formatsnapshot.html.tmp internals.html.tmp pending.html.tmp formatnetwork.html.tmp api_extension.html.tmp securityprocess.html.tmp governance.html.tmp 404.html.tmp docs.html.tmp virshcmdref.html.tmp auditlog.html.tmp secureusage.html.tmp python.html.tmp drvremote.html.tmp formatnode.html.tmp compiling.html.tmp
make[2]: Leaving directory /root/libvirt/libvirt/docs'
make[1]: *** [install-recursive] Error 1
make[1]: Leaving directory
/root/libvirt/libvirt/docs'
make: *** [install-recursive] Error 1

Csdn user default icon
上传中...
上传图片
插入图片
抄袭、复制答案,以达到刷声望分或其他目的的行为,在CSDN问答是严格禁止的,一经发现立刻封号。是时候展现真正的技术了!
其他相关推荐
nginx make install错误
1、在configure的时候 ./configure --prefix=/Users/l00277880/selfcode/work/nginx/nginx-1.13.7 --add-module=/Users/l00277880/selfcode/work/nginx/nginx_hello_world/ --with-pcre 我配置prefix的路径和默认的路径一样了,酱紫的话就
解决./configure ,make,make install 常见错误
Linux下从源代码下编译安装一个软件有时候会报错,遇到一些麻烦。有些情况即使你用了很多方法去尝试解决,但问题依然存在,那怎么办呢?本教程教你怎么解决Linux软件编译时遇到的问题 注意:编译安装一个软件不会被系统的包管理系统记录信息,这对于卸载和记录软件的行为都是不利的,建议您尽量使用打包好的包(.rpm .deb) 我们分3类错: ./configure 错误 make 错误
nginx源代码安装make报错
今天在安装nginx时出现如下错误: [root@node1 nginx-0.8.55]# ./configure \  >  --prefix=/usr \  >  --sbin-path=/usr/sbin/nginx \  >  --conf-path=/etc/nginx/nginx.conf \  >  --error-log-path=/var/log/nginx/err
make redis出现错误可能原因
make: * No rule to make target 错误原因、分析和解决办法 上面博客其中红字部分: 最后发现,上述问题的产生的根本原因是工程更改路径或者更改了其中的文件夹名称之后,之前生成的.o.d文件在再次编译时并不会重新编译,因而导致该问题。根源解决办法是 删除编译后生成的obj文件夹。然后重新编译就行了。 所谓的删除obj文件夹只需要用make clean清理一
Linux下面安装Python常见错误解决方法
1、 2、安装setuptools报错 安装zlib $wget http://zlib.net/zlib-1.2.8.tar.gz $tar -xvzf zlib-1.2.8.tar.gz $cd zlib-1.2.8.tar.gz $./configure $make $sudo make install 然后再次安装Python copying
安装pcre无法成功执行make的解决方法
问题描述: 在Ubuntu上安装Nginx,第一步安装pcre的时候获取安装包->解压缩->执行./configure 然后执行make的时候报错:make: *** No targets specified and no makefile found. stop 仔细看执行./configure的最后有报错:You need a C++ compiler for C++ support
解决make: *** [install-recursive] Error 1问题
输入make install 时会出现如题问题,如何解决呢? 输入sudo make install即可解决。 (以后都直接在root下运行终端吧。。。)
nginx编译包报错:make: *** [install] Error 2
nginx编译包报错: /soft/fastdfs-nginx-module/src/ngx_http_fastdfs_module.c: In function ‘ngx_http_fastdfs_handler’: /soft/fastdfs-nginx-module/src/ngx_http_fastdfs_module.c:842: error: ‘struct fdfs_http_c
解决Linux系统下安装redis make出错的问题
主要问题 collect2: ld 返回 1 make[1]: *** [redis-server] 错误 1  make[1]: Leaving directory `/usr/local/redis-3.0. 解决方法 : make +参数  CFLAGS="-march=i686" 原理:和gcc编译有关系 -march=i686设定为像-march=i686 -mt
make &make install 时出现错误和警告的修正
Aspseek1.4更新日志 一、make && make install时出现的警告、错误及其修正 错误及警告: charsets.cpp:475:1: warning: deprecated conversion from string constant to 'char*' /usr/include/c++/4.5/backward/backward_warning.h:28:2:
linux问题记录:源码安装python遇到make: *** [libinstall] Error 1错误
我用的是ubuntu 14.04,上面的python版本是2.7.6,有点老,所以就去升级一下。而ubuntu 14.04源里面自带的最新版本的python就是2.7.6,所以就想着去源码安装一下。可以在编译到最后一步的时候,遇到了下面的问题:其实编译安装时挺花时间的,到最后却失败了。最后google了一下,发现可以使用下面的方法升级python:sudo add-apt-repository pp
linux下redis安装遇到的问题记录
1.redis在make时报错 下载解压redis-3.0.2后,执行make进行编译,结果出现下面的错误: make: cc: Command not found make: *** [adlist.o] Error 127 2. 这是由于新安装的Linux系统没有安装gcc环境,需要安装gcc,为了方便,这里我选择用yum进行安装。 # yum 
ubuntu下编译安装make: *** [install] 错误 1
mkdir: 无法创建目录 “/usr/local/lib/***”: 权限不够 mkdir: 无法创建目录 “/usr/local/lib/***”: 权限不够 make: *** [install] 错误 1 出现类似错误,文件无法删除或者创建 如果你要是用的make && make install的话 你可以sudo make 然后sudo make isntall解
GCC最新版安装及错误解决
linux下gcc安装 linux一般可以从软件包等方式直接安装gcc,但不一般不是最新版,比如需要支持C++11 等原因,则需要安装最新版gcc。 (如果系统还没有任何gcc被安装,则需要从开发包中先安装默认的低版本的gcc centos下也可以安装带gcc的开发工具:yum groupinstall "Development Tools") 下载地址 ftp://ftp
Linux下解决./configure ,make,make install的报错
Linux下从源代码下编译安装一个软件有时候会报错,遇到一些麻烦。有些情况即使你用了很多方法去尝试解决,但问题依然存在,那怎么办呢?本教程教你怎么解决Linux软件编译时遇到的问题 注意:编译安装一个软件不会被系统的包管理系统记录信息,这对于卸载和记录软件的行为都是不利的,建议您尽量使用打包好的包(.rpm .deb) 我们分3类错: ./configure 错误 make 错误 mak
TinyOS学习 - Ubuntu 12.04LTS安装TinyOS 2.1.1后make telosb报错之解决方案
我在Ubuntu 12.04LTS的64位版本安装过一次TinyOS,但是最后编译是成功的,但是所有的java工具都不能用。这次我重装了个32位的Ubuntu系统。这个是肯定可以安装的。 但是在我按照教程全部安装完之后发现出现了错误。 在make telosb的时候 > mkdir -p build/telosb > compiling BlinkAppC to a telo
yum/apt-get,(wget,configure,make&&makeinstall),rpm,哪些是二进制,源码编译,安装
yum和rpm放在一起说,都是红帽系的,包括RedHat、Fedora、CentOS等等;apt-get和deb放在一起说这些,这些都是Debian/Ubuntu系的,常见的包括Ubuntu、Debian、Mint以及一切基于Debian和Ubuntu的Distro。红帽系和Deb系都是属于二进制发行版,装软件(包)都是不需要编译的,其本质就是从网上下下来的包直接解压复制就完了。同样的还有Arch
安装 libmad 出错
<br />[code]<br /> make  all-recursive<br /> make[1]: Entering directory `/home/izhier/download/libmad-0.15.1b'<br /> make[2]: Entering directory `/home/izhier/download/libmad-0.15.1b'<br /> if /bin/sh ./libtool --mode=compile gcc -DHAVE_CONFIG_H -I. -
caffe---make发生的错误和解决办法2
错误1: 执行命令:for req in $(cat requirements.txt); do pip install $req; done 错误2: make runtest
Qt官方办法解决:Qt没有被正确安装,请运行make install问题的解决
先说说问题起源。Qt一直以来按MSVC、OpenGL、CPU位数分别制作安装包,如果开发工作对它们都存在需要,那么得安装好几个安装包,安装包里面某些东西是相同的,对于磁盘空间不足的开发者来说这样的安装结果非常不友好。以Qt5.2.1版本为例,我把所有的Qt编译目录移动到一个文件夹下,如下图所示: 不过随后出现一个问题,Qt Creator创建项目的时候在Kits Version选择界面找不到Kit
ubuntu安装交差编译器的时候出现:make[2]: *** [doc/cpp.info]
make[2]: *** [doc/cpp.info] 错误 1 make[2]: *** 正在等待未完成的任务.... make: *** [/opt/buildroot-2012.08/output/toolchain/gcc-4.5.4-initial/.compiled] 错误 2 如果编译交叉编译器是出现这些问题可能就是pc上的编译器和交叉编译器的gcc版本不同引起的,这时候看
redis安装make失败
解压后 执行make后报错: cd src && make all make[1]: Entering directory `/home/liuchaofan/redis-3.0.7/src'     CC adlist.o /bin/sh: cc: command not found make[1]: *** [adlist.o] Error 127 make[1]: Leav
安装好netcdf hdf5 后 在lib中make的错误 怎么办
前面省大都  /usr/bin/install -c -m 644 'netcdf.mod' '/home/rzf/下载/FVCOM3.2/FVCOM_source/libs/install/include/netcdf.mod' make[3]:正在离开目录 `/home/rzf/下载/FVCOM3.2/FVCOM_source/libs/netcdf/f90' make[2]:正在离
swoole安装及报错上的一点经验
初学swoole的时候,对于安装上出现的一些小小的问题总结了一下,在此分享。环境依赖:swoole-1.x 需要 php-5.3.10 或更高版本,swoole-2.x 需要 php-7.0.0或更高版本。安装:(下面是我进行的安装步骤)[root@dev ~]# cd /usr/local/src下载[root@dev src]# wget http://pecl.php.net/get/swo...
make menuconfig出现的错误
问题描述:运行make menuconfig 错误提示: Build dependency: Please install zlib Build dependency: Please install GNU awk. Build dependency: Please install the subversion client. Prerequisite check faile
Linux安装SwfTools-0.9.2安装事,在执行make install时报错
安装SWFTOOLS-0.9.2的时候,在执行make install时报错, rm -f /usr/local/share/swftools/swfs/default_viewer.swf -o -L /usr/local/share/swftools/swfs/default_viewer.swf rm:无效选项 -- o 请尝试执行"rm --help"来获取更多信息。 make[1
centos7 安装python3.6.4出错
错误:zipimport.ZipImportError: can't decompress data; zlib not available 解决办法:从错误信息分析,就是缺少了zlib的解压缩类库,安装即可 yum -y install zlib* 安装完成之后,重新安装即可,所有的问题都已经正常解决了
“Qt没有被正确安装,请运行make install““无效的Qt版本”的解决方法
<!-- @page {margin:2cm} p {margin-bottom:0.21cm} p.western {font-family:"DejaVu Sans",sans-serif; font-size:10pt} p.cjk {font-size:10pt} p.ctl {font-size:12pt} --> “Qt没有被正确安装,
apt-get安装和 ./configure make make install安装
linux下安装某个软件,可以这样: root@ubuntu:/home# wget https://www.kernel.org/pub/software/scm/git/git-2.2.1.tar.xz 即wget+安装包的链接,就方便的得到了安装包,再安装。   apt-get 下载后,软件所在路径是: /var/cache/apt/archives
configure && make && make install
这里
Linux中make和makeinstall的原理
Linux中make和makeinstall的原理 make的原理是执行一个叫Makefile文件里的指令,make的基本用处是自动根据makefile里的指令来编译源文件。它还可以用来做比如安装软件,卸载软件等事情,但前提是作者在makefile里写了。比如makefile里有这么些内容:  ... install :  然后用make install的话,make程序就会按照上面
ubuntu安装g2o时出现错误及解决方法
安装G2O可以用高翔在git上的包,一可以从这里clone下来git clone https://github.com/RainerKuemmerle/g2o.git 然后进入g2o文件夹,执行cmake编译 mkdir build cd build cmake .. make 在对g2o进行make的时候,出现错误(具体是什么没有记录下来),经过百度之...
Linux下./configure,make,make install的作用
./configure是用来检测你的安装平台的目标特征的。比如它会检测你是不是有CC或GCC,并不是需要CC或GCC,它是个shell脚本。 make是用来编译的,它从Makefile中读取指令,然后编译。 make install是用来安装的,它也从Makefile中读取指令,安装到指定的位置。 AUTOMAKE和AUTOCONF是非常有用的用来发布C程序的东西。 -----
纯源码包安装 lua 的时候遇到的错误和解决办法
http://storysky.blog.51cto.com/628458/345982/ 昨天晚上磕磕绊绊的把nginx 装好了(所有需要的包都是源码包),今天开始部署数据库,因为需要lua 语言环境支持,所以需要先安装lua,结果这东西安装也不是那么顺利, 第一步是 make 第二步   make linux 这里出错了,提示如下 luaconf.h:275:31: erro
tslib 安装出错及解决
1.执行./autogen.sh 提示错误: ./autogen.sh: 4: autoreconf: not found 解决方法: sudo apt-get install autoconf automake libtool 2.执行./configure --host=arm-linux --prefix=/usr/local/tslib 提示错误: ts_te
qt安装遇到的错误
/usr/bin/ld: cannot find -lXrender collect2: ld returned 1 exit status make[1]: *** [../../../../lib/libQtWebKit.so.4.7.4] Error 1 make[1]: Leaving directory `/root/test/qt/qt-everywhere-opensource
busybox在make编译过程中出错
博主在busybox安装时,在make编译时出了两个错:'MTD_FILE_MODE_RAW' undeclared和'BLKSECDISCARD' undeclared ,在经过上网百度时,发现几乎所有的博客都是千篇一律,但是实际试了一下,发现并没有成功。在经过根据自己的猜想和实验之后,自己想出了一种解决方法,贴出来交流一下。(前四步为busybox安装过程,第5步为上述问题的解决方法)1.到官...
linux CentOS7下安装redis报错 make[1]: *** [adlist.o] 错误 127。[安装gcc]
今天安装了CentOS7 1708 在安装redis时报错  make[1]: *** [adlist.o] 错误 127 因为Redis是C实现的,需要gcc来进行编译,所以原因是系统未安装gcc,按顺序执行: yum install cpp yum install binutils yum install glibc yum install glibc-kernheaders yum
Qt没有被正确安装,请运行make install问题的解决
在网上直接下载别人编译好的Qt库,为自己使用省了不少事。但往往也会遇到些问题,其中 Qt version is not properly installed,please run make install Qt没有被正确安装,请运行make install 这个问题是比较常见的一个。 网上看了一个帖子,终于明白原因所在,原来是qmake.exe是在Qt安装编译时生成的,里面内嵌了Qt相关的
redis安装过程中的问题解决
今天装了个centos2.6.4 然后装jdk,完了redis2.6.4 装redis2.6.4折腾了老半天,缺了很多东西,连gcc都没有 无语中…… 废话不多说,直接上过程 1、报错一  没用gcc 安装过程     yum install cpp     yum install binutils     yum install glibc     yu
相关热词 c#多人合作开发项目策略 c# cad 坐标转换 c# 窗口内运行word c#线程睡眠 c# 静默打开打印机 c#获取当前路径的上一级 c# 去除线条 c# 取整倍数 c#窗体最大化控件不变 c# 程序更新程序案例