make_ext4fs打包system.img后能刷入,但开机定屏

Linux
1、原厂线刷包提取:system.img

2、simg2img system.img system_raw.img
3、mkdir system
4、mount -t ext4 -o loop system_raw.img system
5、......修改system/app/....(不会是这一步的问题)
6、make_ext4fs -l 512M -s -a system system_new.img system
7、打包后的system.img替换原厂线刷包里的system.img

问题一:能正常刷入手机,但刷完后手机不开机,在开机画面定住不动,求助,这到底是为什么呀?
问题二:上述第6步中的512M这个参数怎么确认?我这里的512是按挂载后system文件夹的大小,不知道正确不?

7个回答

#make__ext4fs参数中应该运用-a system -S ./file-contexts后自然解决!

Aloehuang_
Aloehuang_ 回复u010346841: 是-s而不是-S
大约 3 年之前 回复
dadzyl
dadzyl android5.0以上的版本需要-S file_contexts,文件adb shell自取
3 年多之前 回复
wlqian0183
wlqian0183 回复u010346841: 你在当前目录下没有file-contexts这个文件吧。
接近 4 年之前 回复
u010346841
u010346841 我加上-S的命令,工具不认,出现:./make_ext4fs: invalid option -- 'S',这是怎么回事呀,求指导!
大约 4 年之前 回复

可以尝试两个方法:
$make_ext4fs -l 512M -s -a system system_new.img system

  1. 增加 -S file_contexts
    $make_ext4fs -S file_contexts -l 512M -s -a system system_new.img system
    (file_contexts 文件adb shell 自取,就在根目录)

  2. 注意-l 后image大小,尽量跟原image大小接近

卡了一个星期了,本想做rom来着,结果一点进展都没有,郁闷,楼上的加上 -S ./file-contexts这个我开始的工具不支持这个命令,后来又找了另一个extutils,支持这个命令了,但还是卡第一屏。

make_ext4fs -s -l 512M -a system /sdcard/system.img /system

然后从sdcard提取system.img

楼主打包是在什么系统环境,我在linux下打包-A参数后说环境不对无法完成,是否可否告知所用软件,系统,步骤,软件在那下,可否给一份。

我也是呀,我测试了一下,用楼上的命令解包打包system.img,哪怕仅仅是解包打包,不修改任何东西,都启动不了,定在开机界面,郁闷。。。

Csdn user default icon
上传中...
上传图片
插入图片
抄袭、复制答案,以达到刷声望分或其他目的的行为,在CSDN问答是严格禁止的,一经发现立刻封号。是时候展现真正的技术了!
其他相关推荐
centos 下编译ImageMagick 无法通过报错undefined reference to `gzdirect@ZLIB_1.2.2.3'
[root@local-vm-380 ImageMagick-6.9.10-86]# m make all-am make[1]: Entering directory `/usr/src/ImageMagick-6.9.10-86' CCLD utilities/animate /usr/lib/gcc/x86_64-redhat-linux/4.8.5/../../../../lib64/libxml2.so: undefined reference to `gzdirect@ZLIB_1.2.2.3' /usr/lib/gcc/x86_64-redhat-linux/4.8.5/../../../../lib64/libxml2.so: undefined reference to `gzopen64@ZLIB_1.2.3.3' collect2: error: ld returned 1 exit status make[1]: *** [utilities/animate] Error 1 make[1]: Leaving directory `/usr/src/ImageMagick-6.9.10-86' make: *** [all] Error 2 [root@local-vm-380 ImageMagick-6.9.10-86]#
解包打包system的问题
**各位,我买X98Pro平板已经半年多了,一直苦等RemixOS,但一直等不到,终于有一天Plus的Remix发布了,我一试基本上可以使用,只有电源模块有点问题,也可能system.img有问题,所以想尝试移植。试了上百遍解包打包system.img,发现能正常启动的system.img,一旦被解包打包一次,刷入后就开不了机了,定在台电LOGO,原版的system.img也是经过解包打包后启动不了。我用的是simg2img、make__ext4工具,即使没有修改任何东西包括权限,单纯解包打包一次,生成的system.img就启动不了系统了,但是能正常刷入,这种怪事你们遇到过吗?是不是台电的system.img得用专用打包工具才行?请大神帮忙!!!系统版本是安卓5.1**
Mac 使用make编译gtest出现很多错误,如何解决?
## 系统环境 * Mac OS X Catalina 10.15.3 * 终端: zsh ## 编译过程 1. git clone googletest 2. mkdir mybuild && cd mybuild 3. cmake ../ ![成功](https://img-ask.csdn.net/upload/202002/15/1581750491_801128.png) 4. make ![失败](https://img-ask.csdn.net/upload/202002/15/1581750095_487520.png) ![失败](https://img-ask.csdn.net/upload/202002/15/1581750136_768008.png) ## 尝试 1. 按照网上搜到的方法,在.zshrc配置文件中加入 ```alias clang++="clang++ -std=c++11 -stdlib=libc++ -Weverything" ``` 之类的别名,再source .zshrc均无效。 2. 针对很多如下问题,[-Wer error: deleted function definitions are a C++11 extension [-Werror,-Wc++11-extensions] 我自己写了包含C++11的例子,如delete new,然后用clang++或者g++编译,均成功。
自己用webpack构建vue项目报错,求帮助万分感谢
神烦怎么也解决不了问题,用localhost能访问到的是目录 用node:{ fs: 'empty', net: 'empty', tls: 'empty', child_process: 'empty' }能减少几个报错信息 以下是我的配置 ``` const path = require('path'); const HTMLPlugin = require('html-webpack-plugin'); const VueLoaderPlugin = require('vue-loader/lib/plugin'); const webpack = require('webpack'); const isDev = process.env.NODE_ENV === 'development'; //package.json设置的对象全部存在process.env里面 const config = { target: 'web', entry: path.join(__dirname, 'src/index.js'),//设置入口,__dirname代表本文件所在的地址,也就是根目录 output: { filename: 'bundle.js', //打包的名字 path: path.join(__dirname, 'dist') //打包路径 }, plugins: [ // make sure to include the plugin for the magic new VueLoaderPlugin(), new webpack.DefinePlugin({ 'process.env': { NODE_ENV: isDev ? '"development"' : '"production"' //调用process.env.NODE_ENV 可以获取 环境 } }), new HTMLPlugin() ], module: { rules: [ { test: /\.vue$/, loader: 'vue-loader' }, { test: /\.css$/, use: [ 'style-loader', 'css-loader' ] }, { test: /\.styl$/, use: [ 'style-loader', 'css-loader', 'stylus-loader' ] }, { test: /\.(jpg|gif|jpeg|png|svg)$/, use: [{ loader: 'url-loader', options: { limit: 1024,//可以帮小于1024的图片转换base-64代码直接写在js里面,减少http请求 name: '[name].[ext]' //重命名 name图片原来的名字 ext文件扩展名 } }] } ] } }; if (isDev) { config.devServer = { port: '8200', host: '0.0.0.0', overlay: { errors: true, } } } module.exports = config; ``` 下面是报错信息 ERROR in ./node_modules/_fsevents@1.2.4@fsevents/node_modules/node-pre-gyp/lib/testbinary.js Module not found: Error: Can't resolve 'child_process' in 'D:\java\JetBrains\module\vue-app\vue-todo\node_modules\_fsevents@1.2.4@fsevents\node_modules\node-pre-gyp\lib' @ ./node_modules/_fsevents@1.2.4@fsevents/node_modules/node-pre-gyp/lib/testbinary.js 10:9-33 @ ./node_modules/_fsevents@1.2.4@fsevents/node_modules/node-pre-gyp/lib sync ^\.\/.*$ @ ./node_modules/_fsevents@1.2.4@fsevents/node_modules/node-pre-gyp/lib/node-pre-gyp.js @ ./node_modules/_fsevents@1.2.4@fsevents/fsevents.js @ ./node_modules/_chokidar@2.0.4@chokidar/lib/fsevents-handler.js @ ./node_modules/_chokidar@2.0.4@chokidar/index.js @ ./node_modules/_watchpack@1.6.0@watchpack/lib/DirectoryWatcher.js @ ./node_modules/_watchpack@1.6.0@watchpack/lib/watcherManager.js @ ./node_modules/_watchpack@1.6.0@watchpack/lib/watchpack.js @ (webpack)/lib/node/NodeWatchFileSystem.js @ (webpack)/lib/node/NodeEnvironmentPlugin.js @ (webpack)/lib/webpack.js @ multi ./node_modules/_webpack-dev-server@3.1.9@webpack-dev-server/client?http://0.0.0.0:8200 webpack ERROR in ./node_modules/_fsevents@1.2.4@fsevents/node_modules/node-pre-gyp/lib/util/compile.js Module not found: Error: Can't resolve 'child_process' in 'D:\java\JetBrains\module\vue-app\vue-todo\node_modules\_fsevents@1.2.4@fsevents\node_modules\node-pre-gyp\lib\util' @ ./node_modules/_fsevents@1.2.4@fsevents/node_modules/node-pre-gyp/lib/util/compile.js 9:9-33 @ ./node_modules/_fsevents@1.2.4@fsevents/node_modules/node-pre-gyp/lib sync ^\.\/.*$ @ ./node_modules/_fsevents@1.2.4@fsevents/node_modules/node-pre-gyp/lib/node-pre-gyp.js @ ./node_modules/_fsevents@1.2.4@fsevents/fsevents.js @ ./node_modules/_chokidar@2.0.4@chokidar/lib/fsevents-handler.js @ ./node_modules/_chokidar@2.0.4@chokidar/index.js @ ./node_modules/_watchpack@1.6.0@watchpack/lib/DirectoryWatcher.js @ ./node_modules/_watchpack@1.6.0@watchpack/lib/watcherManager.js @ ./node_modules/_watchpack@1.6.0@watchpack/lib/watchpack.js @ (webpack)/lib/node/NodeWatchFileSystem.js @ (webpack)/lib/node/NodeEnvironmentPlugin.js @ (webpack)/lib/webpack.js @ multi ./node_modules/_webpack-dev-server@3.1.9@webpack-dev-server/client?http://0.0.0.0:8200 webpack ERROR in ./node_modules/_fsevents@1.2.4@fsevents/node_modules/osenv/osenv.js Module not found: Error: Can't resolve 'child_process' in 'D:\java\JetBrains\module\vue-app\vue-todo\node_modules\_fsevents@1.2.4@fsevents\node_modules\osenv' @ ./node_modules/_fsevents@1.2.4@fsevents/node_modules/osenv/osenv.js 3:11-35 @ ./node_modules/_fsevents@1.2.4@fsevents/node_modules/nopt/lib/nopt.js @ ./node_modules/_fsevents@1.2.4@fsevents/node_modules/node-pre-gyp/lib/node-pre-gyp.js @ ./node_modules/_fsevents@1.2.4@fsevents/fsevents.js @ ./node_modules/_chokidar@2.0.4@chokidar/lib/fsevents-handler.js @ ./node_modules/_chokidar@2.0.4@chokidar/index.js @ ./node_modules/_watchpack@1.6.0@watchpack/lib/DirectoryWatcher.js @ ./node_modules/_watchpack@1.6.0@watchpack/lib/watcherManager.js @ ./node_modules/_watchpack@1.6.0@watchpack/lib/watchpack.js @ (webpack)/lib/node/NodeWatchFileSystem.js @ (webpack)/lib/node/NodeEnvironmentPlugin.js @ (webpack)/lib/webpack.js @ multi ./node_modules/_webpack-dev-server@3.1.9@webpack-dev-server/client?http://0.0.0.0:8200 webpack ERROR in ./node_modules/_worker-farm@1.6.0@worker-farm/lib/fork.js Module not found: Error: Can't resolve 'child_process' in 'D:\java\JetBrains\module\vue-app\vue-todo\node_modules\_worker-farm@1.6.0@worker-farm\lib' @ ./node_modules/_worker-farm@1.6.0@worker-farm/lib/fork.js 3:21-45 @ ./node_modules/_worker-farm@1.6.0@worker-farm/lib/farm.js @ ./node_modules/_worker-farm@1.6.0@worker-farm/lib/index.js @ ./node_modules/_uglifyjs-webpack-plugin@1.3.0@uglifyjs-webpack-plugin/dist/uglify/Runner.js @ ./node_modules/_uglifyjs-webpack-plugin@1.3.0@uglifyjs-webpack-plugin/dist/index.js @ ./node_modules/_uglifyjs-webpack-plugin@1.3.0@uglifyjs-webpack-plugin/dist/cjs.js @ (webpack)/lib/WebpackOptionsDefaulter.js @ (webpack)/lib/webpack.js @ multi ./node_modules/_webpack-dev-server@3.1.9@webpack-dev-server/client?http://0.0.0.0:8200 webpack ERROR in ./node_modules/_cacache@10.0.4@cacache/get.js Module not found: Error: Can't resolve 'fs' in 'D:\java\JetBrains\module\vue-app\vue-todo\node_modules\_cacache@10.0.4@cacache' @ ./node_modules/_cacache@10.0.4@cacache/get.js 5:11-24 @ ./node_modules/_cacache@10.0.4@cacache/locales/en.js @ ./node_modules/_cacache@10.0.4@cacache/index.js @ ./node_modules/_uglifyjs-webpack-plugin@1.3.0@uglifyjs-webpack-plugin/dist/uglify/Runner.js @ ./node_modules/_uglifyjs-webpack-plugin@1.3.0@uglifyjs-webpack-plugin/dist/index.js @ ./node_modules/_uglifyjs-webpack-plugin@1.3.0@uglifyjs-webpack-plugin/dist/cjs.js @ (webpack)/lib/WebpackOptionsDefaulter.js @ (webpack)/lib/webpack.js @ multi ./node_modules/_webpack-dev-server@3.1.9@webpack-dev-server/client?http://0.0.0.0:8200 webpack ERROR in ./node_modules/_chokidar@2.0.4@chokidar/index.js Module not found: Error: Can't resolve 'fs' in 'D:\java\JetBrains\module\vue-app\vue-todo\node_modules\_chokidar@2.0.4@chokidar' @ ./node_modules/_chokidar@2.0.4@chokidar/index.js 3:9-22 @ ./node_modules/_watchpack@1.6.0@watchpack/lib/DirectoryWatcher.js @ ./node_modules/_watchpack@1.6.0@watchpack/lib/watcherManager.js @ ./node_modules/_watchpack@1.6.0@watchpack/lib/watchpack.js @ (webpack)/lib/node/NodeWatchFileSystem.js @ (webpack)/lib/node/NodeEnvironmentPlugin.js @ (webpack)/lib/webpack.js @ multi ./node_modules/_webpack-dev-server@3.1.9@webpack-dev-server/client?http://0.0.0.0:8200 webpack ERROR in ./node_modules/_chokidar@2.0.4@chokidar/lib/fsevents-handler.js Module not found: Error: Can't resolve 'fs' in 'D:\java\JetBrains\module\vue-app\vue-todo\node_modules\_chokidar@2.0.4@chokidar\lib' @ ./node_modules/_chokidar@2.0.4@chokidar/lib/fsevents-handler.js 3:9-22 @ ./node_modules/_chokidar@2.0.4@chokidar/index.js @ ./node_modules/_watchpack@1.6.0@watchpack/lib/DirectoryWatcher.js @ ./node_modules/_watchpack@1.6.0@watchpack/lib/watcherManager.js @ ./node_modules/_watchpack@1.6.0@watchpack/lib/watchpack.js @ (webpack)/lib/node/NodeWatchFileSystem.js @ (webpack)/lib/node/NodeEnvironmentPlugin.js @ (webpack)/lib/webpack.js @ multi ./node_modules/_webpack-dev-server@3.1.9@webpack-dev-server/client?http://0.0.0.0:8200 webpack ERROR in ./node_modules/_chokidar@2.0.4@chokidar/lib/nodefs-handler.js Module not found: Error: Can't resolve 'fs' in 'D:\java\JetBrains\module\vue-app\vue-todo\node_modules\_chokidar@2.0.4@chokidar\lib' @ ./node_modules/_chokidar@2.0.4@chokidar/lib/nodefs-handler.js 3:9-22 @ ./node_modules/_chokidar@2.0.4@chokidar/index.js @ ./node_modules/_watchpack@1.6.0@watchpack/lib/DirectoryWatcher.js @ ./node_modules/_watchpack@1.6.0@watchpack/lib/watcherManager.js @ ./node_modules/_watchpack@1.6.0@watchpack/lib/watchpack.js @ (webpack)/lib/node/NodeWatchFileSystem.js @ (webpack)/lib/node/NodeEnvironmentPlugin.js @ (webpack)/lib/webpack.js @ multi ./node_modules/_webpack-dev-server@3.1.9@webpack-dev-server/client?http://0.0.0.0:8200 webpack ERROR in ./node_modules/_chownr@1.1.1@chownr/chownr.js Module not found: Error: Can't resolve 'fs' in 'D:\java\JetBrains\module\vue-app\vue-todo\node_modules\_chownr@1.1.1@chownr' @ ./node_modules/_chownr@1.1.1@chownr/chownr.js 2:11-24 @ ./node_modules/_cacache@10.0.4@cacache/lib/util/fix-owner.js @ ./node_modules/_cacache@10.0.4@cacache/lib/util/tmp.js @ ./node_modules/_cacache@10.0.4@cacache/locales/en.js @ ./node_modules/_cacache@10.0.4@cacache/index.js @ ./node_modules/_uglifyjs-webpack-plugin@1.3.0@uglifyjs-webpack-plugin/dist/uglify/Runner.js @ ./node_modules/_uglifyjs-webpack-plugin@1.3.0@uglifyjs-webpack-plugin/dist/index.js @ ./node_modules/_uglifyjs-webpack-plugin@1.3.0@uglifyjs-webpack-plugin/dist/cjs.js @ (webpack)/lib/WebpackOptionsDefaulter.js @ (webpack)/lib/webpack.js @ multi ./node_modules/_webpack-dev-server@3.1.9@webpack-dev-server/client?http://0.0.0.0:8200 webpack ERROR in ./node_modules/_copy-concurrently@1.0.5@copy-concurrently/copy.js Module not found: Error: Can't resolve 'fs' in 'D:\java\JetBrains\module\vue-app\vue-todo\node_modules\_copy-concurrently@1.0.5@copy-concurrently' @ ./node_modules/_copy-concurrently@1.0.5@copy-concurrently/copy.js 8:13-26 @ ./node_modules/_move-concurrently@1.0.1@move-concurrently/move.js @ ./node_modules/_cacache@10.0.4@cacache/lib/util/move-file.js @ ./node_modules/_cacache@10.0.4@cacache/lib/content/write.js @ ./node_modules/_cacache@10.0.4@cacache/put.js @ ./node_modules/_cacache@10.0.4@cacache/locales/en.js @ ./node_modules/_cacache@10.0.4@cacache/index.js @ ./node_modules/_uglifyjs-webpack-plugin@1.3.0@uglifyjs-webpack-plugin/dist/uglify/Runner.js @ ./node_modules/_uglifyjs-webpack-plugin@1.3.0@uglifyjs-webpack-plugin/dist/index.js @ ./node_modules/_uglifyjs-webpack-plugin@1.3.0@uglifyjs-webpack-plugin/dist/cjs.js @ (webpack)/lib/WebpackOptionsDefaulter.js @ (webpack)/lib/webpack.js @ multi ./node_modules/_webpack-dev-server@3.1.9@webpack-dev-server/client?http://0.0.0.0:8200 webpack ERROR in ./node_modules/_fs.realpath@1.0.0@fs.realpath/old.js Module not found: Error: Can't resolve 'fs' in 'D:\java\JetBrains\module\vue-app\vue-todo\node_modules\_fs.realpath@1.0.0@fs.realpath' @ ./node_modules/_fs.realpath@1.0.0@fs.realpath/old.js 24:9-22 @ ./node_modules/_fs.realpath@1.0.0@fs.realpath/index.js @ ./node_modules/_glob@7.1.3@glob/glob.js @ ./node_modules/_cacache@10.0.4@cacache/lib/verify.js @ ./node_modules/_cacache@10.0.4@cacache/verify.js @ ./node_modules/_cacache@10.0.4@cacache/locales/en.js @ ./node_modules/_cacache@10.0.4@cacache/index.js @ ./node_modules/_uglifyjs-webpack-plugin@1.3.0@uglifyjs-webpack-plugin/dist/uglify/Runner.js @ ./node_modules/_uglifyjs-webpack-plugin@1.3.0@uglifyjs-webpack-plugin/dist/index.js @ ./node_modules/_uglifyjs-webpack-plugin@1.3.0@uglifyjs-webpack-plugin/dist/cjs.js @ (webpack)/lib/WebpackOptionsDefaulter.js @ (webpack)/lib/webpack.js @ multi ./node_modules/_webpack-dev-server@3.1.9@webpack-dev-server/client?http://0.0.0.0:8200 webpack ERROR in ./node_modules/_fs.realpath@1.0.0@fs.realpath/index.js Module not found: Error: Can't resolve 'fs' in 'D:\java\JetBrains\module\vue-app\vue-todo\node_modules\_fs.realpath@1.0.0@fs.realpath' @ ./node_modules/_fs.realpath@1.0.0@fs.realpath/index.js 8:9-22 @ ./node_modules/_glob@7.1.3@glob/glob.js @ ./node_modules/_cacache@10.0.4@cacache/lib/verify.js @ ./node_modules/_cacache@10.0.4@cacache/verify.js @ ./node_modules/_cacache@10.0.4@cacache/locales/en.js @ ./node_modules/_cacache@10.0.4@cacache/index.js @ ./node_modules/_uglifyjs-webpack-plugin@1.3.0@uglifyjs-webpack-plugin/dist/uglify/Runner.js @ ./node_modules/_uglifyjs-webpack-plugin@1.3.0@uglifyjs-webpack-plugin/dist/index.js @ ./node_modules/_uglifyjs-webpack-plugin@1.3.0@uglifyjs-webpack-plugin/dist/cjs.js @ (webpack)/lib/WebpackOptionsDefaulter.js @ (webpack)/lib/webpack.js @ multi ./node_modules/_webpack-dev-server@3.1.9@webpack-dev-server/client?http://0.0.0.0:8200 webpack ERROR in ./node_modules/_fsevents@1.2.4@fsevents/fsevents.js Module not found: Error: Can't resolve 'fs' in 'D:\java\JetBrains\module\vue-app\vue-todo\node_modules\_fsevents@1.2.4@fsevents' @ ./node_modules/_fsevents@1.2.4@fsevents/fsevents.js 17:9-22 @ ./node_modules/_chokidar@2.0.4@chokidar/lib/fsevents-handler.js @ ./node_modules/_chokidar@2.0.4@chokidar/index.js @ ./node_modules/_watchpack@1.6.0@watchpack/lib/DirectoryWatcher.js @ ./node_modules/_watchpack@1.6.0@watchpack/lib/watcherManager.js @ ./node_modules/_watchpack@1.6.0@watchpack/lib/watchpack.js @ (webpack)/lib/node/NodeWatchFileSystem.js @ (webpack)/lib/node/NodeEnvironmentPlugin.js @ (webpack)/lib/webpack.js @ multi ./node_modules/_webpack-dev-server@3.1.9@webpack-dev-server/client?http://0.0.0.0:8200 webpack ERROR in ./node_modules/_fsevents@1.2.4@fsevents/node_modules/chownr/chownr.js Module not found: Error: Can't resolve 'fs' in 'D:\java\JetBrains\module\vue-app\vue-todo\node_modules\_fsevents@1.2.4@fsevents\node_modules\chownr' @ ./node_modules/_fsevents@1.2.4@fsevents/node_modules/chownr/chownr.js 4:9-22 @ ./node_modules/_fsevents@1.2.4@fsevents/node_modules/tar/lib/mkdir.js @ ./node_modules/_fsevents@1.2.4@fsevents/node_modules/tar/lib/unpack.js @ ./node_modules/_fsevents@1.2.4@fsevents/node_modules/tar/index.js @ ./node_modules/_fsevents@1.2.4@fsevents/node_modules/node-pre-gyp/lib/package.js @ ./node_modules/_fsevents@1.2.4@fsevents/node_modules/node-pre-gyp/lib sync ^\.\/.*$ @ ./node_modules/_fsevents@1.2.4@fsevents/node_modules/node-pre-gyp/lib/node-pre-gyp.js @ ./node_modules/_fsevents@1.2.4@fsevents/fsevents.js @ ./node_modules/_chokidar@2.0.4@chokidar/lib/fsevents-handler.js @ ./node_modules/_chokidar@2.0.4@chokidar/index.js @ ./node_modules/_watchpack@1.6.0@watchpack/lib/DirectoryWatcher.js @ ./node_modules/_watchpack@1.6.0@watchpack/lib/watcherManager.js @ ./node_modules/_watchpack@1.6.0@watchpack/lib/watchpack.js @ (webpack)/lib/node/NodeWatchFileSystem.js @ (webpack)/lib/node/NodeEnvironmentPlugin.js @ (webpack)/lib/webpack.js @ multi ./node_modules/_webpack-dev-server@3.1.9@webpack-dev-server/client?http://0.0.0.0:8200 webpack ERROR in ./node_modules/_fsevents@1.2.4@fsevents/node_modules/detect-libc/lib/detect-libc.js Module not found: Error: Can't resolve 'fs' in 'D:\java\JetBrains\module\vue-app\vue-todo\node_modules\_fsevents@1.2.4@fsevents\node_modules\detect-libc\lib' @ ./node_modules/_fsevents@1.2.4@fsevents/node_modules/detect-libc/lib/detect-libc.js 5:18-31 @ ./node_modules/_fsevents@1.2.4@fsevents/node_modules/node-pre-gyp/lib/util/versioning.js @ ./node_modules/_fsevents@1.2.4@fsevents/node_modules/node-pre-gyp/lib sync ^\.\/.*$ @ ./node_modules/_fsevents@1.2.4@fsevents/node_modules/node-pre-gyp/lib/node-pre-gyp.js @ ./node_modules/_fsevents@1.2.4@fsevents/fsevents.js @ ./node_modules/_chokidar@2.0.4@chokidar/lib/fsevents-handler.js @ ./node_modules/_chokidar@2.0.4@chokidar/index.js @ ./node_modules/_watchpack@1.6.0@watchpack/lib/DirectoryWatcher.js @ ./node_modules/_watchpack@1.6.0@watchpack/lib/watcherManager.js @ ./node_modules/_watchpack@1.6.0@watchpack/lib/watchpack.js @ (webpack)/lib/node/NodeWatchFileSystem.js @ (webpack)/lib/node/NodeEnvironmentPlugin.js @ (webpack)/lib/webpack.js @ multi ./node_modules/_webpack-dev-server@3.1.9@webpack-dev-server/client?http://0.0.0.0:8200 webpack ERROR in ./node_modules/_fsevents@1.2.4@fsevents/node_modules/fs-minipass/index.js Module not found: Error: Can't resolve 'fs' in 'D:\java\JetBrains\module\vue-app\vue-todo\node_modules\_fsevents@1.2.4@fsevents\node_modules\fs-minipass' @ ./node_modules/_fsevents@1.2.4@fsevents/node_modules/fs-minipass/index.js 4:11-24 @ ./node_modules/_fsevents@1.2.4@fsevents/node_modules/tar/lib/create.js @ ./node_modules/_fsevents@1.2.4@fsevents/node_modules/tar/index.js @ ./node_modules/_fsevents@1.2.4@fsevents/node_modules/node-pre-gyp/lib/package.js @ ./node_modules/_fsevents@1.2.4@fsevents/node_modules/node-pre-gyp/lib sync ^\.\/.*$ @ ./node_modules/_fsevents@1.2.4@fsevents/node_modules/node-pre-gyp/lib/node-pre-gyp.js @ ./node_modules/_fsevents@1.2.4@fsevents/fsevents.js @ ./node_modules/_chokidar@2.0.4@chokidar/lib/fsevents-handler.js @ ./node_modules/_chokidar@2.0.4@chokidar/index.js @ ./node_modules/_watchpack@1.6.0@watchpack/lib/DirectoryWatcher.js @ ./node_modules/_watchpack@1.6.0@watchpack/lib/watcherManager.js @ ./node_modules/_watchpack@1.6.0@watchpack/lib/watchpack.js @ (webpack)/lib/node/NodeWatchFileSystem.js @ (webpack)/lib/node/NodeEnvironmentPlugin.js @ (webpack)/lib/webpack.js @ multi ./node_modules/_webpack-dev-server@3.1.9@webpack-dev-server/client?http://0.0.0.0:8200 webpack ERROR in ./node_modules/_fsevents@1.2.4@fsevents/node_modules/fs.realpath/old.js Module not found: Error: Can't resolve 'fs' in 'D:\java\JetBrains\module\vue-app\vue-todo\node_modules\_fsevents@1.2.4@fsevents\node_modules\fs.realpath' @ ./node_modules/_fsevents@1.2.4@fsevents/node_modules/fs.realpath/old.js 24:9-22 @ ./node_modules/_fsevents@1.2.4@fsevents/node_modules/fs.realpath/index.js @ ./node_modules/_fsevents@1.2.4@fsevents/node_modules/glob/glob.js @ ./node_modules/_fsevents@1.2.4@fsevents/node_modules/rimraf/rimraf.js @ ./node_modules/_fsevents@1.2.4@fsevents/node_modules/node-pre-gyp/lib/util/napi.js @ ./node_modules/_fsevents@1.2.4@fsevents/node_modules/node-pre-gyp/lib/node-pre-gyp.js @ ./node_modules/_fsevents@1.2.4@fsevents/fsevents.js @ ./node_modules/_chokidar@2.0.4@chokidar/lib/fsevents-handler.js @ ./node_modules/_chokidar@2.0.4@chokidar/index.js @ ./node_modules/_watchpack@1.6.0@watchpack/lib/DirectoryWatcher.js @ ./node_modules/_watchpack@1.6.0@watchpack/lib/watcherManager.js @ ./node_modules/_watchpack@1.6.0@watchpack/lib/watchpack.js @ (webpack)/lib/node/NodeWatchFileSystem.js @ (webpack)/lib/node/NodeEnvironmentPlugin.js @ (webpack)/lib/webpack.js @ multi ./node_modules/_webpack-dev-server@3.1.9@webpack-dev-server/client?http://0.0.0.0:8200 webpack ERROR in ./node_modules/_fsevents@1.2.4@fsevents/node_modules/fs.realpath/index.js Module not found: Error: Can't resolve 'fs' in 'D:\java\JetBrains\module\vue-app\vue-todo\node_modules\_fsevents@1.2.4@fsevents\node_modules\fs.realpath' @ ./node_modules/_fsevents@1.2.4@fsevents/node_modules/fs.realpath/index.js 8:9-22 @ ./node_modules/_fsevents@1.2.4@fsevents/node_modules/glob/glob.js @ ./node_modules/_fsevents@1.2.4@fsevents/node_modules/rimraf/rimraf.js @ ./node_modules/_fsevents@1.2.4@fsevents/node_modules/node-pre-gyp/lib/util/napi.js @ ./node_modules/_fsevents@1.2.4@fsevents/node_modules/node-pre-gyp/lib/node-pre-gyp.js @ ./node_modules/_fsevents@1.2.4@fsevents/fsevents.js @ ./node_modules/_chokidar@2.0.4@chokidar/lib/fsevents-handler.js @ ./node_modules/_chokidar@2.0.4@chokidar/index.js @ ./node_modules/_watchpack@1.6.0@watchpack/lib/DirectoryWatcher.js @ ./node_modules/_watchpack@1.6.0@watchpack/lib/watcherManager.js @ ./node_modules/_watchpack@1.6.0@watchpack/lib/watchpack.js @ (webpack)/lib/node/NodeWatchFileSystem.js @ (webpack)/lib/node/NodeEnvironmentPlugin.js @ (webpack)/lib/webpack.js @ multi ./node_modules/_webpack-dev-server@3.1.9@webpack-dev-server/client?http://0.0.0.0:8200 webpack ERROR in ./node_modules/_fsevents@1.2.4@fsevents/node_modules/glob/glob.js Module not found: Error: Can't resolve 'fs' in 'D:\java\JetBrains\module\vue-app\vue-todo\node_modules\_fsevents@1.2.4@fsevents\node_modules\glob' @ ./node_modules/_fsevents@1.2.4@fsevents/node_modules/glob/glob.js 43:9-22 @ ./node_modules/_fsevents@1.2.4@fsevents/node_modules/rimraf/rimraf.js @ ./node_modules/_fsevents@1.2.4@fsevents/node_modules/node-pre-gyp/lib/util/napi.js @ ./node_modules/_fsevents@1.2.4@fsevents/node_modules/node-pre-gyp/lib/node-pre-gyp.js @ ./node_modules/_fsevents@1.2.4@fsevents/fsevents.js @ ./node_modules/_chokidar@2.0.4@chokidar/lib/fsevents-handler.js @ ./node_modules/_chokidar@2.0.4@chokidar/index.js @ ./node_modules/_watchpack@1.6.0@watchpack/lib/DirectoryWatcher.js @ ./node_modules/_watchpack@1.6.0@watchpack/lib/watcherManager.js @ ./node_modules/_watchpack@1.6.0@watchpack/lib/watchpack.js @ (webpack)/lib/node/NodeWatchFileSystem.js @ (webpack)/lib/node/NodeEnvironmentPlugin.js @ (webpack)/lib/webpack.js @ multi ./node_modules/_webpack-dev-server@3.1.9@webpack-dev-server/client?http://0.0.0.0:8200 webpack ERROR in ./node_modules/_fsevents@1.2.4@fsevents/node_modules/glob/sync.js Module not found: Error: Can't resolve 'fs' in 'D:\java\JetBrains\module\vue-app\vue-todo\node_modules\_fsevents@1.2.4@fsevents\node_modules\glob' @ ./node_modules/_fsevents@1.2.4@fsevents/node_modules/glob/sync.js 4:9-22 @ ./node_modules/_fsevents@1.2.4@fsevents/node_modules/glob/glob.js @ ./node_modules/_fsevents@1.2.4@fsevents/node_modules/rimraf/rimraf.js @ ./node_modules/_fsevents@1.2.4@fsevents/node_modules/node-pre-gyp/lib/util/napi.js @ ./node_modules/_fsevents@1.2.4@fsevents/node_modules/node-pre-gyp/lib/node-pre-gyp.js @ ./node_modules/_fsevents@1.2.4@fsevents/fsevents.js @ ./node_modules/_chokidar@2.0.4@chokidar/lib/fsevents-handler.js @ ./node_modules/_chokidar@2.0.4@chokidar/index.js @ ./node_modules/_watchpack@1.6.0@watchpack/lib/DirectoryWatcher.js @ ./node_modules/_watchpack@1.6.0@watchpack/lib/watcherManager.js @ ./node_modules/_watchpack@1.6.0@watchpack/lib/watchpack.js @ (webpack)/lib/node/NodeWatchFileSystem.js @ (webpack)/lib/node/NodeEnvironmentPlugin.js @ (webpack)/lib/webpack.js @ multi ./node_modules/_webpack-dev-server@3.1.9@webpack-dev-server/client?http://0.0.0.0:8200 webpack ERROR in ./node_modules/_fsevents@1.2.4@fsevents/node_modules/ignore-walk/index.js Module not found: Error: Can't resolve 'fs' in 'D:\java\JetBrains\module\vue-app\vue-todo\node_modules\_fsevents@1.2.4@fsevents\node_modules\ignore-walk' @ ./node_modules/_fsevents@1.2.4@fsevents/node_modules/ignore-walk/index.js 3:11-24 @ ./node_modules/_fsevents@1.2.4@fsevents/node_modules/npm-packlist/index.js @ ./node_modules/_fsevents@1.2.4@fsevents/node_modules/node-pre-gyp/lib/package.js @ ./node_modules/_fsevents@1.2.4@fsevents/node_modules/node-pre-gyp/lib sync ^\.\/.*$ @ ./node_modules/_fsevents@1.2.4@fsevents/node_modules/node-pre-gyp/lib/node-pre-gyp.js @ ./node_modules/_fsevents@1.2.4@fsevents/fsevents.js @ ./node_modules/_chokidar@2.0.4@chokidar/lib/fsevents-handler.js @ ./node_modules/_chokidar@2.0.4@chokidar/index.js @ ./node_modules/_watchpack@1.6.0@watchpack/lib/DirectoryWatcher.js @ ./node_modules/_watchpack@1.6.0@watchpack/lib/watcherManager.js @ ./node_modules/_watchpack@1.6.0@watchpack/lib/watchpack.js @ (webpack)/lib/node/NodeWatchFileSystem.js @ (webpack)/lib/node/NodeEnvironmentPlugin.js @ (webpack)/lib/webpack.js @ multi ./node_modules/_webpack-dev-server@3.1.9@webpack-dev-server/client?http://0.0.0.0:8200 webpack ERROR in ./node_modules/_fsevents@1.2.4@fsevents/node_modules/mkdirp/index.js Module not found: Error: Can't resolve 'fs' in 'D:\java\JetBrains\module\vue-app\vue-todo\node_modules\_fsevents@1.2.4@fsevents\node_modules\mkdirp' @ ./node_modules/_fsevents@1.2.4@fsevents/node_modules/mkdirp/index.js 2:9-22 @ ./node_modules/_fsevents@1.2.4@fsevents/node_modules/node-pre-gyp/lib/testpackage.js @ ./node_modules/_fsevents@1.2.4@fsevents/node_modules/node-pre-gyp/lib sync ^\.\/.*$ @ ./node_modules/_fsevents@1.2.4@fsevents/node_modules/node-pre-gyp/lib/node-pre-gyp.js @ ./node_modules/_fsevents@1.2.4@fsevents/fsevents.js @ ./node_modules/_chokidar@2.0.4@chokidar/lib/fsevents-handler.js @ ./node_modules/_chokidar@2.0.4@chokidar/index.js @ ./node_modules/_watchpack@1.6.0@watchpack/lib/DirectoryWatcher.js @ ./node_modules/_watchpack@1.6.0@watchpack/lib/watcherManager.js @ ./node_modules/_watchpack@1.6.0@watchpack/lib/watchpack.js @ (webpack)/lib/node/NodeWatchFileSystem.js @ (webpack)/lib/node/NodeEnvironmentPlugin.js @ (webpack)/lib/webpack.js @ multi ./node_modules/_webpack-dev-server@3.1.9@webpack-dev-server/client?http://0.0.0.0:8200 webpack ERROR in ./node_modules/_fsevents@1.2.4@fsevents/node_modules/needle/lib/multipart.js Module not found: Error: Can't resolve 'fs' in 'D:\java\JetBrains\module\vue-app\vue-todo\node_modules\_fsevents@1.2.4@fsevents\node_modules\needle\lib' @ ./node_modules/_fsevents@1.2.4@fsevents/node_modules/needle/lib/multipart.js 1:15-28 @ ./node_modules/_fsevents@1.2.4@fsevents/node_modules/needle/lib/needle.js @ ./node_modules/_fsevents@1.2.4@fsevents/node_modules/node-pre-gyp/lib/install.js @ ./node_modules/_fsevents@1.2.4@fsevents/node_modules/node-pre-gyp/lib sync ^\.\/.*$ @ ./node_modules/_fsevents@1.2.4@fsevents/node_modules/node-pre-gyp/lib/node-pre-gyp.js @ ./node_modules/_fsevents@1.2.4@fsevents/fsevents.js @ ./node_modules/_chokidar@2.0.4@chokidar/lib/fsevents-handler.js @ ./node_modules/_chokidar@2.0.4@chokidar/index.js @ ./node_modules/_watchpack@1.6.0@watchpack/lib/DirectoryWatcher.js @ ./node_modules/_watchpack@1.6.0@watchpack/lib/watcherManager.js @ ./node_modules/_watchpack@1.6.0@watchpack/lib/watchpack.js @ (webpack)/lib/node/NodeWatchFileSystem.js @ (webpack)/lib/node/NodeEnvironmentPlugin.js @ (webpack)/lib/webpack.js @ multi ./node_modules/_webpack-dev-server@3.1.9@webpack-dev-server/client?http://0.0.0.0:8200 webpack ERROR in ./node_modules/_fsevents@1.2.4@fsevents/node_modules/needle/lib/needle.js Module not found: Error: Can't resolve 'fs' in 'D:\java\JetBrains\module\vue-app\vue-todo\node_modules\_fsevents@1.2.4@fsevents\node_modules\needle\lib' @ ./node_modules/_fsevents@1.2.4@fsevents/node_modules/needle/lib/needle.js 8:18-31 @ ./node_modules/_fsevents@1.2.4@fsevents/node_modules/node-pre-gyp/lib/install.js @ ./node_modules/_fsevents@1.2.4@fsevents/node_modules/node-pre-gyp/lib sync ^\.\/.*$ @ ./node_modules/_fsevents@1.2.4@fsevents/node_modules/node-pre-gyp/lib/node-pre-gyp.js @ ./node_modules/_fsevents@1.2.4@fsevents/fsevents.js @ ./node_modules/_chokidar@2.0.4@chokidar/lib/fsevents-handler.js @ ./node_modules/_chokidar@2.0.4@chokidar/index.js @ ./node_modules/_watchpack@1.6.0@watchpack/lib/DirectoryWatcher.js @ ./node_modules/_watchpack@1.6.0@watchpack/lib/watcherManager.js @ ./node_modules/_watchpack@1.6.0@watchpack/lib/watchpack.js @ (webpack)/lib/node/NodeWatchFileSystem.js @ (webpack)/lib/node/NodeEnvironmentPlugin.js @ (webpack)/lib/webpack.js @ multi ./node_modules/_webpack-dev-server@3.1.9@webpack-dev-server/client?http://0.0.0.0:8200 webpack ERROR in ./node_modules/_fsevents@1.2.4@fsevents/node_modules/node-pre-gyp/lib/testbinary.js Module not found: Error: Can't resolve 'fs' in 'D:\java\JetBrains\module\vue-app\vue-todo\node_modules\_fsevents@1.2.4@fsevents\node_modules\node-pre-gyp\lib' @ ./node_modules/_fsevents@1.2.4@fsevents/node_modules/node-pre-gyp/lib/testbinary.js 7:9-22 @ ./node_modules/_fsevents@1.2.4@fsevents/node_modules/node-pre-gyp/lib sync ^\.\/.*$ @ ./node_modules/_fsevents@1.2.4@fsevents/node_modules/node-pre-gyp/lib/node-pre-gyp.js @ ./node_modules/_fsevents@1.2.4@fsevents/fsevents.js @ ./node_modules/_chokidar@2.0.4@chokidar/lib/fsevents-handler.js @ ./node_modules/_chokidar@2.0.4@chokidar/index.js @ ./node_modules/_watchpack@1.6.0@watchpack/lib/DirectoryWatcher.js @ ./node_modules/_watchpack@1.6.0@watchpack/lib/watcherManager.js @ ./node_modules/_watchpack@1.6.0@watchpack/lib/watchpack.js @ (webpack)/lib/node/NodeWatchFileSystem.js @ (webpack)/lib/node/NodeEnvironmentPlugin.js @ (webpack)/lib/webpack.js @ multi ./node_modules/_webpack-dev-server@3.1.9@webpack-dev-server/client?http://0.0.0.0:8200 webpack ERROR in ./node_modules/_fsevents@1.2.4@fsevents/node_modules/node-pre-gyp/lib/testpackage.js Module not found: Error: Can't resolve 'fs' in 'D:\java\JetBrains\module\vue-app\vue-todo\node_modules\_fsevents@1.2.4@fsevents\node_modules\node-pre-gyp\lib' @ ./node_modules/_fsevents@1.2.4@fsevents/node_modules/node-pre-gyp/lib/testpackage.js 7:9-22 @ ./node_modules/_fsevents@1.2.4@fsevents/node_modules/node-pre-gyp/lib sync ^\.\/.*$ @ ./node_modules/_fsevents@1.2.4@fsevents/node_modules/node-pre-gyp/lib/node-pre-gyp.js @ ./node_modules/_fsevents@1.2.4@fsevents/fsevents.js @ ./node_modules/_chokidar@2.0.4@chokidar/lib/fsevents-handler.js @ ./node_modules/_chokidar@2.0.4@chokidar/index.js @ ./node_modules/_watchpack@1.6.0@watchpack/lib/DirectoryWatcher.js @ ./node_modules/_watchpack@1.6.0@watchpack/lib/watcherManager.js @ ./node_modules/_watchpack@1.6.0@watchpack/lib/watchpack.js @ (webpack)/lib/node/NodeWatchFileSystem.js @ (webpack)/lib/node/NodeEnvironmentPlugin.js @ (webpack)/lib/webpack.js @ multi ./node_modules/_webpack-dev-server@3.1.9@webpack-dev-server/client?http://0.0.0.0:8200 webpack ERROR in ./node_modules/_fsevents@1.2.4@fsevents/node_modules/node-pre-gyp/lib/node-pre-gyp.js Module not found: Error: Can't resolve 'fs' in 'D:\java\JetBrains\module\vue-app\vue-todo\node_modules\_fsevents@1.2.4@fsevents\node_modules\node-pre-gyp\lib' @ ./node_modules/_fsevents@1.2.4@fsevents/node_modules/node-pre-gyp/lib/node-pre-gyp.js 13:9-22 @ ./node_modules/_fsevents@1.2.4@fsevents/fsevents.js @ ./node_modules/_chokidar@2.0.4@chokidar/lib/fsevents-handler.js @ ./node_modules/_chokidar@2.0.4@chokidar/index.js @ ./node_modules/_watchpack@1.6.0@watchpack/lib/DirectoryWatcher.js @ ./node_modules/_watchpack@1.6.0@watchpack/lib/watcherManager.js @ ./node_modules/_watchpack@1.6.0@watchpack/lib/watchpack.js @ (webpack)/lib/node/NodeWatchFileSystem.js @ (webpack)/lib/node/NodeEnvironmentPlugin.js @ (webpack)/lib/webpack.js @ multi ./node_modules/_webpack-dev-server@3.1.9@webpack-dev-server/client?http://0.0.0.0:8200 webpack ERROR in ./node_modules/_fsevents@1.2.4@fsevents/node_modules/node-pre-gyp/lib/pre-binding.js Module not found: Error: Can't resolve 'fs' in 'D:\java\JetBrains\module\vue-app\vue-todo\node_modules\_fsevents@1.2.4@fsevents\node_modules\node-pre-gyp\lib' @ ./node_modules/_fsevents@1.2.4@fsevents/node_modules/node-pre-gyp/lib/pre-binding.js 5:17-30 @ ./node_modules/_fsevents@1.2.4@fsevents/node_modules/node-pre-gyp/lib/node-pre-gyp.js @ ./node_modules/_fsevents@1.2.4@fsevents/fsevents.js @ ./node_modules/_chokidar@2.0.4@chokidar/lib/fsevents-handler.js @ ./node_modules/_chokidar@2.0.4@chokidar/index.js @ ./node_modules/_watchpack@1.6.0@watchpack/lib/DirectoryWatcher.js @ ./node_modules/_watchpack@1.6.0@watchpack/lib/watcherManager.js @ ./node_modules/_watchpack@1.6.0@watchpack/lib/watchpack.js @ (webpack)/lib/node/NodeWatchFileSystem.js @ (webpack)/lib/node/NodeEnvironmentPlugin.js @ (webpack)/lib/webpack.js @ multi ./node_modules/_webpack-dev-server@3.1.9@webpack-dev-server/client?http://0.0.0.0:8200 webpack ERROR in ./node_modules/_fsevents@1.2.4@fsevents/node_modules/node-pre-gyp/lib/clean.js Module not found: Error: Can't resolve 'fs' in 'D:\java\JetBrains\module\vue-app\vue-todo\node_modules\_fsevents@1.2.4@fsevents\node_modules\node-pre-gyp\lib' @ ./node_modules/_fsevents@1.2.4@fsevents/node_modules/node-pre-gyp/lib/clean.js 7:9-22 9:13-26 @ ./node_modules/_fsevents@1.2.4@fsevents/node_modules/node-pre-gyp/lib sync ^\.\/.*$ @ ./node_modules/_fsevents@1.2.4@fsevents/node_modules/node-pre-gyp/lib/node-pre-gyp.js @ ./node_modules/_fsevents@1.2.4@fsevents/fsevents.js @ ./node_modules/_chokidar@2.0.4@chokidar/lib/fsevents-handler.js @ ./node_modules/_chokidar@2.0.4@chokidar/index.js @ ./node_modules/_watchpack@1.6.0@watchpack/lib/DirectoryWatcher.js @ ./node_modules/_watchpack@1.6.0@watchpack/lib/watcherManager.js @ ./node_modules/_watchpack@1.6.0@watchpack/lib/watchpack.js @ (webpack)/lib/node/NodeWatchFileSystem.js @ (webpack)/lib/node/NodeEnvironmentPlugin.js @ (webpack)/lib/webpack.js @ multi ./node_modules/_webpack-dev-server@3.1.9@webpack-dev-server/client?http://0.0.0.0:8200 webpack ERROR in ./node_modules/_fsevents@1.2.4@fsevents/node_modules/node-pre-gyp/lib/unpublish.js Module not found: Error: Can't resolve 'fs' in 'D:\java\JetBrains\module\vue-app\vue-todo\node_modules\_fsevents@1.2.4@fsevents\node_modules\node-pre-gyp\lib' @ ./node_modules/_fsevents@1.2.4@fsevents/node_modules/node-pre-gyp/lib/unpublish.js 7:9-22 @ ./node_modules/_fsevents@1.2.4@fsevents/node_modules/node-pre-gyp/lib sync ^\.\/.*$ @ ./node_modules/_fsevents@1.2.4@fsevents/node_modules/node-pre-gyp/lib/node-pre-gyp.js @ ./node_modules/_fsevents@1.2.4@fsevents/fsevents.js @ ./node_modules/_chokidar@2.0.4@chokidar/lib/fsevents-handler.js @ ./node_modules/_chokidar@2.0.4@chokidar/index.js @ ./node_modules/_watchpack@1.6.0@watchpack/lib/DirectoryWatcher.js @ ./node_modules/_watchpack@1.6.0@watchpack/lib/watcherManager.js @ ./node_modules/_watchpack@1.6.0@watchpack/lib/watchpack.js @ (webpack)/lib/node/NodeWatchFileSystem.js @ (webpack)/lib/node/NodeEnvironmentPlugin.js @ (webpack)/lib/webpack.js @ multi ./node_modules/_webpack-dev-server@3.1.9@webpack-dev-server/client?http://0.0.0.0:8200 webpack ERROR in ./node_modules/_fsevents@1.2.4@fsevents/node_modules/node-pre-gyp/lib/package.js Module not found: Error: Can't resolve 'fs' in 'D:\java\JetBrains\module\vue-app\vue-todo\node_modules\_fsevents@1.2.4@fsevents\node_modules\node-pre-gyp\lib' @ ./node_modules/_fsevents@1.2.4@fsevents/node_modules/node-pre-gyp/lib/package.js 7:9-22 12:12-25 @ ./node_modules/_fsevents@1.2.4@fsevents/node_modules/node-pre-gyp/lib sync ^\.\/.*$ @ ./node_modules/_fsevents@1.2.4@fsevents/node_modules/node-pre-gyp/lib/node-pre-gyp.js @ ./node_modules/_fsevents@1.2.4@fsevents/fsevents.js @ ./node_modules/_chokidar@2.0.4@chokidar/lib/fsevents-handler.js @ ./node_modules/_chokidar@2.0.4@chokidar/index.js @ ./node_modules/_watchpack@1.6.0@watchpack/lib/DirectoryWatcher.js @ ./node_modules/_watchpack@1.6.0@watchpack/lib/watcherManager.js @ ./node_modules/_watchpack@1.6.0@watchpack/lib/watchpack.js @ (webpack)/lib/node/NodeWatchFileSystem.js @ (webpack)/lib/node/NodeEnvironmentPlugin.js @ (webpack)/lib/webpack.js @ multi ./node_modules/_webpack-dev-server@3.1.9@webpack-dev-server/client?http://0.0.0.0:8200 webpack ERROR in ./node_modules/_fsevents@1.2.4@fsevents/node_modules/npm-bundled/index.js Module not found: Error: Can't resolve 'fs' in 'D:\java\JetBrains\module\vue-app\vue-todo\node_modules\_fsevents@1.2.4@fsevents\node_modules\npm-bundled' @ ./node_modules/_fsevents@1.2.4@fsevents/node_modules/npm-bundled/index.js 10:11-24 @ ./node_modules/_fsevents@1.2.4@fsevents/node_modules/npm-packlist/index.js @ ./node_modules/_fsevents@1.2.4@fsevents/node_modules/node-pre-gyp/lib/package.js @ ./node_modules/_fsevents@1.2.4@fsevents/node_modules/node-pre-gyp/lib sync ^\.\/.*$ @ ./node_modules/_fsevents@1.2.4@fsevents/node_modules/node-pre-gyp/lib/node-pre-gyp.js @ ./node_modules/_fsevents@1.2.4@fsevents/fsevents.js @ ./node_modules/_chokidar@2.0.4@chokidar/lib/fsevents-handler.js @ ./node_modules/_chokidar@2.0.4@chokidar/index.js @ ./node_modules/_watchpack@1.6.0@watchpack/lib/DirectoryWatcher.js @ ./node_modules/_watchpack@1.6.0@watchpack/lib/watcherManager.js @ ./node_modules/_watchpack@1.6.0@watchpack/lib/watchpack.js @ (webpack)/lib/node/NodeWatchFileSystem.js @ (webpack)/lib/node/NodeEnvironmentPlugin.js @ (webpack)/lib/webpack.js @ multi ./node_modules/_webpack-dev-server@3.1.9@webpack-dev-server/client?http://0.0.0.0:8200 webpack ERROR in ./node_modules/_fsevents@1.2.4@fsevents/node_modules/rimraf/rimraf.js Module not found: Error: Can't resolve 'fs' in 'D:\java\JetBrains\module\vue-app\vue-todo\node_modules\_fsevents@1.2.4@fsevents\node_modules\rimraf' @ ./node_modules/_fsevents@1.2.4@fsevents/node_modules/rimraf/rimraf.js 6:9-22 @ ./node_modules/_fsevents@1.2.4@fsevents/node_modules/node-pre-gyp/lib/util/napi.js @ ./node_modules/_fsevents@1.2.4@fsevents/node_modules/node-pre-gyp/lib/node-pre-gyp.js @ ./node_modules/_fsevents@1.2.4@fsevents/fsevents.js @ ./node_modules/_chokidar@2.0.4@chokidar/lib/fsevents-handler.js @ ./node_modules/_chokidar@2.0.4@chokidar/index.js @ ./node_modules/_watchpack@1.6.0@watchpack/lib/DirectoryWatcher.js @ ./node_modules/_watchpack@1.6.0@watchpack/lib/watcherManager.js @ ./node_modules/_watchpack@1.6.0@watchpack/lib/watchpack.js @ (webpack)/lib/node/NodeWatchFileSystem.js @ (webpack)/lib/node/NodeEnvironmentPlugin.js @ (webpack)/lib/webpack.js @ multi ./node_modules/_webpack-dev-server@3.1.9@webpack-dev-server/client?http://0.0.0.0:8200 webpack ERROR in ./node_modules/_fsevents@1.2.4@fsevents/node_modules/tar/lib/replace.js Module not found: Error: Can't resolve 'fs' in 'D:\java\JetBrains\module\vue-app\vue-todo\node_modules\_fsevents@1.2.4@fsevents\node_modules\tar\lib' @ ./node_modules/_fsevents@1.2.4@fsevents/node_modules/tar/lib/replace.js 8:11-24 @ ./node_modules/_fsevents@1.2.4@fsevents/node_modules/tar/index.js @ ./node_modules/_fsevents@1.2.4@fsevents/node_modules/node-pre-gyp/lib/package.js @ ./node_modules/_fsevents@1.2.4@fsevents/node_modules/node-pre-gyp/lib sync ^\.\/.*$ @ ./node_modules/_fsevents@1.2.4@fsevents/node_modules/node-pre-gyp/lib/node-pre-gyp.js @ ./node_modules/_fsevents@1.2.4@fsevents/fsevents.js @ ./node_modules/_chokidar@2.0.4@chokidar/lib/fsevents-handler.js @ ./node_modules/_chokidar@2.0.4@chokidar/index.js @ ./node_modules/_watchpack@1.6.0@watchpack/lib/DirectoryWatcher.js @ ./node_modules/_watchpack@1.6.0@watchpack/lib/watcherManager.js @ ./node_modules/_watchpack@1.6.0@watchpack/lib/watchpack.js @ (webpack)/lib/node/NodeWatchFileSystem.js @ (webpack)/lib/node/NodeEnvironmentPlugin.js @ (webpack)/lib/webpack.js @ multi ./node_modules/_webpack-dev-server@3.1.9@webpack-dev-server/client?http://0.0.0.0:8200 webpack ERROR in ./node_modules/_fsevents@1.2.4@fsevents/node_modules/tar/lib/mkdir.js Module not found: Error: Can't resolve 'fs' in 'D:\java\JetBrains\module\vue-app\vue-todo\node_modules\_fsevents@1.2.4@fsevents\node_modules\tar\lib' @ ./node_modules/_fsevents@1.2.4@fsevents/node_modules/tar/lib/mkdir.js 8:11-24 @ ./node_modules/_fsevents@1.2.4@fsevents/node_modules/tar/lib/unpack.js @ ./node_modules/_fsevents@1.2.4@fsevents/node_modules/tar/index.js @ ./node_modules/_fsevents@1.2.4@fsevents/node_modules/node-pre-gyp/lib/package.js @ ./node_modules/_fsevents@1.2.4@fsevents/node_modules/node-pre-gyp/lib sync ^\.\/.*$ @ ./node_modules/_fsevents@1.2.4@fsevents/node_modules/node-pre-gyp/lib/node-pre-gyp.js @ ./node_modules/_fsevents@1.2.4@fsevents/fsevents.js @ ./node_modules/_chokidar@2.0.4@chokidar/lib/fsevents-handler.js @ ./node_modules/_chokidar@2.0.4@chokidar/index.js @ ./node_modules/_watchpack@1.6.0@watchpack/lib/DirectoryWatcher.js @ ./node_modules/_watchpack@1.6.0@watchpack/lib/watcherManager.js @ ./node_modules/_watchpack@1.6.0@watchpack/lib/watchpack.js @ (webpack)/lib/node/NodeWatchFileSystem.js @ (webpack)/lib/node/NodeEnvironmentPlugin.js @ (webpack)/lib/webpack.js @ multi ./node_modules/_webpack-dev-server@3.1.9@webpack-dev-server/client?http://0.0.0.0:8200 webpack ERROR in ./node_modules/_fsevents@1.2.4@fsevents/node_modules/tar/lib/write-entry.js Module not found: Error: Can't resolve 'fs' in 'D:\java\JetBrains\module\vue-app\vue-todo\node_modules\_fsevents@1.2.4@fsevents\node_modules\tar\lib' @ ./node_modules/_fsevents@1.2.4@fsevents/node_modules/tar/lib/write-entry.js 7:11-24 @ ./node_modules/_fsevents@1.2.4@fsevents/node_modules/tar/index.js @ ./node_modules/_fsevents@1.2.4@fsevents/node_modules/node-pre-gyp/lib/package.js @ ./node_modules/_fsevents@1.2.4@fsevents/node_modules/node-pre-gyp/lib sync ^\.\/.*$ @ ./node_modules/_fsevents@1.2.4@fsevents/node_modules/node-pre-gyp/lib/node-pre-gyp.js @ ./node_modules/_fsevents@1.2.4@fsevents/fsevents.js @ ./node_modules/_chokidar@2.0.4@chokidar/lib/fsevents-handler.js @ ./node_modules/_chokidar@2.0.4@chokidar/index.js @ ./node_modules/_watchpack@1.6.0@watchpack/lib/DirectoryWatcher.js @ ./node_modules/_watchpack@1.6.0@watchpack/lib/watcherManager.js @ ./node_modules/_watchpack@1.6.0@watchpack/lib/watchpack.js @ (webpack)/lib/node/NodeWatchFileSystem.js @ (webpack)/lib/node/NodeEnvironmentPlugin.js @ (webpack)/lib/webpack.js @ multi ./node_modules/_webpack-dev-server@3.1.9@webpack-dev-server/client?http://0.0.0.0:8200 webpack ERROR in ./node_modules/_fsevents@1.2.4@fsevents/node_modules/tar/lib/unpack.js Module not found: Error: Can't resolve 'fs' in 'D:\java\JetBrains\module\vue-app\vue-todo\node_modules\_fsevents@1.2.4@fsevents\node_modules\tar\lib' @ ./node_modules/_fsevents@1.2.4@fsevents/node_modules/tar/lib/unpack.js 6:11-24 @ ./node_modules/_fsevents@1.2.4@fsevents/node_modules/tar/index.js @ ./node_modules/_fsevents@1.2.4@fsevents/node_modules/node-pre-gyp/lib/package.js @ ./node_modules/_fsevents@1.2.4@fsevents/node_modules/node-pre-gyp/lib sync ^\.\/.*$ @ ./node_modules/_fsevents@1.2.4@fsevents/node_modules/node-pre-gyp/lib/node-pre-gyp.js @ ./node_modules/_fsevents@1.2.4@fsevents/fsevents.js @ ./node_modules/_chokidar@2.0.4@chokidar/lib/fsevents-handler.js @ ./node_modules/_chokidar@2.0.4@chokidar/index.js @ ./node_modules/_watchpack@1.6.0@watchpack/lib/DirectoryWatcher.js @ ./node_modules/_watchpack@1.6.0@watchpack/lib/watcherManager.js @ ./node_modules/_watchpack@1.6.0@watchpack/lib/watchpack.js @ (webpack)/lib/node/NodeWatchFileSystem.js @ (webpack)/lib/node/NodeEnvironmentPlugin.js @ (webpack)/lib/webpack.js @ multi ./node_modules/_webpack-dev-server@3.1.9@webpack-dev-server/client?http://0.0.0.0:8200 webpack ERROR in ./node_modules/_fsevents@1.2.4@fsevents/node_modules/tar/lib/pack.js Module not found: Error: Can't resolve 'fs' in 'D:\java\JetBrains\module\vue-app\vue-todo\node_modules\_fsevents@1.2.4@fsevents\node_modules\tar\lib' @ ./node_modules/_fsevents@1.2.4@fsevents/node_modules/tar/lib/pack.js 56:11-24 @ ./node_modules/_fsevents@1.2.4@fsevents/node_modules/tar/index.js @ ./node_modules/_fsevents@1.2.4@fsevents/node_modules/node-pre-gyp/lib/package.js @ ./node_modules/_fsevents@1.2.4@fsevents/node_modules/node-pre-gyp/lib sync ^\.\/.*$ @ ./node_modules/_fsevents@1.2.4@fsevents/node_modules/node-pre-gyp/lib/node-pre-gyp.js @ ./node_modules/_fsevents@1.2.4@fsevents/fsevents.js @ ./node_modules/_chokidar@2.0.4@chokidar/lib/fsevents-handler.js @ ./node_modules/_chokidar@2.0.4@chokidar/index.js @ ./node_modules/_watchpack@1.6.0@watchpack/lib/DirectoryWatcher.js @ ./node_modules/_watchpack@1.6.0@watchpack/lib/watcherManager.js @ ./node_modules/_watchpack@1.6.0@watchpack/lib/watchpack.js @ (webpack)/lib/node/NodeWatchFileSystem.js @ (webpack)/lib/node/NodeEnvironmentPlugin.js @ (webpack)/lib/webpack.js @ multi ./node_modules/_webpack-dev-server@3.1.9@webpack-dev-server/client?http://0.0.0.0:8200 webpack ERROR in ./node_modules/_fsevents@1.2.4@fsevents/node_modules/tar/lib/extract.js Module not found: Error: Can't resolve 'fs' in 'D:\java\JetBrains\module\vue-app\vue-todo\node_modules\_fsevents@1.2.4@fsevents\node_modules\tar\lib' @ ./node_modules/_fsevents@1.2.4@fsevents/node_modules/tar/lib/extract.js 6:11-24 @ ./node_modules/_fsevents@1.2.4@fsevents/node_modules/tar/index.js @ ./node_modules/_fsevents@1.2.4@fsevents/node_modules/node-pre-gyp/lib/package.js @ ./node_modules/_fsevents@1.2.4@fsevents/node_modules/node-pre-gyp/lib sync ^\.\/.*$ @ ./node_modules/_fsevents@1.2.4@fsevents/node_modules/node-pre-gyp/lib/node-pre-gyp.js @ ./node_modules/_fsevents@1.2.4@fsevents/fsevents.js @ ./node_modules/_chokidar@2.0.4@chokidar/lib/fsevents-handler.js @ ./node_modules/_chokidar@2.0.4@chokidar/index.js @ ./node_modules/_watchpack@1.6.0@watchpack/lib/DirectoryWatcher.js @ ./node_modules/_watchpack@1.6.0@watchpack/lib/watcherManager.js @ ./node_modules/_watchpack@1.6.0@watchpack/lib/watchpack.js @ (webpack)/lib/node/NodeWatchFileSystem.js @ (webpack)/lib/node/NodeEnvironmentPlugin.js @ (webpack)/lib/webpack.js @ multi ./node_modules/_webpack-dev-server@3.1.9@webpack-dev-server/client?http://0.0.0.0:8200 webpack ERROR in ./node_modules/_fsevents@1.2.4@fsevents/node_modules/tar/lib/list.js Module not found: Error: Can't resolve 'fs' in 'D:\java\JetBrains\module\vue-app\vue-todo\node_modules\_fsevents@1.2.4@fsevents\node_modules\tar\lib' @ ./node_modules/_fsevents@1.2.4@fsevents/node_modules/tar/lib/list.js 11:11-24 @ ./node_modules/_fsevents@1.2.4@fsevents/node_modules/tar/index.js @ ./node_modules/_fsevents@1.2.4@fsevents/node_modules/node-pre-gyp/lib/package.js @ ./node_modules/_fsevents@1.2.4@fsevents/node_modules/node-pre-gyp/lib sync ^\.\/.*$ @ ./node_modules/_fsevents@1.2.4@fsevents/node_modules/node-pre-gyp/lib/node-pre-gyp.js @ ./node_modules/_fsevents@1.2.4@fsevents/fsevents.js @ ./node_modules/_chokidar@2.0.4@chokidar/lib/fsevents-handler.js @ ./node_modules/_chokidar@2.0.4@chokidar/index.js @ ./node_modules/_watchpack@1.6.0@watchpack/lib/DirectoryWatcher.js @ ./node_modules/_watchpack@1.6.0@watchpack/lib/watcherManager.js @ ./node_modules/_watchpack@1.6.0@watchpack/lib/watchpack.js @ (webpack)/lib/node/NodeWatchFileSystem.js @ (webpack)/lib/node/NodeEnvironmentPlugin.js @ (webpack)/lib/webpack.js @ multi ./node_modules/_webpack-dev-server@3.1.9@webpack-dev-server/client?http://0.0.0.0:8200 webpack ERROR in ./node_modules/_fsevents@1.2.4@fsevents/node_modules/tar/lib/create.js Module not found: Error: Can't resolve 'fs' in 'D:\java\JetBrains\module\vue-app\vue-todo\node_modules\_fsevents@1.2.4@fsevents\node_modules\tar\lib' @ ./node_modules/_fsevents@1.2.4@fsevents/node_modules/tar/lib/create.js 7:11-24 @ ./node_modules/_fsevents@1.2.4@fsevents/node_modules/tar/index.js @ ./node_modules/_fsevents@1.2.4@fsevents/node_modules/node-pre-gyp/lib/package.js @ ./node_modules/_fsevents@1.2.4@fsevents/node_modules/node-pre-gyp/lib sync ^\.\/.*$ @ ./node_modules/_fsevents@1.2.4@fsevents/node_modules/node-pre-gyp/lib/node-pre-gyp.js @ ./node_modules/_fsevents@1.2.4@fsevents/fsevents.js @ ./node_modules/_chokidar@2.0.4@chokidar/lib/fsevents-handler.js @ ./node_modules/_chokidar@2.0.4@chokidar/index.js @ ./node_modules/_watchpack@1.6.0@watchpack/lib/DirectoryWatcher.js @ ./node_modules/_watchpack@1.6.0@watchpack/lib/watcherManager.js @ ./node_modules/_watchpack@1.6.0@watchpack/lib/watchpack.js @ (webpack)/lib/node/NodeWatchFileSystem.js @ (webpack)/lib/node/NodeEnvironmentPlugin.js @ (webpack)/lib/webpack.js @ multi ./node_modules/_webpack-dev-server@3.1.9@webpack-dev-server/client?http://0.0.0.0:8200 webpack ERROR in ./node_modules/_glob@7.1.3@glob/sync.js Module not found: Error: Can't resolve 'fs' in 'D:\java\JetBrains\module\vue-app\vue-todo\node_modules\_glob@7.1.3@glob' @ ./node_modules/_glob@7.1.3@glob/sync.js 4:9-22 @ ./node_modules/_glob@7.1.3@glob/glob.js @ ./node_modules/_cacache@10.0.4@cacache/lib/verify.js @ ./node_modules/_cacache@10.0.4@cacache/verify.js @ ./node_modules/_cacache@10.0.4@cacache/locales/en.js @ ./node_modules/_cacache@10.0.4@cacache/index.js @ ./node_modules/_uglifyjs-webpack-plugin@1.3.0@uglifyjs-webpack-plugin/dist/uglify/Runner.js @ ./node_modules/_uglifyjs-webpack-plugin@1.3.0@uglifyjs-webpack-plugin/dist/index.js @ ./node_modules/_uglifyjs-webpack-plugin@1.3.0@uglifyjs-webpack-plugin/dist/cjs.js @ (webpack)/lib/WebpackOptionsDefaulter.js @ (webpack)/lib/webpack.js @ multi ./node_modules/_webpack-dev-server@3.1.9@webpack-dev-server/client?http://0.0.0.0:8200 webpack ERROR in ./node_modules/_glob@7.1.3@glob/glob.js Module not found: Error: Can't resolve 'fs' in 'D:\java\JetBrains\module\vue-app\vue-todo\node_modules\_glob@7.1.3@glob' @ ./node_modules/_glob@7.1.3@glob/glob.js 43:9-22 @ ./node_modules/_cacache@10.0.4@cacache/lib/verify.js @ ./node_modules/_cacache@10.0.4@cacache/verify.js @ ./node_modules/_cacache@10.0.4@cacache/locales/en.js @ ./node_modules/_cacache@10.0.4@cacache/index.js @ ./node_modules/_uglifyjs-webpack-plugin@1.3.0@uglifyjs-webpack-plugin/dist/uglify/Runner.js @ ./node_modules/_uglifyjs-webpack-plugin@1.3.0@uglifyjs-webpack-plugin/dist/index.js @ ./node_modules/_uglifyjs-webpack-plugin@1.3.0@uglifyjs-webpack-plugin/dist/cjs.js @ (webpack)/lib/WebpackOptionsDefaulter.js @ (webpack)/lib/webpack.js @ multi ./node_modules/_webpack-dev-server@3.1.9@webpack-dev-server/client?http://0.0.0.0:8200 webpack ERROR in ./node_modules/_graceful-fs@4.1.11@graceful-fs/graceful-fs.js Module not found: Error: Can't resolve 'fs' in 'D:\java\JetBrains\module\vue-app\vue-todo\node_modules\_graceful-fs@4.1.11@graceful-fs' @ ./node_modules/_graceful-fs@4.1.11@graceful-fs/graceful-fs.js 1:9-22 @ ./node_modules/_enhanced-resolve@4.1.0@enhanced-resolve/lib/NodeJsInputFileSystem.js @ (webpack)/lib/node/NodeEnvironmentPlugin.js @ (webpack)/lib/webpack.js @ multi ./node_modules/_webpack-dev-server@3.1.9@webpack-dev-server/client?http://0.0.0.0:8200 webpack ERROR in ./node_modules/_graceful-fs@4.1.11@graceful-fs/fs.js Module not found: Error: Can't resolve 'fs' in 'D:\java\JetBrains\module\vue-app\vue-todo\node_modules\_graceful-fs@4.1.11@graceful-fs' @ ./node_modules/_graceful-fs@4.1.11@graceful-fs/fs.js 3:9-22 @ ./node_modules/_graceful-fs@4.1.11@graceful-fs/graceful-fs.js @ ./node_modules/_enhanced-resolve@4.1.0@enhanced-resolve/lib/NodeJsInputFileSystem.js @ (webpack)/lib/node/NodeEnvironmentPlugin.js @ (webpack)/lib/webpack.js @ multi ./node_modules/_webpack-dev-server@3.1.9@webpack-dev-server/client?http://0.0.0.0:8200 webpack ERROR in ./node_modules/_loader-runner@2.3.1@loader-runner/lib/LoaderRunner.js Module not found: Error: Can't resolve 'fs' in 'D:\java\JetBrains\module\vue-app\vue-todo\node_modules\_loader-runner@2.3.1@loader-runner\lib' @ ./node_modules/_loader-runner@2.3.1@loader-runner/lib/LoaderRunner.js 5:9-22 @ (webpack)/lib/NormalModule.js @ (webpack)/lib/AutomaticPrefetchPlugin.js @ (webpack)/lib/webpack.js @ multi ./node_modules/_webpack-dev-server@3.1.9@webpack-dev-server/client?http://0.0.0.0:8200 webpack ERROR in ./node_modules/_make-dir@1.3.0@make-dir/index.js Module not found: Error: Can't resolve 'fs' in 'D:\java\JetBrains\module\vue-app\vue-todo\node_modules\_make-dir@1.3.0@make-dir' @ ./node_modules/_make-dir@1.3.0@make-dir/index.js 2:11-24 @ ./node_modules/_find-cache-dir@1.0.0@find-cache-dir/index.js @ ./node_modules/_uglifyjs-webpack-plugin@1.3.0@uglifyjs-webpack-plugin/dist/uglify/Runner.js @ ./node_modules/_uglifyjs-webpack-plugin@1.3.0@uglifyjs-webpack-plugin/dist/index.js @ ./node_modules/_uglifyjs-webpack-plugin@1.3.0@uglifyjs-webpack-plugin/dist/cjs.js @ (webpack)/lib/WebpackOptionsDefaulter.js @ (webpack)/lib/webpack.js @ multi ./node_modules/_webpack-dev-server@3.1.9@webpack-dev-server/client?http://0.0.0.0:8200 webpack ERROR in ./node_modules/_mkdirp@0.5.1@mkdirp/index.js Module not found: Error: Can't resolve 'fs' in 'D:\java\JetBrains\module\vue-app\vue-todo\node_modules\_mkdirp@0.5.1@mkdirp' @ ./node_modules/_mkdirp@0.5.1@mkdirp/index.js 2:9-22 @ (webpack)/lib/node/NodeOutputFileSystem.js @ (webpack)/lib/node/NodeEnvironmentPlugin.js @ (webpack)/lib/webpack.js @ multi ./node_modules/_webpack-dev-server@3.1.9@webpack-dev-server/client?http://0.0.0.0:8200 webpack ERROR in ./node_modules/_move-concurrently@1.0.1@move-concurrently/move.js Module not found: Error: Can't resolve 'fs' in 'D:\java\JetBrains\module\vue-app\vue-todo\node_modules\_move-concurrently@1.0.1@move-concurrently' @ ./node_modules/_move-concurrently@1.0.1@move-concurrently/move.js 4:13-26 @ ./node_modules/_cacache@10.0.4@cacache/lib/util/move-file.js @ ./node_modules/_cacache@10.0.4@cacache/lib/content/write.js @ ./node_modules/_cacache@10.0.4@cacache/put.js @ ./node_modules/_cacache@10.0.4@cacache/locales/en.js @ ./node_modules/_cacache@10.0.4@cacache/index.js @ ./node_modules/_uglifyjs-webpack-plugin@1.3.0@uglifyjs-webpack-plugin/dist/uglify/Runner.js @ ./node_modules/_uglifyjs-webpack-plugin@1.3.0@uglifyjs-webpack-plugin/dist/index.js @ ./node_modules/_uglifyjs-webpack-plugin@1.3.0@uglifyjs-webpack-plugin/dist/cjs.js @ (webpack)/lib/WebpackOptionsDefaulter.js @ (webpack)/lib/webpack.js @ multi ./node_modules/_webpack-dev-server@3.1.9@webpack-dev-server/client?http://0.0.0.0:8200 webpack ERROR in ./node_modules/_path-exists@3.0.0@path-exists/index.js Module not found: Error: Can't resolve 'fs' in 'D:\java\JetBrains\module\vue-app\vue-todo\node_modules\_path-exists@3.0.0@path-exists' @ ./node_modules/_path-exists@3.0.0@path-exists/index.js 2:11-24 @ ./node_modules/_locate-path@2.0.0@locate-path/index.js @ ./node_modules/_find-up@2.1.0@find-up/index.js @ ./node_modules/_pkg-dir@2.0.0@pkg-dir/index.js @ ./node_modules/_find-cache-dir@1.0.0@find-cache-dir/index.js @ ./node_modules/_uglifyjs-webpack-plugin@1.3.0@uglifyjs-webpack-plugin/dist/uglify/Runner.js @ ./node_modules/_uglifyjs-webpack-plugin@1.3.0@uglifyjs-webpack-plugin/dist/index.js @ ./node_modules/_uglifyjs-webpack-plugin@1.3.0@uglifyjs-webpack-plugin/dist/cjs.js @ (webpack)/lib/WebpackOptionsDefaulter.js @ (webpack)/lib/webpack.js @ multi ./node_modules/_webpack-dev-server@3.1.9@webpack-dev-server/client?http://0.0.0.0:8200 webpack ERROR in ./node_modules/_rimraf@2.6.2@rimraf/rimraf.js Module not found: Error: Can't resolve 'fs' in 'D:\java\JetBrains\module\vue-app\vue-todo\node_modules\_rimraf@2.6.2@rimraf' @ ./node_modules/_rimraf@2.6.2@rimraf/rimraf.js 6:9-22 @ ./node_modules/_cacache@10.0.4@cacache/lib/util/tmp.js @ ./node_modules/_cacache@10.0.4@cacache/locales/en.js @ ./node_modules/_cacache@10.0.4@cacache/index.js @ ./node_modules/_uglifyjs-webpack-plugin@1.3.0@uglifyjs-webpack-plugin/dist/uglify/Runner.js @ ./node_modules/_uglifyjs-webpack-plugin@1.3.0@uglifyjs-webpack-plugin/dist/index.js @ ./node_modules/_uglifyjs-webpack-plugin@1.3.0@uglifyjs-webpack-plugin/dist/cjs.js @ (webpack)/lib/WebpackOptionsDefaulter.js @ (webpack)/lib/webpack.js @ multi ./node_modules/_webpack-dev-server@3.1.9@webpack-dev-server/client?http://0.0.0.0:8200 webpack ERROR in ./node_modules/_schema-utils@0.4.7@schema-utils/src/validateOptions.js Module not found: Error: Can't resolve 'fs' in 'D:\java\JetBrains\module\vue-app\vue-todo\node_modules\_schema-utils@0.4.7@schema-utils\src' @ ./node_modules/_schema-utils@0.4.7@schema-utils/src/validateOptions.js 8:11-24 @ ./node_modules/_schema-utils@0.4.7@schema-utils/src/index.js @ (webpack)/lib/BannerPlugin.js @ (webpack)/lib/webpack.js @ multi ./node_modules/_webpack-dev-server@3.1.9@webpack-dev-server/client?http://0.0.0.0:8200 webpack ERROR in ./node_modules/_snapdragon@0.8.2@snapdragon/lib/source-maps.js Module not found: Error: Can't resolve 'fs' in 'D:\java\JetBrains\module\vue-app\vue-todo\node_modules\_snapdragon@0.8.2@snapdragon\lib' @ ./node_modules/_snapdragon@0.8.2@snapdragon/lib/source-maps.js 3:9-22 @ ./node_modules/_snapdragon@0.8.2@snapdragon/lib/compiler.js @ ./node_modules/_snapdragon@0.8.2@snapdragon/index.js @ ./node_modules/_micromatch@3.1.10@micromatch/lib/utils.js @ ./node_modules/_micromatch@3.1.10@micromatch/index.js @ (webpack)/lib/optimize/SideEffectsFlagPlugin.js @ (webpack)/lib/webpack.js @ multi ./node_modules/_webpack-dev-server@3.1.9@webpack-dev-server/client?http://0.0.0.0:8200 webpack ERROR in ./node_modules/_uglify-es@3.3.9@uglify-es/tools/node.js Module not found: Error: Can't resolve 'fs' in 'D:\java\JetBrains\module\vue-app\vue-todo\node_modules\_uglify-es@3.3.9@uglify-es\tools' @ ./node_modules/_uglify-es@3.3.9@uglify-es/tools/node.js 1:9-22 @ ./node_modules/_uglifyjs-webpack-plugin@1.3.0@uglifyjs-webpack-plugin/dist/uglify/minify.js @ ./node_modules/_uglifyjs-webpack-plugin@1.3.0@uglifyjs-webpack-plugin/dist/uglify/Runner.js @ ./node_modules/_uglifyjs-webpack-plugin@1.3.0@uglifyjs-webpack-plugin/dist/index.js @ ./node_modules/_uglifyjs-webpack-plugin@1.3.0@uglifyjs-webpack-plugin/dist/cjs.js @ (webpack)/lib/WebpackOptionsDefaulter.js @ (webpack)/lib/webpack.js @ multi ./node_modules/_webpack-dev-server@3.1.9@webpack-dev-server/client?http://0.0.0.0:8200 webpack ERROR in (webpack)/lib/debug/ProfilingPlugin.js Module not found: Error: Can't resolve 'fs' in 'D:\java\JetBrains\module\vue-app\vue-todo\node_modules\_webpack@4.20.2@webpack\lib\debug' @ (webpack)/lib/debug/ProfilingPlugin.js 1:11-24 @ (webpack)/lib/webpack.js @ multi ./node_modules/_webpack-dev-server@3.1.9@webpack-dev-server/client?http://0.0.0.0:8200 webpack ERROR in (webpack)/lib/node/NodeMainTemplateAsync.runtime.js Module not found: Error: Can't resolve 'fs' in 'D:\java\JetBrains\module\vue-app\vue-todo\node_modules\_webpack@4.20.2@webpack\lib\node' @ (webpack)/lib/node/NodeMainTemplateAsync.runtime.js 10:2-15 28:3-16 @ (webpack)/lib/node/NodeMainTemplatePlugin.js @ (webpack)/lib/node/NodeTemplatePlugin.js @ (webpack)/lib/webpack.js @ multi ./node_modules/_webpack-dev-server@3.1.9@webpack-dev-server/client?http://0.0.0.0:8200 webpack ERROR in (webpack)/lib/node/NodeOutputFileSystem.js Module not found: Error: Can't resolve 'fs' in 'D:\java\JetBrains\module\vue-app\vue-todo\node_modules\_webpack@4.20.2@webpack\lib\node' @ (webpack)/lib/node/NodeOutputFileSystem.js 7:11-24 @ (webpack)/lib/node/NodeEnvironmentPlugin.js @ (webpack)/lib/webpack.js @ multi ./node_modules/_webpack-dev-server@3.1.9@webpack-dev-server/client?http://0.0.0.0:8200 webpack ERROR in ./node_modules/_y18n@4.0.0@y18n/index.js Module not found: Error: Can't resolve 'fs' in 'D:\java\JetBrains\module\vue-app\vue-todo\node_modules\_y18n@4.0.0@y18n' @ ./node_modules/_y18n@4.0.0@y18n/index.js 1:9-22 @ ./node_modules/_cacache@10.0.4@cacache/lib/util/y.js @ ./node_modules/_cacache@10.0.4@cacache/locales/en.js @ ./node_modules/_cacache@10.0.4@cacache/index.js @ ./node_modules/_uglifyjs-webpack-plugin@1.3.0@uglifyjs-webpack-plugin/dist/uglify/Runner.js @ ./node_modules/_uglifyjs-webpack-plugin@1.3.0@uglifyjs-webpack-plugin/dist/index.js @ ./node_modules/_uglifyjs-webpack-plugin@1.3.0@uglifyjs-webpack-plugin/dist/cjs.js @ (webpack)/lib/WebpackOptionsDefaulter.js @ (webpack)/lib/webpack.js @ multi ./node_modules/_webpack-dev-server@3.1.9@webpack-dev-server/client?http://0.0.0.0:8200 webpack ERROR in (webpack)/lib/NormalModule.js Module not found: Error: Can't resolve 'module' in 'D:\java\JetBrains\module\vue-app\vue-todo\node_modules\_webpack@4.20.2@webpack\lib' @ (webpack)/lib/NormalModule.js 7:21-38 @ (webpack)/lib/AutomaticPrefetchPlugin.js @ (webpack)/lib/webpack.js @ multi ./node_modules/_webpack-dev-server@3.1.9@webpack-dev-server/client?http://0.0.0.0:8200 webpack ERROR in (webpack)/lib/node/NodeTargetPlugin.js Module not found: Error: Can't resolve 'module' in 'D:\java\JetBrains\module\vue-app\vue-todo\node_modules\_webpack@4.20.2@webpack\lib\node' @ (webpack)/lib/node/NodeTargetPlugin.js 11:1-18 @ (webpack)/lib/WebpackOptionsApply.js @ (webpack)/lib/webpack.js @ multi ./node_modules/_webpack-dev-server@3.1.9@webpack-dev-server/client?http://0.0.0.0:8200 webpack Child html-webpack-plugin for "index.html": 1 asset Entrypoint undefined = index.html [0] ./node_modules/_html-webpack-plugin@3.2.0@html-webpack-plugin/lib/loader.js!./node_modules/_html-webpack-plugin@3.2.0@html-webpack-plugin/default_index.ejs 392 bytes {0} [b uilt] [1] ./node_modules/_lodash@4.17.11@lodash/lodash.js 527 KiB {0} [built] [2] (webpack)/buildin/global.js 509 bytes {0} [built] [3] (webpack)/buildin/module.js 519 bytes {0} [built] i 「wdm」: Failed to compile.
linux ext4 格式问题,求高手帮忙,急……
打包成ext4格式是包如下错,测试需要打包的文件内容几十M时,不出错。 猜想是Linux默认配置参数的问题,百度,Google没找到答案。高手帮忙解决下,急…… ./mkuserimg.sh -s serverlog system7.img.ext4 ext4 1190M in mkuserimg.sh PATH=/usr/local/sbin:/usr/local/bin:/sbin:/bin:/usr/sbin:/usr/bin:/usr/java/jdk1.8.0_05/bin:/opt/tomcat/code/airpushData/apktools/linux:/root/bin ./make_ext4fs -s -l 128M -a 1190M system7.img.ext4 serverlog Creating filesystem with parameters: Size: 134217728 Block size: 4096 Blocks per group: 32768 Inodes per group: 8192 Inode size: 256 Journal blocks: 1024 Label: Blocks: 32768 Block groups: 1 Reserved block group size: 7 error: do_inode_allocate_extents: Failed to allocate 64758 blocks
ubuntu 安装配置c++的opencv 报错
我在ubuntu 上打算安装和配置c++的Opencv, 下载了opencv3.1.0版本的代码,然后也手动的下载了ippicv_linux_20151201.tgz。创建build文件夹后Cmake命令已经可以编译过去了。 但是在执行make命令的时候,经常会报错: ``` [ 15%] Building CXX object modules/core/CMakeFiles/opencv_core.dir/opencl_kernels_core.cpp.o [ 15%] Linking CXX shared library ../../lib/libopencv_core.so /usr/bin/ld: CMakeFiles/opencv_core.dir/src/va_intel.cpp.o: relocation R_X86_64_32 against `.rodata' can not be used when making a shared object; recompile with -fPIC CMakeFiles/opencv_core.dir/src/va_intel.cpp.o: 无法添加符号: 错误的值 collect2: error: ld returned 1 exit status modules/core/CMakeFiles/opencv_core.dir/build.make:1382: recipe for target 'lib/libopencv_core.so.3.1.0' failed make[2]: *** [lib/libopencv_core.so.3.1.0] Error 1 CMakeFiles/Makefile2:1420: recipe for target 'modules/core/CMakeFiles/opencv_core.dir/all' failed make[1]: *** [modules/core/CMakeFiles/opencv_core.dir/all] Error 2 Makefile:160: recipe for target 'all' failed make: *** [all] Error 2 ``` 有时候在33%进度的时候报这个错误,有时候就在15%时候报。我整整试了一整天,查遍了各种解决方法都无济于事。请大侠们帮忙解决下吧。跪谢。 是否有直接加载已经编译好的库的方式,可以快速实现配置,因为我急需要用Opencv实现代码。感谢各位大侠了。
php7 mysql5.7 打架啦
问题是这样的,全新Ubuntu14.04 (aliyun)里安装了mysql 5.7.13 ![Mysql版本信息](https://img-ask.csdn.net/upload/201607/20/1468974692_51088.png) 然后下载编译的PHP7 ./configure 的参数为 --enable-ftp --enable-fpm --with-pdo-mysql=/usr/bin/mysql 提示成功生成Makefile。 继续make时则出现以下错误 ``` ext/pdo_mysql/.libs/pdo_mysql.o: In function `zm_info_pdo_mysql': /root/a/php-7.0.8/ext/pdo_mysql/pdo_mysql.c:162: undefined reference to `mysql_get_client_info' ext/pdo_mysql/.libs/mysql_driver.o: In function `pdo_mysql_check_liveness': /root/a/php-7.0.8/ext/pdo_mysql/mysql_driver.c:493: undefined reference to `mysql_ping' ext/pdo_mysql/.libs/mysql_driver.o: In function `pdo_mysql_last_insert_id': /root/a/php-7.0.8/ext/pdo_mysql/mysql_driver.c:292: undefined reference to `mysql_insert_id' ext/pdo_mysql/.libs/mysql_driver.o: In function `mysql_handle_rollback': /root/a/php-7.0.8/ext/pdo_mysql/mysql_driver.c:343: undefined reference to `mysql_rollback' ext/pdo_mysql/.libs/mysql_driver.o: In function `mysql_handle_commit': /root/a/php-7.0.8/ext/pdo_mysql/mysql_driver.c:330: undefined reference to `mysql_commit' ext/pdo_mysql/.libs/mysql_driver.o: In function `mysql_handle_quoter': /root/a/php-7.0.8/ext/pdo_mysql/mysql_driver.c:307: undefined reference to `mysql_real_escape_string' ext/pdo_mysql/.libs/mysql_driver.o: In function `mysql_handle_closer': /root/a/php-7.0.8/ext/pdo_mysql/mysql_driver.c:149: undefined reference to `mysql_close' ext/pdo_mysql/.libs/mysql_driver.o: In function `mysql_handle_autocommit': /root/a/php-7.0.8/ext/pdo_mysql/mysql_driver.c:357: undefined reference to `mysql_autocommit' ext/pdo_mysql/.libs/mysql_driver.o: In function `_pdo_mysql_error': /root/a/php-7.0.8/ext/pdo_mysql/mysql_driver.c:65: undefined reference to `mysql_stmt_errno' /root/a/php-7.0.8/ext/pdo_mysql/mysql_driver.c:93: undefined reference to `mysql_error' /root/a/php-7.0.8/ext/pdo_mysql/mysql_driver.c:101: undefined reference to `mysql_stmt_sqlstate' /root/a/php-7.0.8/ext/pdo_mysql/mysql_driver.c:67: undefined reference to `mysql_errno' /root/a/php-7.0.8/ext/pdo_mysql/mysql_driver.c:103: undefined reference to `mysql_sqlstate' /root/a/php-7.0.8/ext/pdo_mysql/mysql_driver.c:93: undefined reference to `mysql_error' ext/pdo_mysql/.libs/mysql_driver.o: In function `pdo_mysql_handle_factory': /root/a/php-7.0.8/ext/pdo_mysql/mysql_driver.c:585: undefined reference to `mysql_init' /root/a/php-7.0.8/ext/pdo_mysql/mysql_driver.c:627: undefined reference to `mysql_options' /root/a/php-7.0.8/ext/pdo_mysql/mysql_driver.c:660: undefined reference to `mysql_options' /root/a/php-7.0.8/ext/pdo_mysql/mysql_driver.c:690: undefined reference to `mysql_options' /root/a/php-7.0.8/ext/pdo_mysql/mysql_driver.c:703: undefined reference to `mysql_ssl_set' /root/a/php-7.0.8/ext/pdo_mysql/mysql_driver.c:730: undefined reference to `mysql_options' /root/a/php-7.0.8/ext/pdo_mysql/mysql_driver.c:742: undefined reference to `mysql_options' /root/a/php-7.0.8/ext/pdo_mysql/mysql_driver.c:775: undefined reference to `mysql_real_connect' /root/a/php-7.0.8/ext/pdo_mysql/mysql_driver.c:670: undefined reference to `mysql_options' /root/a/php-7.0.8/ext/pdo_mysql/mysql_driver.c:680: undefined reference to `mysql_options' ext/pdo_mysql/.libs/mysql_driver.o: In function `mysql_handle_autocommit': /root/a/php-7.0.8/ext/pdo_mysql/mysql_driver.c:357: undefined reference to `mysql_autocommit' ext/pdo_mysql/.libs/mysql_driver.o: In function `pdo_mysql_handle_factory': /root/a/php-7.0.8/ext/pdo_mysql/mysql_driver.c:703: undefined reference to `mysql_ssl_set' ext/pdo_mysql/.libs/mysql_driver.o: In function `pdo_mysql_get_attribute': /root/a/php-7.0.8/ext/pdo_mysql/mysql_driver.c:444: undefined reference to `mysql_stat' /root/a/php-7.0.8/ext/pdo_mysql/mysql_driver.c:426: undefined reference to `mysql_get_client_info' /root/a/php-7.0.8/ext/pdo_mysql/mysql_driver.c:430: undefined reference to `mysql_get_server_info' /root/a/php-7.0.8/ext/pdo_mysql/mysql_driver.c:434: undefined reference to `mysql_get_host_info' ext/pdo_mysql/.libs/mysql_driver.o: In function `mysql_handle_doer': /root/a/php-7.0.8/ext/pdo_mysql/mysql_driver.c:261: undefined reference to `mysql_real_query' /root/a/php-7.0.8/ext/pdo_mysql/mysql_driver.c:265: undefined reference to `mysql_affected_rows' /root/a/php-7.0.8/ext/pdo_mysql/mysql_driver.c:274: undefined reference to `mysql_next_result' /root/a/php-7.0.8/ext/pdo_mysql/mysql_driver.c:277: undefined reference to `mysql_store_result' /root/a/php-7.0.8/ext/pdo_mysql/mysql_driver.c:273: undefined reference to `mysql_more_results' /root/a/php-7.0.8/ext/pdo_mysql/mysql_driver.c:279: undefined reference to `mysql_free_result' ext/pdo_mysql/.libs/mysql_driver.o: In function `mysql_handle_preparer': /root/a/php-7.0.8/ext/pdo_mysql/mysql_driver.c:183: undefined reference to `mysql_get_server_version' /root/a/php-7.0.8/ext/pdo_mysql/mysql_driver.c:200: undefined reference to `mysql_stmt_init' /root/a/php-7.0.8/ext/pdo_mysql/mysql_driver.c:208: undefined reference to `mysql_stmt_prepare' /root/a/php-7.0.8/ext/pdo_mysql/mysql_driver.c:227: undefined reference to `mysql_stmt_param_count' /root/a/php-7.0.8/ext/pdo_mysql/mysql_driver.c:211: undefined reference to `mysql_errno' ext/pdo_mysql/.libs/mysql_statement.o: In function `pdo_mysql_stmt_cursor_closer': /root/a/php-7.0.8/ext/pdo_mysql/mysql_statement.c:902: undefined reference to `mysql_free_result' /root/a/php-7.0.8/ext/pdo_mysql/mysql_statement.c:907: undefined reference to `mysql_stmt_free_result' /root/a/php-7.0.8/ext/pdo_mysql/mysql_statement.c:913: undefined reference to `mysql_next_result' /root/a/php-7.0.8/ext/pdo_mysql/mysql_statement.c:916: undefined reference to `mysql_store_result' /root/a/php-7.0.8/ext/pdo_mysql/mysql_statement.c:911: undefined reference to `mysql_more_results' /root/a/php-7.0.8/ext/pdo_mysql/mysql_statement.c:918: undefined reference to `mysql_free_result' ext/pdo_mysql/.libs/mysql_statement.o: In function `pdo_mysql_fill_stmt_from_result': /root/a/php-7.0.8/ext/pdo_mysql/mysql_statement.c:135: undefined reference to `mysql_affected_rows' /root/a/php-7.0.8/ext/pdo_mysql/mysql_statement.c:142: undefined reference to `mysql_store_result' /root/a/php-7.0.8/ext/pdo_mysql/mysql_statement.c:149: undefined reference to `mysql_num_rows' /root/a/php-7.0.8/ext/pdo_mysql/mysql_statement.c:150: undefined reference to `mysql_num_fields' /root/a/php-7.0.8/ext/pdo_mysql/mysql_statement.c:151: undefined reference to `mysql_fetch_fields' /root/a/php-7.0.8/ext/pdo_mysql/mysql_statement.c:140: undefined reference to `mysql_use_result' ext/pdo_mysql/.libs/mysql_statement.o: In function `pdo_mysql_stmt_next_rowset': /root/a/php-7.0.8/ext/pdo_mysql/mysql_statement.c:408: undefined reference to `mysql_num_fields' /root/a/php-7.0.8/ext/pdo_mysql/mysql_statement.c:410: undefined reference to `mysql_stmt_free_result' /root/a/php-7.0.8/ext/pdo_mysql/mysql_statement.c:414: undefined reference to `mysql_free_result' /root/a/php-7.0.8/ext/pdo_mysql/mysql_statement.c:418: undefined reference to `mysql_more_results' /root/a/php-7.0.8/ext/pdo_mysql/mysql_statement.c:430: undefined reference to `mysql_next_result' ext/pdo_mysql/.libs/mysql_statement.o: In function `pdo_mysql_stmt_fetch': /root/a/php-7.0.8/ext/pdo_mysql/mysql_statement.c:632: undefined reference to `mysql_stmt_fetch' /root/a/php-7.0.8/ext/pdo_mysql/mysql_statement.c:661: undefined reference to `mysql_fetch_row' /root/a/php-7.0.8/ext/pdo_mysql/mysql_statement.c:672: undefined reference to `mysql_fetch_lengths' /root/a/php-7.0.8/ext/pdo_mysql/mysql_statement.c:665: undefined reference to `mysql_errno' ext/pdo_mysql/.libs/mysql_statement.o: In function `pdo_mysql_stmt_dtor': /root/a/php-7.0.8/ext/pdo_mysql/mysql_statement.c:55: undefined reference to `mysql_free_result' /root/a/php-7.0.8/ext/pdo_mysql/mysql_statement.c:63: undefined reference to `mysql_stmt_close' /root/a/php-7.0.8/ext/pdo_mysql/mysql_statement.c:95: undefined reference to `mysql_next_result' /root/a/php-7.0.8/ext/pdo_mysql/mysql_statement.c:99: undefined reference to `mysql_store_result' /root/a/php-7.0.8/ext/pdo_mysql/mysql_statement.c:93: undefined reference to `mysql_more_results' /root/a/php-7.0.8/ext/pdo_mysql/mysql_statement.c:101: undefined reference to `mysql_free_result' ext/pdo_mysql/.libs/mysql_statement.o: In function `pdo_mysql_stmt_execute_prepared_libmysql': /root/a/php-7.0.8/ext/pdo_mysql/mysql_statement.c:170: undefined reference to `mysql_stmt_bind_param' /root/a/php-7.0.8/ext/pdo_mysql/mysql_statement.c:175: undefined reference to `mysql_stmt_errno' ext/pdo_mysql/.libs/mysql_statement.o: In function `pdo_mysql_stmt_execute': /root/a/php-7.0.8/ext/pdo_mysql/mysql_statement.c:328: undefined reference to `mysql_free_result' /root/a/php-7.0.8/ext/pdo_mysql/mysql_statement.c:332: undefined reference to `mysql_real_query' ext/pdo_mysql/.libs/mysql_statement.o: In function `pdo_mysql_stmt_execute_prepared_libmysql': /root/a/php-7.0.8/ext/pdo_mysql/mysql_statement.c:170: undefined reference to `mysql_stmt_execute' ext/pdo_mysql/.libs/mysql_statement.o: In function `pdo_mysql_stmt_set_row_count': /root/a/php-7.0.8/ext/pdo_mysql/mysql_statement.c:121: undefined reference to `mysql_stmt_affected_rows' ext/pdo_mysql/.libs/mysql_statement.o: In function `pdo_mysql_stmt_execute_prepared_libmysql': /root/a/php-7.0.8/ext/pdo_mysql/mysql_statement.c:186: undefined reference to `mysql_stmt_result_metadata' /root/a/php-7.0.8/ext/pdo_mysql/mysql_statement.c:189: undefined reference to `mysql_fetch_fields' /root/a/php-7.0.8/ext/pdo_mysql/mysql_statement.c:200: undefined reference to `mysql_num_fields' /root/a/php-7.0.8/ext/pdo_mysql/mysql_statement.c:254: undefined reference to `mysql_stmt_bind_result' /root/a/php-7.0.8/ext/pdo_mysql/mysql_statement.c:261: undefined reference to `mysql_stmt_store_result' /root/a/php-7.0.8/ext/pdo_mysql/mysql_statement.c:209: undefined reference to `mysql_stmt_attr_set' collect2: error: ld returned 1 exit status make: *** [sapi/cli/php] Error 1 ```
执行pyspark时出现TypeError如何解决?
打算在WIndows 10环境配置一下Spark,跟着网上的教程一步一步走到最后,执行spark-shell也成功进入Scala环境 ![图片说明](https://img-ask.csdn.net/upload/202002/03/1580724413_275891.png) 但是执行pyspark却提示TypeError: an integer is required (got type bytes) 完整信息: ``` Python 3.8.1 (tags/v3.8.1:1b293b6, Dec 18 2019, 23:11:46) [MSC v.1916 64 bit (AMD64)] on win32 Type "help", "copyright", "credits" or "license" for more information. Traceback (most recent call last): File "D:\spark-2.4.4-bin-hadoop2.7\python\pyspark\shell.py", line 31, in <module> from pyspark import SparkConf File "D:\spark-2.4.4-bin-hadoop2.7\python\pyspark\__init__.py", line 51, in <module> from pyspark.context import SparkContext File "D:\spark-2.4.4-bin-hadoop2.7\python\pyspark\context.py", line 31, in <module> from pyspark import accumulators File "D:\spark-2.4.4-bin-hadoop2.7\python\pyspark\accumulators.py", line 97, in <module> from pyspark.serializers import read_int, PickleSerializer File "D:\spark-2.4.4-bin-hadoop2.7\python\pyspark\serializers.py", line 71, in <module> from pyspark import cloudpickle File "D:\spark-2.4.4-bin-hadoop2.7\python\pyspark\cloudpickle.py", line 145, in <module> _cell_set_template_code = _make_cell_set_template_code() File "D:\spark-2.4.4-bin-hadoop2.7\python\pyspark\cloudpickle.py", line 126, in _make_cell_set_template_code return types.CodeType( TypeError: an integer is required (got type bytes) ``` 请问如何解决这个问题?是不是Python版本太高了?
Laravel 執行php artisan make:model admin/members -m 時,目錄問題??
請教大大! 我能讓 2020_01_06_060935_create_members_table.php 搬到 admin 目錄裡面嗎? Laravel 執行php artisan make:model admin/members -m 時, ``` php artisan make:model admin/members -m ``` 疑問的是: members.php檔案 在admin目錄裡面 2020_01_06_060935_create_members_table.php檔案 不在admin目錄裡面 如下圖: ![图片说明](https://img-ask.csdn.net/upload/202001/06/1578295262_541166.jpg) 我執行: php artisan make:model admin/members -m 同時產生2個檔案 1、在app/目錄下 新增了一的admin 目錄 且在目錄裡面 產生一個 members.php 2、在database/目錄下 雖然新增了一的admin 目錄 但是migration 的檔案卻是在(database/migration/)目錄 PS:嘗試手動將檔案移到admin 後,執行 php artisan migrate 時,資料庫沒有創建members表 請教大大們,這問題何解?
Ubuntu18.04配置OPENCV3.3.1时make报错
在给Ubuntu18.04下载编译openCV3.3.1时, 参照https://blog.csdn.net/zhaoxr233/article/details/90036824 在做到make那一步时,报了以下error,在网上查询无果,不知如何解决,烦请各位大佬指点 ``` Linking CXX executable ../../bin/opencv_visualisation ../../lib/libopencv_core.a(hal_internal.cpp.o):在函数‘lapack_gemm32f(float const*, unsigned long, float const*, unsigned long, float, float const*, unsigned long, float, float*, unsigned long, int, int, int, int)’中: hal_internal.cpp:(.text._Z14lapack_gemm32fPKfmS0_mfS0_mfPfmiiii+0x3d2):对‘cblas_sgemm(CBLAS_ORDER, CBLAS_TRANSPOSE, CBLAS_TRANSPOSE, int, int, int, float, float const*, int, float const*, int, float, float*, int)’未定义的引用 ............ ../../lib/libopencv_core.a(hal_internal.cpp.o):在函数‘lapack_gemm64fc(double const*, unsigned long, double const*, unsigned long, double, double const*, unsigned long, double, double*, unsigned long, int, int, int, int)’中: hal_internal.cpp:(.text._Z15lapack_gemm64fcPKdmS0_mdS0_mdPdmiiii+0x29e):对‘cblas_zgemm(CBLAS_ORDER, CBLAS_TRANSPOSE, CBLAS_TRANSPOSE, int, int, int, void const*, void const*, int, void const*, int, void const*, void*, int)’未定义的引用 hal_internal.cpp:(.text._Z15lapack_gemm64fcPKdmS0_mdS0_mdPdmiiii+0x2f5):对‘cblas_cgemm(CBLAS_ORDER, CBLAS_TRANSPOSE, CBLAS_TRANSPOSE, int, int, int, void const*, void const*, int, void const*, int, void const*, void*, int)’未定义的引用 collect2: error: ld returned 1 exit status apps/annotation/CMakeFiles/opencv_annotation.dir/build.make:119: recipe for target 'bin/opencv_annotation' failed make[2]: *** [bin/opencv_annotation] Error 1 CMakeFiles/Makefile2:4522: recipe for target 'apps/annotation/CMakeFiles/opencv_annotation.dir/all' failed make[1]: *** [apps/annotation/CMakeFiles/opencv_annotation.dir/all] Error 2 ```
yolo3 darknet.py问题
我用darknetAB https://github.com/AlexeyAB/darknet 编译gpu版本后生成darknet.py文件 然后我也编译了yolo_cpp_dll.sln文件 生成dll文件 然后运行darknet.py文件 不显示图片 异常退出 ![图片说明](https://img-ask.csdn.net/upload/201911/02/1572688446_628910.png) 百度了这个问题 有人说要换python3.5版本 我也尝试了 但是也是不行 不会显示图片。请问各位大佬到底怎么解决??急!!!谢谢!!! ``` #!python3 """ Python 3 wrapper for identifying objects in images Requires DLL compilation Both the GPU and no-GPU version should be compiled; the no-GPU version should be renamed "yolo_cpp_dll_nogpu.dll". On a GPU system, you can force CPU evaluation by any of: - Set global variable DARKNET_FORCE_CPU to True - Set environment variable CUDA_VISIBLE_DEVICES to -1 - Set environment variable "FORCE_CPU" to "true" To use, either run performDetect() after import, or modify the end of this file. See the docstring of performDetect() for parameters. Directly viewing or returning bounding-boxed images requires scikit-image to be installed (`pip install scikit-image`) Original *nix 2.7: https://github.com/pjreddie/darknet/blob/0f110834f4e18b30d5f101bf8f1724c34b7b83db/python/darknet.py Windows Python 2.7 version: https://github.com/AlexeyAB/darknet/blob/fc496d52bf22a0bb257300d3c79be9cd80e722cb/build/darknet/x64/darknet.py @author: Philip Kahn @date: 20180503 """ #pylint: disable=R, W0401, W0614, W0703 from ctypes import * import math import random import os def sample(probs): s = sum(probs) probs = [a/s for a in probs] r = random.uniform(0, 1) for i in range(len(probs)): r = r - probs[i] if r <= 0: return i return len(probs)-1 def c_array(ctype, values): arr = (ctype*len(values))() arr[:] = values return arr class BOX(Structure): _fields_ = [("x", c_float), ("y", c_float), ("w", c_float), ("h", c_float)] class DETECTION(Structure): _fields_ = [("bbox", BOX), ("classes", c_int), ("prob", POINTER(c_float)), ("mask", POINTER(c_float)), ("objectness", c_float), ("sort_class", c_int)] class IMAGE(Structure): _fields_ = [("w", c_int), ("h", c_int), ("c", c_int), ("data", POINTER(c_float))] class METADATA(Structure): _fields_ = [("classes", c_int), ("names", POINTER(c_char_p))] #lib = CDLL("/home/pjreddie/documents/darknet/libdarknet.so", RTLD_GLOBAL) #lib = CDLL("libdarknet.so", RTLD_GLOBAL) hasGPU = True if os.name == "nt": cwd = os.path.dirname(__file__) os.environ['PATH'] = cwd + ';' + os.environ['PATH'] winGPUdll = os.path.join(cwd, "yolo_cpp_dll.dll") winNoGPUdll = os.path.join(cwd, "yolo_cpp_dll_nogpu.dll") envKeys = list() for k, v in os.environ.items(): envKeys.append(k) try: try: tmp = os.environ["FORCE_CPU"].lower() if tmp in ["1", "true", "yes", "on"]: raise ValueError("ForceCPU") else: print("Flag value '"+tmp+"' not forcing CPU mode") except KeyError: # We never set the flag if 'CUDA_VISIBLE_DEVICES' in envKeys: if int(os.environ['CUDA_VISIBLE_DEVICES']) < 0: raise ValueError("ForceCPU") try: global DARKNET_FORCE_CPU if DARKNET_FORCE_CPU: raise ValueError("ForceCPU") except NameError: pass # print(os.environ.keys()) # print("FORCE_CPU flag undefined, proceeding with GPU") if not os.path.exists(winGPUdll): raise ValueError("NoDLL") lib = CDLL(winGPUdll, RTLD_GLOBAL) except (KeyError, ValueError): hasGPU = False if os.path.exists(winNoGPUdll): lib = CDLL(winNoGPUdll, RTLD_GLOBAL) print("Notice: CPU-only mode") else: # Try the other way, in case no_gpu was # compile but not renamed lib = CDLL(winGPUdll, RTLD_GLOBAL) print("Environment variables indicated a CPU run, but we didn't find `"+winNoGPUdll+"`. Trying a GPU run anyway.") else: lib = CDLL("./libdarknet.so", RTLD_GLOBAL) lib.network_width.argtypes = [c_void_p] lib.network_width.restype = c_int lib.network_height.argtypes = [c_void_p] lib.network_height.restype = c_int copy_image_from_bytes = lib.copy_image_from_bytes copy_image_from_bytes.argtypes = [IMAGE,c_char_p] def network_width(net): return lib.network_width(net) def network_height(net): return lib.network_height(net) predict = lib.network_predict_ptr predict.argtypes = [c_void_p, POINTER(c_float)] predict.restype = POINTER(c_float) if hasGPU: set_gpu = lib.cuda_set_device set_gpu.argtypes = [c_int] make_image = lib.make_image make_image.argtypes = [c_int, c_int, c_int] make_image.restype = IMAGE get_network_boxes = lib.get_network_boxes get_network_boxes.argtypes = [c_void_p, c_int, c_int, c_float, c_float, POINTER(c_int), c_int, POINTER(c_int), c_int] get_network_boxes.restype = POINTER(DETECTION) make_network_boxes = lib.make_network_boxes make_network_boxes.argtypes = [c_void_p] make_network_boxes.restype = POINTER(DETECTION) free_detections = lib.free_detections free_detections.argtypes = [POINTER(DETECTION), c_int] free_ptrs = lib.free_ptrs free_ptrs.argtypes = [POINTER(c_void_p), c_int] network_predict = lib.network_predict_ptr network_predict.argtypes = [c_void_p, POINTER(c_float)] reset_rnn = lib.reset_rnn reset_rnn.argtypes = [c_void_p] load_net = lib.load_network load_net.argtypes = [c_char_p, c_char_p, c_int] load_net.restype = c_void_p load_net_custom = lib.load_network_custom load_net_custom.argtypes = [c_char_p, c_char_p, c_int, c_int] load_net_custom.restype = c_void_p do_nms_obj = lib.do_nms_obj do_nms_obj.argtypes = [POINTER(DETECTION), c_int, c_int, c_float] do_nms_sort = lib.do_nms_sort do_nms_sort.argtypes = [POINTER(DETECTION), c_int, c_int, c_float] free_image = lib.free_image free_image.argtypes = [IMAGE] letterbox_image = lib.letterbox_image letterbox_image.argtypes = [IMAGE, c_int, c_int] letterbox_image.restype = IMAGE load_meta = lib.get_metadata lib.get_metadata.argtypes = [c_char_p] lib.get_metadata.restype = METADATA load_image = lib.load_image_color load_image.argtypes = [c_char_p, c_int, c_int] load_image.restype = IMAGE rgbgr_image = lib.rgbgr_image rgbgr_image.argtypes = [IMAGE] predict_image = lib.network_predict_image predict_image.argtypes = [c_void_p, IMAGE] predict_image.restype = POINTER(c_float) predict_image_letterbox = lib.network_predict_image_letterbox predict_image_letterbox.argtypes = [c_void_p, IMAGE] predict_image_letterbox.restype = POINTER(c_float) def array_to_image(arr): import numpy as np # need to return old values to avoid python freeing memory arr = arr.transpose(2,0,1) c = arr.shape[0] h = arr.shape[1] w = arr.shape[2] arr = np.ascontiguousarray(arr.flat, dtype=np.float32) / 255.0 data = arr.ctypes.data_as(POINTER(c_float)) im = IMAGE(w,h,c,data) return im, arr def classify(net, meta, im): out = predict_image(net, im) res = [] for i in range(meta.classes): if altNames is None: nameTag = meta.names[i] else: nameTag = altNames[i] res.append((nameTag, out[i])) res = sorted(res, key=lambda x: -x[1]) return res def detect(net, meta, image, thresh=.5, hier_thresh=.5, nms=.45, debug= False): """ Performs the meat of the detection """ #pylint: disable= C0321 im = load_image(image, 0, 0) if debug: print("Loaded image") ret = detect_image(net, meta, im, thresh, hier_thresh, nms, debug) free_image(im) if debug: print("freed image") return ret def detect_image(net, meta, im, thresh=.5, hier_thresh=.5, nms=.45, debug= False): #import cv2 #custom_image_bgr = cv2.imread(image) # use: detect(,,imagePath,) #custom_image = cv2.cvtColor(custom_image_bgr, cv2.COLOR_BGR2RGB) #custom_image = cv2.resize(custom_image,(lib.network_width(net), lib.network_height(net)), interpolation = cv2.INTER_LINEAR) #import scipy.misc #custom_image = scipy.misc.imread(image) #im, arr = array_to_image(custom_image) # you should comment line below: free_image(im) num = c_int(0) if debug: print("Assigned num") pnum = pointer(num) if debug: print("Assigned pnum") predict_image(net, im) letter_box = 0 #predict_image_letterbox(net, im) #letter_box = 1 if debug: print("did prediction") # dets = get_network_boxes(net, custom_image_bgr.shape[1], custom_image_bgr.shape[0], thresh, hier_thresh, None, 0, pnum, letter_box) # OpenCV dets = get_network_boxes(net, im.w, im.h, thresh, hier_thresh, None, 0, pnum, letter_box) if debug: print("Got dets") num = pnum[0] if debug: print("got zeroth index of pnum") if nms: do_nms_sort(dets, num, meta.classes, nms) if debug: print("did sort") res = [] if debug: print("about to range") for j in range(num): if debug: print("Ranging on "+str(j)+" of "+str(num)) if debug: print("Classes: "+str(meta), meta.classes, meta.names) for i in range(meta.classes): if debug: print("Class-ranging on "+str(i)+" of "+str(meta.classes)+"= "+str(dets[j].prob[i])) if dets[j].prob[i] > 0: b = dets[j].bbox if altNames is None: nameTag = meta.names[i] else: nameTag = altNames[i] if debug: print("Got bbox", b) print(nameTag) print(dets[j].prob[i]) print((b.x, b.y, b.w, b.h)) res.append((nameTag, dets[j].prob[i], (b.x, b.y, b.w, b.h))) if debug: print("did range") res = sorted(res, key=lambda x: -x[1]) if debug: print("did sort") free_detections(dets, num) if debug: print("freed detections") return res netMain = None metaMain = None altNames = None def performDetect(imagePath="data/dog.jpg", thresh= 0.25, configPath = "./cfg/yolov3.cfg", weightPath = "yolov3.weights", metaPath= "./cfg/coco.data", showImage= True, makeImageOnly = False, initOnly= False): """ Convenience function to handle the detection and returns of objects. Displaying bounding boxes requires libraries scikit-image and numpy Parameters ---------------- imagePath: str Path to the image to evaluate. Raises ValueError if not found thresh: float (default= 0.25) The detection threshold configPath: str Path to the configuration file. Raises ValueError if not found weightPath: str Path to the weights file. Raises ValueError if not found metaPath: str Path to the data file. Raises ValueError if not found showImage: bool (default= True) Compute (and show) bounding boxes. Changes return. makeImageOnly: bool (default= False) If showImage is True, this won't actually *show* the image, but will create the array and return it. initOnly: bool (default= False) Only initialize globals. Don't actually run a prediction. Returns ---------------------- When showImage is False, list of tuples like ('obj_label', confidence, (bounding_box_x_px, bounding_box_y_px, bounding_box_width_px, bounding_box_height_px)) The X and Y coordinates are from the center of the bounding box. Subtract half the width or height to get the lower corner. Otherwise, a dict with { "detections": as above "image": a numpy array representing an image, compatible with scikit-image "caption": an image caption } """ # Import the global variables. This lets us instance Darknet once, then just call performDetect() again without instancing again global metaMain, netMain, altNames #pylint: disable=W0603 assert 0 < thresh < 1, "Threshold should be a float between zero and one (non-inclusive)" if not os.path.exists(configPath): raise ValueError("Invalid config path `"+os.path.abspath(configPath)+"`") if not os.path.exists(weightPath): raise ValueError("Invalid weight path `"+os.path.abspath(weightPath)+"`") if not os.path.exists(metaPath): raise ValueError("Invalid data file path `"+os.path.abspath(metaPath)+"`") if netMain is None: netMain = load_net_custom(configPath.encode("ascii"), weightPath.encode("ascii"), 0, 1) # batch size = 1 if metaMain is None: metaMain = load_meta(metaPath.encode("ascii")) if altNames is None: # In Python 3, the metafile default access craps out on Windows (but not Linux) # Read the names file and create a list to feed to detect try: with open(metaPath) as metaFH: metaContents = metaFH.read() import re match = re.search("names *= *(.*)$", metaContents, re.IGNORECASE | re.MULTILINE) if match: result = match.group(1) else: result = None try: if os.path.exists(result): with open(result) as namesFH: namesList = namesFH.read().strip().split("\n") altNames = [x.strip() for x in namesList] except TypeError: pass except Exception: pass if initOnly: print("Initialized detector") return None if not os.path.exists(imagePath): raise ValueError("Invalid image path `"+os.path.abspath(imagePath)+"`") # Do the detection #detections = detect(netMain, metaMain, imagePath, thresh) # if is used cv2.imread(image) detections = detect(netMain, metaMain, imagePath.encode("ascii"), thresh) if showImage: try: from skimage import io, draw import numpy as np image = io.imread(imagePath) print("*** "+str(len(detections))+" Results, color coded by confidence ***") imcaption = [] for detection in detections: label = detection[0] confidence = detection[1] pstring = label+": "+str(np.rint(100 * confidence))+"%" imcaption.append(pstring) print(pstring) bounds = detection[2] shape = image.shape # x = shape[1] # xExtent = int(x * bounds[2] / 100) # y = shape[0] # yExtent = int(y * bounds[3] / 100) yExtent = int(bounds[3]) xEntent = int(bounds[2]) # Coordinates are around the center xCoord = int(bounds[0] - bounds[2]/2) yCoord = int(bounds[1] - bounds[3]/2) boundingBox = [ [xCoord, yCoord], [xCoord, yCoord + yExtent], [xCoord + xEntent, yCoord + yExtent], [xCoord + xEntent, yCoord] ] # Wiggle it around to make a 3px border rr, cc = draw.polygon_perimeter([x[1] for x in boundingBox], [x[0] for x in boundingBox], shape= shape) rr2, cc2 = draw.polygon_perimeter([x[1] + 1 for x in boundingBox], [x[0] for x in boundingBox], shape= shape) rr3, cc3 = draw.polygon_perimeter([x[1] - 1 for x in boundingBox], [x[0] for x in boundingBox], shape= shape) rr4, cc4 = draw.polygon_perimeter([x[1] for x in boundingBox], [x[0] + 1 for x in boundingBox], shape= shape) rr5, cc5 = draw.polygon_perimeter([x[1] for x in boundingBox], [x[0] - 1 for x in boundingBox], shape= shape) boxColor = (int(255 * (1 - (confidence ** 2))), int(255 * (confidence ** 2)), 0) draw.set_color(image, (rr, cc), boxColor, alpha= 0.8) draw.set_color(image, (rr2, cc2), boxColor, alpha= 0.8) draw.set_color(image, (rr3, cc3), boxColor, alpha= 0.8) draw.set_color(image, (rr4, cc4), boxColor, alpha= 0.8) draw.set_color(image, (rr5, cc5), boxColor, alpha= 0.8) if not makeImageOnly: io.imshow(image) io.show() detections = { "detections": detections, "image": image, "caption": "\n<br/>".join(imcaption) } except Exception as e: print("Unable to show image: "+str(e)) return detections if __name__ == "__main__": print(performDetect()) ```
openresty安装 lua-zlib模块出错 on mac
错误日志如下: [ 50%] Building C object CMakeFiles/cmod_zlib.dir/lua_zlib.c.o [100%] Linking C shared module zlib.so Undefined symbols for architecture x86_64: "_luaL_argerror", referenced from: _lz_checksum in lua_zlib.c.o "_luaL_buffinit", referenced from: _lz_filter_impl in lua_zlib.c.o "_luaL_checklstring", referenced from: _lz_checksum in lua_zlib.c.o "_luaL_checkoption", referenced from: _lz_filter_impl in lua_zlib.c.o "_luaL_newmetatable", referenced from: _lz_create_deflate_mt in lua_zlib.c.o _lz_create_inflate_mt in lua_zlib.c.o "_luaL_optinteger", referenced from: _lz_deflate_new in lua_zlib.c.o "_luaL_prepbuffer", referenced from: _lz_filter_impl in lua_zlib.c.o "_luaL_pushresult", referenced from: _lz_filter_impl in lua_zlib.c.o "_luaL_register", referenced from: _luaopen_zlib in lua_zlib.c.o "_lua_call", referenced from: _lz_checksum in lua_zlib.c.o "_lua_concat", referenced from: _lz_filter_impl in lua_zlib.c.o "_lua_error", referenced from: _lz_assert in lua_zlib.c.o _lz_filter_impl in lua_zlib.c.o "_lua_getfield", referenced from: _lz_deflate_new in lua_zlib.c.o _lz_inflate_new in lua_zlib.c.o "_lua_gettop", referenced from: _lz_filter_impl in lua_zlib.c.o _lz_checksum in lua_zlib.c.o "_lua_isnumber", referenced from: _lz_inflate_new in lua_zlib.c.o _lz_checksum in lua_zlib.c.o "_lua_isstring", referenced from: _lz_filter_impl in lua_zlib.c.o "_lua_newuserdata", referenced from: _lz_deflate_new in lua_zlib.c.o _lz_inflate_new in lua_zlib.c.o _lz_version in lua_zlib.c.o "_lua_pushboolean", referenced from: _lz_filter_impl in lua_zlib.c.o "_lua_pushcclosure", referenced from: _lz_create_deflate_mt in lua_zlib.c.o _lz_create_inflate_mt in lua_zlib.c.o _lz_deflate_new in lua_zlib.c.o _lz_inflate_new in lua_zlib.c.o _lz_checksum_new in lua_zlib.c.o "_lua_pushfstring", referenced from: _lz_assert in lua_zlib.c.o _lz_filter_impl in lua_zlib.c.o "_lua_pushinteger", referenced from: _luaopen_zlib in lua_zlib.c.o _lz_filter_impl in lua_zlib.c.o "_lua_pushlightuserdata", referenced from: _lz_checksum_new in lua_zlib.c.o "_lua_pushlstring", referenced from: _luaopen_zlib in lua_zlib.c.o _lz_filter_impl in lua_zlib.c.o "_lua_pushnil", referenced from: _lz_deflate_new in lua_zlib.c.o _lz_inflate_new in lua_zlib.c.o _lz_filter_impl in lua_zlib.c.o "_lua_pushnumber", referenced from: _lz_version in lua_zlib.c.o _lz_checksum_new in lua_zlib.c.o _lz_checksum in lua_zlib.c.o "_lua_pushstring", referenced from: _lz_filter_impl in lua_zlib.c.o "_lua_pushvalue", referenced from: _lz_filter_impl in lua_zlib.c.o _lz_checksum in lua_zlib.c.o "_lua_replace", referenced from: _lz_filter_impl in lua_zlib.c.o _lz_checksum in lua_zlib.c.o "_lua_setfield", referenced from: _lz_create_deflate_mt in lua_zlib.c.o _lz_create_inflate_mt in lua_zlib.c.o "_lua_setmetatable", referenced from: _lz_deflate_new in lua_zlib.c.o _lz_inflate_new in lua_zlib.c.o _lz_filter_impl in lua_zlib.c.o "_lua_settable", referenced from: _luaopen_zlib in lua_zlib.c.o "_lua_settop", referenced from: _lz_create_deflate_mt in lua_zlib.c.o _lz_create_inflate_mt in lua_zlib.c.o "_lua_tointeger", referenced from: _lz_inflate_new in lua_zlib.c.o "_lua_tolstring", referenced from: _lz_filter_impl in lua_zlib.c.o "_lua_tonumber", referenced from: _lz_checksum in lua_zlib.c.o "_lua_touserdata", referenced from: _lz_deflate_delete in lua_zlib.c.o _lz_inflate_delete in lua_zlib.c.o _lz_filter_impl in lua_zlib.c.o _lz_checksum in lua_zlib.c.o "_lua_type", referenced from: _lz_filter_impl in lua_zlib.c.o _lz_checksum in lua_zlib.c.o ld: symbol(s) not found for architecture x86_64 clang: error: linker command failed with exit code 1 (use -v to see invocation) make[2]: *** [zlib.so] Error 1 make[1]: *** [CMakeFiles/cmod_zlib.dir/all] Error 2 求大神解决。。
在android源码环境下编译报错: _intermediates/src/R.stamp'. Stop.
在android源码环境下编译报错: make: *** No rule to make target `out/host/linux-x86/bin/aapt', needed by `out/target/common/obj/APPS/my.cloud_intermediates/src/R.stamp'. Stop. 这个错误怎么样处理?
ROS机械臂运动规划中这段源码怎么理解?
# 创建一个允许的的抓取姿态列表 def make_grasps(self, initial_pose_stamped, allowed_touch_objects): # 初始化抓取姿态对象 g = Grasp() # 创建夹爪张开、闭合的姿态 g.pre_grasp_posture = self.make_gripper_posture(GRIPPER_OPEN) g.grasp_posture = self.make_gripper_posture(GRIPPER_CLOSED) # 设置期望的夹爪靠近、撤离目标的参数 g.pre_grasp_approach = self.make_gripper_translation(0.01, 0.1, [1.0, 0.0, 0.0]) g.post_grasp_retreat = self.make_gripper_translation(0.1, 0.15, [0.0, -1.0, 1.0]) # 设置抓取姿态 g.grasp_pose = initial_pose_stamped # 需要尝试改变姿态的数据列表 pitch_vals = [0, 0.1, -0.1, 0.2, -0.2, 0.3, -0.3] yaw_vals = [0] # 抓取姿态的列表 grasps = [] # 改变姿态,生成抓取动作 for y in yaw_vals: for p in pitch_vals: # 欧拉角到四元数的转换 q = quaternion_from_euler(0, p, y) # 设置抓取的姿态 g.grasp_pose.pose.orientation.x = q[0] g.grasp_pose.pose.orientation.y = q[1] g.grasp_pose.pose.orientation.z = q[2] g.grasp_pose.pose.orientation.w = q[3] # 设置抓取的唯一id号 g.id = str(len(grasps)) # 设置允许接触的物体 g.allowed_touch_objects = allowed_touch_objects # 将本次规划的抓取放入抓取列表中 grasps.append(deepcopy(g)) # 返回抓取列表 return grasps
看起來很簡單的一個問題:ROS找不到消息頭文件
~/catkin_ws/src/beginner_tutoruals/src/add_two_ints_server.cpp:2:43: fatal error: beginner_tutorials/AddTwoInts.h: No such file or directory compilation terminated. beginner_tutoruals/CMakeFiles/add_two_ints_server.dir/build.make:62: recipe for target 'beginner_tutoruals/CMakeFiles/add_two_ints_server.dir/src/add_two_ints_server.cpp.o' failed make[2]: *** [beginner_tutoruals/CMakeFiles/add_two_ints_server.dir/src/add_two_ints_server.cpp.o] Error 1 CMakeFiles/Makefile2:363: recipe for target 'beginner_tutoruals/CMakeFiles/add_two_ints_server.dir/all' failed make[1]: *** [beginner_tutoruals/CMakeFiles/add_two_ints_server.dir/all] Error 2 make[1]: *** Waiting for unfinished jobs.... ~/catkin_ws/src/beginner_tutoruals/src/add_two_ints_client.cpp:2:43: fatal error: beginner_tutorials/AddTwoInts.h: No such file or directory compilation terminated. beginner_tutoruals/CMakeFiles/add_two_ints_client.dir/build.make:62: recipe for target 'beginner_tutoruals/CMakeFiles/add_two_ints_client.dir/src/add_two_ints_client.cpp.o' failed make[2]: *** [beginner_tutoruals/CMakeFiles/add_two_ints_client.dir/src/add_two_ints_client.cpp.o] Error 1 CMakeFiles/Makefile2:1357: recipe for target 'beginner_tutoruals/CMakeFiles/add_two_ints_client.dir/all' failed make[1]: *** [beginner_tutoruals/CMakeFiles/add_two_ints_client.dir/all] Error 2 Makefile:138: recipe for target 'all' failed
ubuntu14 下 Caffe编译问题 出错
# .build_release/lib/libcaffe.so: undefined reference to `cudnnConvolutionBackwardData_v3'.build_release/lib/libcaffe.so: undefined reference to `cudnnConvolutionBackwardData_v3' .build_release/lib/libcaffe.so: undefined reference to `cudnnConvolutionBackwardFilter_v3' collect2: error: ld returned 1 exit status make: *** [.build_release/tools/upgrade_solver_proto_text.bin] Error 1 make: *** Waiting for unfinished jobs.... .build_release/lib/libcaffe.so: undefined reference to `cudnnConvolutionBackwardData_v3' .build_release/lib/libcaffe.so: undefined reference to `cudnnConvolutionBackwardFilter_v3' collect2: error: ld returned 1 exit status make: *** [.build_release/tools/upgrade_net_proto_binary.bin] Error 1 .build_release/lib/libcaffe.so: undefined reference to `cudnnConvolutionBackwardData_v3' .build_release/lib/libcaffe.so: undefined reference to `cudnnConvolutionBackwardFilter_v3' collect2: error: ld returned 1 exit status .build_release/lib/make: libcaffe.so: undefined reference to *** [.build_release/tools/compute_image_mean.bin] Error 1`cudnnConvolutionBackwardData_v3 ' .build_release/lib/libcaffe.so: undefined reference to `cudnnConvolutionBackwardFilter_v3' collect2: error: ld returned 1 exit status make: *** [.build_release/tools/caffe.bin] Error 1 .build_release/lib/libcaffe.so: undefined reference to `cudnnConvolutionBackwardData_v3' .build_release/lib/libcaffe.so: undefined reference to `cudnnConvolutionBackwardFilter_v3' collect2: error: ld returned 1 exit status make: *** [.build_release/examples/cifar10/convert_cifar_data.bin] Error 1 .build_release/lib/libcaffe.so: undefined reference to `cudnnConvolutionBackwardData_v3' .build_release/lib/libcaffe.so: undefined reference to `cudnnConvolutionBackwardFilter_v3' collect2: error: ld returned 1 exit status make: *** [.build_release/tools/convert_imageset.bin] Error 1 .build_release/lib/libcaffe.so: undefined reference to `cudnnConvolutionBackwardData_v3' .build_release/lib/libcaffe.so: undefined reference to `cudnnConvolutionBackwardFilter_v3' collect2: error: ld returned 1 exit status make: *** [.build_release/tools/extract_features.bin] Error 1 .build_release/lib/libcaffe.so: undefined reference to `cudnnConvolutionBackwardData_v3' .build_release/lib/libcaffe.so: undefined reference to `cudnnConvolutionBackwardFilter_v3' collect2: error: ld returned 1 exit status make: *** [.build_release/tools/upgrade_net_proto_text.bin] Error 1_**
Harvest Moon
Problem Description Harvest Moon (牧場物語 Bokujō Monogatari) is a virtual role playing game for the Super Nintendo Entertainment System developed and published by Pack-In-Video (now Marvelous AQL), first released in Japan in 1996, and 1997 in North America. This is the first game in the long-running Harvest Moon titles. A PAL version was released by Nintendo in early 1998 for Western Europe and Oceania, with language localizations for Germany and France. -- wikipedia Hard though, it's still an incorrigibly temptation for Moor. In the game, Moor's favorite is to cultivate in his own pasture. His pasture is large - we may consider it as a w×h lattice. The shop sells A kinds of seeds. The price of the ith seed is Q_i dollars, and it can be sowed to cover a 3×3 lattice. Note that the cover area may contain the grids outside his pasture, but only the grids inside belong to him. Further more, although a grid may be sowed multiple times, the later sowing on this grid exert nothing if the corns are still growing in it. After ploughing and weeding, the corns get ripe right after N_i days and Moor will go harvest. For instance, if Moor sows the seeds at the beginning of day x, they will get ripe at the beginning of the (x+N_i)th day(or you may consider it as the right end of the (x+N_i-1)th day). After harvest, some of the corns will disappear and the grids they belong to would become empty, while the others may stays and get ripe again and again, in a period of M_i days. For convenience, Moor always leaves the second kind of corns staying, but he will try to keep sowing in those new empty grids. Moor only sows seeds and harvest at the beginning or ending of some day, and you may assume it wastes no time for Moor to make operations. Initially, Moor's got Y dollars. When selling a 1×1 grid of corns, he will obtain P_i dollars back. Moor wonders the maximum dollars he will get at the end of the Dth day, if he buys only one kind of seeds? Certainly, he may do nothing and keep all dollars in his pocket. Input The input contains several test cases. An integer T(T≤110) will exist in the first line of input, indicating the number of test cases. Each test case begins with 5 integers w,h,A,D,Y(3≤w,h≤100,0<A,D≤1000,0<Y≤100000). The following A lines, each with 4 integers Q_i,P_i,N_i,M_i (0<Q_i,P_i≤1000;N_i,M_i≤10000), describe the property of the ith seed. M_i=0 denotes that the seed will not get ripe again after harvest. Output Output the maximum dollars he's able to obtain at the end of the Dth day, one per line. Sample Input 1 3 3 2 3 100 100 90 3 0 100 90 2 0 Sample Output 810
fastdfs报错undefined reference to `g_exe_name'
make: Nothing to be done for `all'. cc -Wall -D_FILE_OFFSET_BITS=64 -D_GNU_SOURCE -g -O -DDEBUG_FLAG -o fdfs_storaged fdfs_storaged.c ../common/fdfs_global.o ../tracker/fdfs_shared_func.o ../tracker/tracker_proto.o tracker_client_thread.o storage_global.o storage_func.o storage_service.o storage_sync.o storage_nio.o storage_dio.o storage_ip_changed_dealer.o storage_param_getter.o storage_disk_recovery.o trunk_mgr/trunk_mem.o trunk_mgr/trunk_shared.o trunk_mgr/trunk_sync.o trunk_mgr/trunk_client.o trunk_mgr/trunk_free_block_checker.o ../client/client_global.o ../client/tracker_client.o ../client/storage_client.o ../client/client_func.o fdht_client/fdht_proto.o fdht_client/fdht_client.o fdht_client/fdht_func.o fdht_client/fdht_global.o storage_dump.o -L/usr/lib64 -lpthread -lfastcommon -I. -Itrunk_mgr -I../common -I../tracker -I../client -Ifdht_client -I/usr/include/fastcommon /tmp/ccWmwyMo.o: In function `main': /home/centos/fastdfs-5.10/storage/fdfs_storaged.c:130: undefined reference to `g_exe_name' storage_dump.o: In function `fdfs_dump_global_vars': /home/centos/fastdfs-5.10/storage/storage_dump.c:36: undefined reference to `g_exe_name' collect2: error: ld returned 1 exit status make: *** [fdfs_storaged] Error 1 make: Nothing to be done for `all'.
ORA-00918: column ambiguously defined
SELECT Articm.Fact_No, Articm.Artic_No, Develop_Articm.Artic_No Develop_Articm_Artic_No, Articm.Style_No, Articm.Brand, Articm.Gender_No, Articm.Color_Cn, Articm.Color_En, Articm.Dist_Size, Articm.Last_No, Articm.Outsole_No, Articm.Outsole_Col_Cn, Articm.Outsole_Col_En, Articm.Mat_Type, Articm.Mod_Type, Articm.Obj_Type, Articm.Cate_No, Articm.Artic_No_In, Articm.Pack_Item, Articm.Odr_Num, Articm.Artic_Yymm, Articm.No_Color, Articm.Size_Label, Articm.User_No, Articm.Modi_Date, Articm.Last_No_t, Articm.Outsole_No_t, Articm.Last_No_Sizemk, Articm.Last_No_t_Sizemk, Articm.Art_Component, Articm.Gwt_Chk_Mk, Articm.Gwt_Chk_User, Articm.Gwt_Chk_Date, Articm.Mat_Type_Chk, Articm.Upper_Desc, Articm.Inner_Desc, Articm.Outsole_Desc, Articm.Label_No, Articm.Upc_Code, Articm.Knife_No, Articm.Size_Color_Desc, Articm.Md_No, Articm.Md_No2, Articm.Type_Id, Articm.Odr_Make, Articm.Odr_Class, Articm.No_Midkind, Articm.Com_Style_No, Articm.No_Midkind_d, Articm.Modtype_Bottom, Articm.Semipro_Type, Articm.Logo_Desc, Articm.Ftc_No, Articm.Hp_Articm, Articm.Ftc_Mk, Articm.Pre_Make_Mk, Articm.Project_Type, Articm.Artic_Model, Articm.Season, Articm.Pu_Col_Cn, Articm.Upper_No, Articm.Ship_Days, Articm.Upper_Chk_Mk, Articm.Outsole_Chk_Mk, Articm.Stop_Mk, Artic_Regcode.Reg_Code, Stylem.List_No FROM Articm, Develop_Articm, Stylem, Artic_Regcode WHERE (Articm.Fact_No = Stylem.Fact_No(+)) AND (Articm.Style_No = Stylem.Style_No(+)) AND (Articm.Fact_No = Develop_Articm.Fact_No(+)) AND (Articm.Artic_No = Develop_Articm.Offi_Artic_No(+)) AND (Articm.Fact_No = Artic_Regcode.Fact_No(+)) AND (Articm.Artic_No = Artic_Regcode.Artic_No(+)) AND (Articm.Fact_No = :As_Fact_No) AND (Articm.Brand = :As_Brand OR :As_Brand = '%') AND (Articm.Style_No LIKE :As_Style_No) AND (Articm.Artic_No LIKE :As_Artic_No) AND (Nvl(Develop_Articm.Artic_No, '%') LIKE :As_Dev_Artic) 前端提示錯誤信息:Select Error: ORA-00918: column ambiguously defined
终于明白阿里百度这样的大公司,为什么面试经常拿ThreadLocal考验求职者了
点击上面↑「爱开发」关注我们每晚10点,捕获技术思考和创业资源洞察什么是ThreadLocalThreadLocal是一个本地线程副本变量工具类,各个线程都拥有一份线程私...
程序员必须掌握的核心算法有哪些?
由于我之前一直强调数据结构以及算法学习的重要性,所以就有一些读者经常问我,数据结构与算法应该要学习到哪个程度呢?,说实话,这个问题我不知道要怎么回答你,主要取决于你想学习到哪些程度,不过针对这个问题,我稍微总结一下我学过的算法知识点,以及我觉得值得学习的算法。这些算法与数据结构的学习大多数是零散的,并没有一本把他们全部覆盖的书籍。下面是我觉得值得学习的一些算法以及数据结构,当然,我也会整理一些看过...
Linux(服务器编程):15---两种高效的事件处理模式(reactor模式、proactor模式)
前言 同步I/O模型通常用于实现Reactor模式 异步I/O模型则用于实现Proactor模式 最后我们会使用同步I/O方式模拟出Proactor模式 一、Reactor模式 Reactor模式特点 它要求主线程(I/O处理单元)只负责监听文件描述符上是否有事件发生,有的话就立即将时间通知工作线程(逻辑单元)。除此之外,主线程不做任何其他实质性的工作 读写数据,接受新的连接,以及处...
阿里面试官问我:如何设计秒杀系统?我的回答让他比起大拇指
你知道的越多,你不知道的越多 点赞再看,养成习惯 GitHub上已经开源 https://github.com/JavaFamily 有一线大厂面试点脑图和个人联系方式,欢迎Star和指教 前言 Redis在互联网技术存储方面使用如此广泛,几乎所有的后端技术面试官都要在Redis的使用和原理方面对小伙伴们进行360°的刁难。 作为一个在互联网公司面一次拿一次Offer的面霸,打败了...
五年程序员记流水账式的自白。
不知觉已中码龄已突破五年,一路走来从起初铁憨憨到现在的十九线程序员,一路成长,虽然不能成为高工,但是也能挡下一面,从15年很火的android开始入坑,走过java、.Net、QT,目前仍处于android和.net交替开发中。 毕业到现在一共就职过两家公司,目前是第二家,公司算是半个创业公司,所以基本上都会身兼多职。比如不光要写代码,还要写软著、软著评测、线上线下客户对接需求收集...
C语言魔塔游戏
很早就很想写这个,今天终于写完了。 游戏截图: 编译环境: VS2017 游戏需要一些图片,如果有想要的或者对游戏有什么看法的可以加我的QQ 2985486630 讨论,如果暂时没有回应,可以在博客下方留言,到时候我会看到。 下面我来介绍一下游戏的主要功能和实现方式 首先是玩家的定义,使用结构体,这个名字是可以自己改变的 struct gamerole { char n...
一文详尽系列之模型评估指标
点击上方“Datawhale”,选择“星标”公众号第一时间获取价值内容在机器学习领域通常会根据实际的业务场景拟定相应的不同的业务指标,针对不同机器学习问题如回归、分类、排...
究竟你适不适合买Mac?
我清晰的记得,刚买的macbook pro回到家,开机后第一件事情,就是上了淘宝网,花了500元钱,找了一个上门维修电脑的师傅,上门给我装了一个windows系统。。。。。。 表砍我。。。 当时买mac的初衷,只是想要个固态硬盘的笔记本,用来运行一些复杂的扑克软件。而看了当时所有的SSD笔记本后,最终决定,还是买个好(xiong)看(da)的。 已经有好几个朋友问我mba怎么样了,所以今天尽量客观...
程序员一般通过什么途径接私活?
二哥,你好,我想知道一般程序猿都如何接私活,我也想接,能告诉我一些方法吗? 上面是一个读者“烦不烦”问我的一个问题。其实不止是“烦不烦”,还有很多读者问过我类似这样的问题。 我接的私活不算多,挣到的钱也没有多少,加起来不到 20W。说实话,这个数目说出来我是有点心虚的,毕竟太少了,大家轻喷。但我想,恰好配得上“一般程序员”这个称号啊。毕竟苍蝇再小也是肉,我也算是有经验的人了。 唾弃接私活、做外...
压测学习总结(1)——高并发性能指标:QPS、TPS、RT、吞吐量详解
一、QPS,每秒查询 QPS:Queries Per Second意思是“每秒查询率”,是一台服务器每秒能够相应的查询次数,是对一个特定的查询服务器在规定时间内所处理流量多少的衡量标准。互联网中,作为域名系统服务器的机器的性能经常用每秒查询率来衡量。 二、TPS,每秒事务 TPS:是TransactionsPerSecond的缩写,也就是事务数/秒。它是软件测试结果的测量单位。一个事务是指一...
Python爬虫爬取淘宝,京东商品信息
小编是一个理科生,不善长说一些废话。简单介绍下原理然后直接上代码。 使用的工具(Python+pycharm2019.3+selenium+xpath+chromedriver)其中要使用pycharm也可以私聊我selenium是一个框架可以通过pip下载 pip installselenium -ihttps://pypi.tuna.tsinghua.edu.cn/simple/ ...
阿里程序员写了一个新手都写不出的低级bug,被骂惨了。
这种新手都不会范的错,居然被一个工作好几年的小伙子写出来,差点被当场开除了。
Java工作4年来应聘要16K最后没要,细节如下。。。
前奏: 今天2B哥和大家分享一位前几天面试的一位应聘者,工作4年26岁,统招本科。 以下就是他的简历和面试情况。 基本情况: 专业技能: 1、&nbsp;熟悉Sping了解SpringMVC、SpringBoot、Mybatis等框架、了解SpringCloud微服务 2、&nbsp;熟悉常用项目管理工具:SVN、GIT、MAVEN、Jenkins 3、&nbsp;熟悉Nginx、tomca...
2020年,冯唐49岁:我给20、30岁IT职场年轻人的建议
点击“技术领导力”关注∆每天早上8:30推送 作者|Mr.K 编辑| Emma 来源|技术领导力(ID:jishulingdaoli) 前天的推文《冯唐:职场人35岁以后,方法论比经验重要》,收到了不少读者的反馈,觉得挺受启发。其实,冯唐写了不少关于职场方面的文章,都挺不错的。可惜大家只记住了“春风十里不如你”、“如何避免成为油腻腻的中年人”等不那么正经的文章。 本文整理了冯...
程序员该看的几部电影
1、骇客帝国(1999) 概念:在线/离线,递归,循环,矩阵等 剧情简介: 不久的将来,网络黑客尼奥对这个看似正常的现实世界产生了怀疑。 他结识了黑客崔妮蒂,并见到了黑客组织的首领墨菲斯。 墨菲斯告诉他,现实世界其实是由一个名叫“母体”的计算机人工智能系统控制,人们就像他们饲养的动物,没有自由和思想,而尼奥就是能够拯救人类的救世主。 可是,救赎之路从来都不会一帆风顺,到底哪里才是真实的世界?如何...
Python绘图,圣诞树,花,爱心 | Turtle篇
每周每日,分享Python实战代码,入门资料,进阶资料,基础语法,爬虫,数据分析,web网站,机器学习,深度学习等等。 公众号回复【进群】沟通交流吧,QQ扫码进群学习吧 微信群 QQ群 1.画圣诞树 import turtle screen = turtle.Screen() screen.setup(800,600) circle = turtle.Turtle()...
作为一个程序员,CPU的这些硬核知识你必须会!
CPU对每个程序员来说,是个既熟悉又陌生的东西? 如果你只知道CPU是中央处理器的话,那可能对你并没有什么用,那么作为程序员的我们,必须要搞懂的就是CPU这家伙是如何运行的,尤其要搞懂它里面的寄存器是怎么一回事,因为这将让你从底层明白程序的运行机制。 随我一起,来好好认识下CPU这货吧 把CPU掰开来看 对于CPU来说,我们首先就要搞明白它是怎么回事,也就是它的内部构造,当然,CPU那么牛的一个东...
还记得那个提速8倍的IDEA插件吗?VS Code版本也发布啦!!
去年,阿里云发布了本地 IDE 插件 Cloud Toolkit,仅 IntelliJ IDEA 一个平台,就有 15 万以上的开发者进行了下载,体验了一键部署带来的开发便利。时隔一年的今天,阿里云正式发布了 Visual Studio Code 版本,全面覆盖前端开发者,帮助前端实现一键打包部署,让开发提速 8 倍。 VSCode 版本的插件,目前能做到什么? 安装插件之后,开发者可以立即体验...
破14亿,Python分析我国存在哪些人口危机!
一、背景 二、爬取数据 三、数据分析 1、总人口 2、男女人口比例 3、人口城镇化 4、人口增长率 5、人口老化(抚养比) 6、各省人口 7、世界人口 四、遇到的问题 遇到的问题 1、数据分页,需要获取从1949-2018年数据,观察到有近20年参数:LAST20,由此推测获取近70年的参数可设置为:LAST70 2、2019年数据没有放上去,可以手动添加上去 3、将数据进行 行列转换 4、列名...
2019年除夕夜的有感而发
天气:小雨(加小雪) 温度:3摄氏度 空气:严重污染(399) 风向:北风 风力:微风 现在是除夕夜晚上十点钟,再有两个小时就要新的一年了; 首先要说的是我没患病,至少现在是没有患病;但是心情确像患了病一样沉重; 现在这个时刻应该大部分家庭都在看春晚吧,或许一家人团团圆圆的坐在一起,或许因为某些特殊原因而不能团圆;但不管是身在何处,身处什么境地,我都想对每一个人说一句:新年快乐! 不知道csdn这...
听说想当黑客的都玩过这个Monyer游戏(1~14攻略)
第零关 进入传送门开始第0关(游戏链接) 请点击链接进入第1关: 连接在左边→ ←连接在右边 看不到啊。。。。(只能看到一堆大佬做完的留名,也能看到菜鸡的我,在后面~~) 直接fn+f12吧 &lt;span&gt;连接在左边→&lt;/span&gt; &lt;a href="first.php"&gt;&lt;/a&gt; &lt;span&gt;←连接在右边&lt;/span&gt; o...
在家远程办公效率低?那你一定要收好这个「在家办公」神器!
相信大家都已经收到国务院延长春节假期的消息,接下来,在家远程办公可能将会持续一段时间。 但是问题来了。远程办公不是人在电脑前就当坐班了,相反,对于沟通效率,文件协作,以及信息安全都有着极高的要求。有着非常多的挑战,比如: 1在异地互相不见面的会议上,如何提高沟通效率? 2文件之间的来往反馈如何做到及时性?如何保证信息安全? 3如何规划安排每天工作,以及如何进行成果验收? ...... ...
作为一个程序员,内存和磁盘的这些事情,你不得不知道啊!!!
截止目前,我已经分享了如下几篇文章: 一个程序在计算机中是如何运行的?超级干货!!! 作为一个程序员,CPU的这些硬核知识你必须会! 作为一个程序员,内存的这些硬核知识你必须懂! 这些知识可以说是我们之前都不太重视的基础知识,可能大家在上大学的时候都学习过了,但是嘞,当时由于老师讲解的没那么有趣,又加上这些知识本身就比较枯燥,所以嘞,大家当初几乎等于没学。 再说啦,学习这些,也看不出来有什么用啊!...
2020年的1月,我辞掉了我的第一份工作
其实,这篇文章,我应该早点写的,毕竟现在已经2月份了。不过一些其它原因,或者是我的惰性、还有一些迷茫的念头,让自己迟迟没有试着写一点东西,记录下,或者说是总结下自己前3年的工作上的经历、学习的过程。 我自己知道的,在写自己的博客方面,我的文笔很一般,非技术类的文章不想去写;另外我又是一个还比较热衷于技术的人,而平常复杂一点的东西,如果想写文章写的清楚点,是需要足够...
别低估自己的直觉,也别高估自己的智商
所有群全部吵翻天,朋友圈全部沦陷,公众号疯狂转发。这两周没怎么发原创,只发新闻,可能有人注意到了。我不是懒,是文章写了却没发,因为大家的关注力始终在这次的疫情上面,发了也没人看。当然,我...
这个世界上人真的分三六九等,你信吗?
偶然间,在知乎上看到一个问题 一时间,勾起了我深深的回忆。 以前在厂里打过两次工,做过家教,干过辅导班,做过中介。零下几度的晚上,贴过广告,满脸、满手地长冻疮。 再回首那段岁月,虽然苦,但让我学会了坚持和忍耐。让我明白了,在这个世界上,无论环境多么的恶劣,只要心存希望,星星之火,亦可燎原。 下文是原回答,希望能对你能有所启发。 如果我说,这个世界上人真的分三六九等,...
节后首个工作日,企业们集体开晨会让钉钉挂了
By 超神经场景描述:昨天 2 月 3 日,是大部分城市号召远程工作的第一天,全国有接近 2 亿人在家开始远程办公,钉钉上也有超过 1000 万家企业活跃起来。关键词:十一出行 人脸...
Java基础知识点梳理
虽然已经在实际工作中经常与java打交道,但是一直没系统地对java这门语言进行梳理和总结,掌握的知识也比较零散。恰好利用这段时间重新认识下java,并对一些常见的语法和知识点做个总结与回顾,一方面为了加深印象,方便后面查阅,一方面为了掌握好Android打下基础。
2020年全新Java学习路线图,含配套视频,学完即为中级Java程序员!!
新的一年来临,突如其来的疫情打破了平静的生活! 在家的你是否很无聊,如果无聊就来学习吧! 世上只有一种投资只赚不赔,那就是学习!!! 传智播客于2020年升级了Java学习线路图,硬核升级,免费放送! 学完你就是中级程序员,能更快一步找到工作! 一、Java基础 JavaSE基础是Java中级程序员的起点,是帮助你从小白到懂得编程的必经之路。 在Java基础板块中有6个子模块的学...
B 站上有哪些很好的学习资源?
哇说起B站,在小九眼里就是宝藏般的存在,放年假宅在家时一天刷6、7个小时不在话下,更别提今年的跨年晚会,我简直是跪着看完的!! 最早大家聚在在B站是为了追番,再后来我在上面刷欧美新歌和漂亮小姐姐的舞蹈视频,最近两年我和周围的朋友们已经把B站当作学习教室了,而且学习成本还免费,真是个励志的好平台ヽ(.◕ฺˇд ˇ◕ฺ;)ノ 下面我们就来盘点一下B站上优质的学习资源: 综合类 Oeasy: 综合...
相关热词 c# 为空 判断 委托 c#记事本颜色 c# 系统默认声音 js中调用c#方法参数 c#引入dll文件报错 c#根据名称实例化 c#从邮件服务器获取邮件 c# 保存文件夹 c#代码打包引用 c# 压缩效率
立即提问