在android源码环境下编译报错: _intermediates/src/R.stamp'. Stop.

在android源码环境下编译报错:
make: *** No rule to make target out/host/linux-x86/bin/aapt', needed byout/target/common/obj/APPS/my.cloud_intermediates/src/R.stamp'. Stop.

这个错误怎么样处理?

3
Csdn user default icon
上传中...
上传图片
插入图片
抄袭、复制答案,以达到刷声望分或其他目的的行为,在CSDN问答是严格禁止的,一经发现立刻封号。是时候展现真正的技术了!
其他相关推荐
Android添加资源文件编译,R文件未重新生成解决办法
在修改Launcher2项目中,添加资源文件后出现莫名奇怪的错误                         类型转换错误, 查看了相关文件 mUnistallDrawable是全局变量,也是TransitionDrawable对象,查看了unistall_target_selector.xml文件 也是TransitionDrawable类型的,再查看
Android源码编译:Android系统源码编译时遇到的错误及解决方法
下面是在编译安卓源码是遇到的错误,记录下来,防止再次遇到。 1.编译时候出现如下错误: build/core/base_rules.mk:134: *** prebuilts/gcc/darwin-x86/arm/arm-linux-androideabi-4.6/lib32:  MODULE.HOST.STATIC_LIBRARIES.libbfd already defined by p...
android ndk编译错误
一、android ndk编译出错 1、出错情况: NDK编译出现***target pattern contains no `%'. Stop.的编译错误 出错原因: a、采用ndk 编译的时候生成的目标文件的路径为windos 目录,导致编译不过 b、查看convert-dependencies.sh 脚本的时候,使用的Cygwn 工具路径和当前的Cygwin工具路径不一样导
CMake使用遇坑记(一)
Android工程在加入了一系列 .so 库之后,点击运行之后,报了如下错误Error:error:'../../../../../jniLibs/armeabi/libavcodec57.so',needed by '../../../../build/intermediates/cmake/debug/obj/armeabi/libnative-lib.so', missing and no ...
最简单的android studio 2.3 引用FFmpeg例子程序
  本文2017-3-11   参考了:   http://blog.csdn.net/huweijian5/article/details/52883969      基本环境:   1. 操作系统:Windows10  64位;   2. Android Studio 2.3,64位。   3. Android NDK开发包:直接使用Android Studio安装NDK。
NDK 调用so包以及找不到类出错。
1.首先看一下最常见的出错,找不到so包。出错代码:Build command failed.Error while executing process D:\androidsdk\android-sdk-windows\cmake\3.6.4111459\bin\cmake.exe with arguments {--build F:\TestHello\app\.externalNativeB...
Android NDK编译常见错误及解决方案
Error 1: $ ndk-build /cygdrive/c/andy/abc/obj/local/armeabi-v7a/objs/abc//hellow.o.d:1: *** multiple target patterns. Stop. quick fix: Delete Obj folder from “C:\andy\prjM\obj\local\armeabi-v7a
Android学习笔记之编译系统(五)apk编译流程
apk项目是如何编译的? 总结: 我们可以通过mm  showcommands命令查看编译过程。今天下载了小米的Notes,便签,没有Android.mk文件,自己加上了Androd.mk,将这个项目放在自己的电脑工程下编译。总结了一下编译过程,不当之处请指正。参考柯元旦android内核剖析。 接下来我们就按顺序看看apk编译过程中的流程。 1、首先编译项目下的资源文件,生成R.java
AndroidStudio JNI开发,通过Cmake编译so文件
官方文档:https://developer.android.com/ndk/guides/cmake 1、创建项目,在首界面勾选上Include C++ support,然后点击next,直至创建完成 2、项目会默认生成jni事例代码,观察项目结构,在app/src/main下有个cpp文件夹,我们要写或者要添加的c/c++文件就写在该文件夹下。 3、打开MainActivity.java...
编译带有第三方jar包的ap,如何才能过用mmm编译成功(update 20100728)
++++++++++++++++++UPDATE++++++++++++++++++UPDATE+++++++++++++++++++++UPDATE+++++++++++++++++++++++++++++++++++++UPDATE时隔很久了,因为项目中一直认为这个是个瓶颈,导致本来可以放在一个AP里面的东西要写成两个AP,所以我又回来看了这个问题,这次我想到了在android源码中是不是
jrebel编译报错
最近打开项目用jrebel for Android 打开时候,发现报错了,怎么clean rebuild 重启都不行,最后随便点了下升级Android studio,发现jrebel for Android竟然有新版本了,顺便升级了下,就莫名奇妙好了。 Error:Configuration on demand is an incubating feature. :app:preBuild UP...
Android源码编译的记录
2017.6.15 这是个人笔记来着,路人请自动跳过Refer to https://source.android.com/source/building bash cd xd_build_x86 bash ./aosp_init.sh ~/XDRoot/android_6.0.0_r41 cd ../android_6.0.0_r41 source build/env
用Android studio2.3打jar包失败,没有生成相应的jar包。
使用Android studio2.3打jar包的一些问题。
make: *** No rule to make target 错误原因、分析和解决办法
很有帮助,已解决问题。具体解决步骤是:   比如我的报错是: make[1]: *** No rule to make target `jni/..//submodules/linphone/oRTP/build/android/../..//src/str_utils.c', needed by `obj/local/x86/objs/ortp/src/str_utils.o'.  Stop
解决JNI在Windows环境下因长路径导致编译失败问题
之前听一个朋友反馈LuaScriptoCore在Windows下编译会报错,今天特意跑到Windows环境下测试了一番,果然是存在问题。得到了下面的编译报错信息: Build command failed. Error while executing process C:\Users\vimfung\AppData\Local\Android\Sdk\ndk-bundle\ndk-build.c...
为什么我build项目后,在intermediates文件夹下没有bundles?
今天在某个项目中打jar包,打完之后居然没发现bundles文件夹。 后来在论坛中看见,intermediates/packaged-classes  替换intermediates/bundles了,jar包算是找到了,不明白什么原因,有知道的麻烦告诉一下。...
Android源码编译make的各类错误解决方案汇总
问题: You are attempting to build with the incorrect version of java.  Your version is: java version "1.6.0_22". The correct version is: Java SE 1.6. 查了一下现在已安装的java: java -versionjava versi
wireshark源码编译
开发环境: 主机:mac pro  虚拟机:virtural box 5.0.14 编译环境:ubuntu14.04(64位) 1.配置环境 1.1安装virtural box最新版本及增强包 1.2安装ubuntu14.04虚拟机 2.下载源码 https://www.wireshark.org/download/src/all-versions/wire
单元测试整理
单元测试,还是在刚接触android的时候写了个demo,工作之后,经历的公司都没有做过单元测试。最近在看包建强的《App研发录》,书中提到了这个,正好今天项目上线,闲下来可以学点东西。以后可能也不会用到,但是,多掌握点知识总是好的。 学习的时候主要参考了这篇文章http://www.jianshu.com/p/03118c11c199,这篇教程翻译自Google I/O 2015中关于测试的co
Android 必知必会 - Android Studio 2.3 找回 exploded-aar 目录【官方有更新】
升级到 Android Studio 2.3 后,Gradle Plugin 也升级到 2.3.0,对应推荐使用的 Gradle 版本是 3.3。这时候会发现项目目录下 {module name}/build/intermediates/exploded-aar/ 目录没了
nginx模块编译错误
', needed by `objs/nginx'.  Stop.et `objs/addon/passport/mod_passport.o make[1]: Leaving directory `/home/admin/software/nginx-0.7.69' make: *** [build] Error 2 wangc
Android编译环境报错记录
一、报错出现了build/core/host_shared_library_internal.mk:44: recipe for target 'out/host/linux-x86/obj/lib/libc++.so' failed解决方案:  1.art/build/Android.common_build.mk中把true改为false# Host. ART_HOST_CLANG := fa...
android2.2源码编译结果 class.jar (framework_intermediates目录下)
android2.2源码编译结果 \android2.2\out\target\common\obj\JAVA_LIBRARIES\framework_intermediates
android studio 异常处理大全
用过Android studio 的人都知道 这B玩意真是一大堆莫名的异常啊,恨不得把它砸了,不过,无可否认,开发起来确实挺爽的 现在我们一起来汇总处理各种异常的处理办法吧 持续更新 playout的预览图preview无法显示 尝试修改你的buildToolsVersion版本号然后sync...
升级更新Android stdio的exploded-aar不见了的问题
Android Studio 3.0 中未测试,使用Terminal命令行实现生成aar文件升级到 Android Studio 2.3 后,Gradle Plugin 也升级到 2.3.0,对应推荐使用的 Gradle 版本是 3.3。这时候会发现项目目录下 {module name}/build/intermediates/exploded-aar/ 目录没了,经过一番查找,发现这并不是一个 ...
Android Studio 编译常见问题解决办法
1.dexDebug ExecException finished with non-zero exit value 2 需要在gradle中配置下面的代码,原因是引用了多个libraries文件 defaultConfig { multiDexEnabled true } 2.Exe
android studio中使用cmake常见错误
cmake常见错误Error:error: linker command failed with exit code 1 (use -v to see invocation)这是target_link_libraries链接时出现错误。 常见的错误有:Error:error: cannot find -llibopencv_javaso库不存在,链接时找不到so库;Error:error: '..
Android开发:Android Studio工具遇到的坑,以及解决办法
场景打开a s工程项目,报错:Could not find method android() for arguments Error:(31, 0) Could not find method android() for arguments [build_4g5zqa4pkpj6q6qii8a22khzz$_run_closure2@7a96d128] on root project 'Mybaby
编译cm13.0时 org.cyanogenmod.platform.sdk 报错找不到文件的解决方法
target Java: org.cyanogenmod.platform.sdk (/home/yaphet/compile/cm13.0/out/target/common/obj/JAVA_LIBRARIES/org.cyanogenmod.platform.sdk_intermediates/classes) javac: 找不到文件: /home/yaphet/compile/cm13.0
刚接触android开发时碰到的一些问题
用android-studio  build 工程以后   build.gradle 中  dependencies { compile fileTree(include: ['*.jar'], dir: 'libs') testCompile 'junit:junit:4.12' compile 'io.reactivex:rxandroid:0.24.0'
android项目运行就报错
Android resource linking failed Output: F:\Qoqonuts\app\build\intermediates\incremental\mergeDevDebugResources\merged.dir\values-v26\values-v26.xml:7: error: resource android:attr/colorError not foun...
解决Redis安装时的编译报错问题
1、报错:“cc:未找到命令” 解决办法如下:      Linux环境安装gcc。 yum -y install gcc automake autoconf libtool make gcc安装完毕,完美解决! 2、报错:“make[1]: *** [adlist.o] 错误
编译uboot时报错
编译uboot时报错 转自:http://spring-studio.net/?p=196 编译u-boot时出现: Configuring for smdk6400 board… ln: 正在创建指向“../arch/arm/include/asm”的符号链接“asm”: 不支持的操作 make: *** [xxxxxxxx_config] 错误 1 然后再运行 make xxx
android studio文件工程夹过大,generated文件夹过大解决方法
android studio文件工程夹过大,generated文件夹过大解决方法
Android问题集锦(1)
注:记录自己平常工作中遇到的一些问题,以及应对这些问题的解决方案。方便自己查看,也方便他人遇到同样的问题,可以少走些弯路。 1.android studio : no debuggable applications 解决方案:Tools->Android->Enable ADB Integration 选中。 如果选中还提示no debuggable applica...
LDD3 /scull 驱动实例在linux3.2.0编译实现
由于LDD3的驱动实例都是在linux2.6.10中实现,在后期linux内核版本中有些改动,导致有些实例编译不通过。 环境:ubuntu12.04   内核版本:linux3.2.0  实例:LDD3中驱动实例 SCULL 排除错误 1、scripts/Makefile.build:49: *** CFLAGS was changed in "/usr/src/linux-source
Android | 菜鸟(一)Active生命周期
在 Activity 跳转过程中的生命周期 Android 系统初始化它的程序是通过活动中的 onCreate() 回调的调用开始的。存在有一序列的回调方法来启动一个活动,同时有一序列的方法来关闭活动,如下面的活动声明周期图所示: 下面我们就来看一下Android在 Activity 跳转过程中的生命周期: MainActivity package com.example.a17242.m...
Android 编译报错
Android 编译:/root/I7_new/XY3501_l1/prebuilts/gcc/linux-x86/host/x86_64-linux-glibc2.11-4.6/bin/../lib/gcc/x86_64-linux/4.6/../../../../x86_64-linux/bin/ld: error: out/host/linux-x86/obj32/STATIC_LIBRAR...
android源码编译错误的解决
一定要看配置环境,如果缺少库文件或者环境不对,出的错误提示简直各种各样   以Ubuntu16.04编译android8.1为例 sudo apt-get install libx11-dev:i386 libreadline6-dev:i386 libgl1-mesa-dev g ++ - multilib sudo apt-get install -y git flex biso...
kaldi重新编译报错
这个其实只是记录一下,之前用过,忘了,刚才郁闷了半个小时如果我们想修改部分源码,只需要编译改的那部分就好了,比如编译gmmbin下的某个文件,不过这时候改完需要三个步骤,报错主要是忘了depend.error:gmm-init-mono.o: In function `kaldi::ReadSharedPhonesList(std::__cxx11::basic_string<char, std::
文章热词 机器学习教程 Objective-C培训 交互设计视频教程 颜色模型 设计制作学习
相关热词 mysql关联查询两次本表 native底部 react extjs glyph 图标 python环境 大数据基础环境