weixin_39710561
weixin_39710561
2021-01-06 11:39

WFLY-2028 : An exploded war inside an archived ear returns 404

  • Fixing bug by extracting exploded WAR in zipped EAR.
  • Updating deployment test to check that this works.

https://issues.jboss.org/browse/WFLY-2028

该提问来源于开源项目:wildfly/wildfly

  • 点赞
  • 写回答
  • 关注问题
  • 收藏
  • 复制链接分享
  • 邀请回答

22条回答

  • weixin_39890708 weixin_39890708 4月前

    Merged

    点赞 评论 复制链接分享
  • weixin_39842937 weixin_39842937 4月前

    Reopening to start a discussion re: reverting this due to the problem reported in the JIRA.

    点赞 评论 复制链接分享
  • weixin_39890708 weixin_39890708 4月前

    I've reverted this commit from upstream/master till we figure out the latest issue.

    点赞 评论 复制链接分享
  • weixin_39710561 weixin_39710561 4月前

    Updating code fixing WFLY-2101 (https://issues.jboss.org/browse/WFLY-2101) by only extracting exploded wars if we are in an archive ear.

    点赞 评论 复制链接分享
  • weixin_39680609 weixin_39680609 4月前

    Build 640 is now running using a merge of 119ba060437f7ff6925f4c9a5e9932abfdd6ff2a

    点赞 评论 复制链接分享
  • weixin_39680609 weixin_39680609 4月前

    Build 640 outcome was FAILURE using a merge of 119ba060437f7ff6925f4c9a5e9932abfdd6ff2a Summary: Tests failed: 1 (1 new), passed: 4853, ignored: 88, muted: 1 Build time: 1:46:43

    Build problems:

    Failed tests detected

    
    java.lang.AssertionError
    java.lang.AssertionError
        at org.junit.Assert.fail(Assert.java:86)
        at org.junit.Assert.assertTrue(Assert.java:41)
        at org.junit.Assert.assertTrue(Assert.java:52)
        at org.jboss.as.test.integration.ejb.timerservice.schedule.SimpleScheduleSecondTestCase.testScheduleMethodTimeout(SimpleScheduleSecondTestCase.java:58)
        at sun.reflect.NativeMethodAccessorImpl.invoke0(Native Method)
        at sun.reflect.NativeMethodAccessorImpl.invoke(NativeMethodAccessorImpl.java:57)
        at sun.reflect.DelegatingMethodAccessorImpl.invoke(DelegatingMethodAccessorImpl.java:43)
        at java.lang.reflect.Method.invoke(Method.java:606)
        at org.junit.runners.model.FrameworkMethod$1.runReflectiveCall(FrameworkMethod.java:47)
        at org.junit.internal.runners.model.ReflectiveCallable.run(ReflectiveCallable.java:12)
        at org.junit.runners.model.FrameworkMethod.invokeExplosively(FrameworkMethod.java:44)
        at org.jboss.arquillian.junit.Arquillian$6$1.invoke(Arquillian.java:270)
        at org.jboss.arquillian.container.test.impl.execution.LocalTestExecuter.execute(LocalTestExecuter.java:60)
        at sun.reflect.NativeMethodAccessorImpl.invoke0(Native Method)
        at sun.reflect.NativeMethodAccessorImpl.invoke(NativeMethodAccessorImpl.java:57)
        at sun.reflect.DelegatingMethodAccessorImpl.invoke(DelegatingMethodAccessorImpl.java:43)
        at java.lang.reflect.Method.invoke(Method.java:606)
        at org.jboss.arquillian.core.impl.ObserverImpl.invoke(ObserverImpl.java:94)
        at org.jboss.arquillian.core.impl.EventContextImpl.invokeObservers(EventContextImpl.java:99)
        at org.jboss.arquillian.core.impl.EventContextImpl.proceed(EventContextImpl.java:81)
        at org.jboss.arquillian.core.impl.ManagerImpl.fire(ManagerImpl.java:135)
        at org.jboss.arquillian.core.impl.ManagerImpl.fire(ManagerImpl.java:115)
        at org.jboss.arquillian.core.impl.EventImpl.fire(EventImpl.java:67)
        at org.jboss.arquillian.container.test.impl.execution.ContainerTestExecuter.execute(ContainerTestExecuter.java:38)
        at sun.reflect.NativeMethodAccessorImpl.invoke0(Native Method)
        at sun.reflect.NativeMethodAccessorImpl.invoke(NativeMethodAccessorImpl.java:57)
        at sun.reflect.DelegatingMethodAccessorImpl.invoke(DelegatingMethodAccessorImpl.java:43)
        at java.lang.reflect.Method.invoke(Method.java:606)
        at org.jboss.arquillian.core.impl.ObserverImpl.invoke(ObserverImpl.java:94)
        at org.jboss.arquillian.core.impl.EventContextImpl.invokeObservers(EventContextImpl.java:99)
        at org.jboss.arquillian.core.impl.EventContextImpl.proceed(EventContextImpl.java:81)
        at org.jboss.arquillian.test.impl.TestContextHandler.createTestContext(TestContextHandler.java:89)
        at sun.reflect.NativeMethodAccessorImpl.invoke0(Native Method)
        at sun.reflect.NativeMethodAccessorImpl.invoke(NativeMethodAccessorImpl.java:57)
        at sun.reflect.DelegatingMethodAccessorImpl.invoke(DelegatingMethodAccessorImpl.java:43)
        at java.lang.reflect.Method.invoke(Method.java:606)
        at org.jboss.arquillian.core.impl.ObserverImpl.invoke(ObserverImpl.java:94)
        at org.jboss.arquillian.core.impl.EventContextImpl.proceed(EventContextImpl.java:88)
        at org.jboss.arquillian.test.impl.TestContextHandler.createClassContext(TestContextHandler.java:75)
        at sun.reflect.GeneratedMethodAccessor15.invoke(Unknown Source)
        at sun.reflect.DelegatingMethodAccessorImpl.invoke(DelegatingMethodAccessorImpl.java:43)
        at java.lang.reflect.Method.invoke(Method.java:606)
        at org.jboss.arquillian.core.impl.ObserverImpl.invoke(ObserverImpl.java:94)
        at org.jboss.arquillian.core.impl.EventContextImpl.proceed(EventContextImpl.java:88)
        at org.jboss.arquillian.test.impl.TestContextHandler.createSuiteContext(TestContextHandler.java:60)
        at sun.reflect.GeneratedMethodAccessor12.invoke(Unknown Source)
        at sun.reflect.DelegatingMethodAccessorImpl.invoke(DelegatingMethodAccessorImpl.java:43)
        at java.lang.reflect.Method.invoke(Method.java:606)
        at org.jboss.arquillian.core.impl.ObserverImpl.invoke(ObserverImpl.java:94)
        at org.jboss.arquillian.core.impl.EventContextImpl.proceed(EventContextImpl.java:88)
        at org.jboss.arquillian.cor ...
    org.jboss.arquillian.container.spi.client.container.DeploymentException: Cannot deploy: StatefulTimeoutTestCase.jar
    org.jboss.arquillian.container.spi.client.container.DeploymentException: Cannot deploy: StatefulTimeoutTestCase.jar
        at org.jboss.as.arquillian.container.ArchiveDeployer.deployInternal(ArchiveDeployer.java:83)
        at org.jboss.as.arquillian.container.ArchiveDeployer.deployInternal(ArchiveDeployer.java:64)
        at org.jboss.as.arquillian.container.ArchiveDeployer.deploy(ArchiveDeployer.java:46)
        at org.jboss.as.arquillian.container.CommonDeployableContainer.deploy(CommonDeployableContainer.java:146)
        at org.jboss.arquillian.container.impl.client.container.ContainerDeployController$3.call(ContainerDeployController.java:161)
        at org.jboss.arquillian.container.impl.client.container.ContainerDeployController$3.call(ContainerDeployController.java:128)
        at org.jboss.arquillian.container.impl.client.container.ContainerDeployController.executeOperation(ContainerDeployController.java:271)
        at org.jboss.arquillian.container.impl.client.container.ContainerDeployController.deploy(ContainerDeployController.java:127)
        at sun.reflect.GeneratedMethodAccessor8.invoke(Unknown Source)
        at sun.reflect.DelegatingMethodAccessorImpl.invoke(DelegatingMethodAccessorImpl.java:43)
        at java.lang.reflect.Method.invoke(Method.java:606)
        at org.jboss.arquillian.core.impl.ObserverImpl.invoke(ObserverImpl.java:94)
        at org.jboss.arquillian.core.impl.EventContextImpl.invokeObservers(EventContextImpl.java:99)
        at org.jboss.arquillian.core.impl.EventContextImpl.proceed(EventContextImpl.java:81)
        at org.jboss.arquillian.container.impl.client.container.DeploymentExceptionHandler.verifyExpectedExceptionDuringDeploy(DeploymentExceptionHandler.java:50)
        at sun.reflect.GeneratedMethodAccessor7.invoke(Unknown Source)
        at sun.reflect.DelegatingMethodAccessorImpl.invoke(DelegatingMethodAccessorImpl.java:43)
        at java.lang.reflect.Method.invoke(Method.java:606)
        at org.jboss.arquillian.core.impl.ObserverImpl.invoke(ObserverImpl.java:94)
        at org.jboss.arquillian.core.impl.EventContextImpl.proceed(EventContextImpl.java:88)
        at org.jboss.arquillian.container.impl.client.ContainerDeploymentContextHandler.createDeploymentContext(ContainerDeploymentContextHandler.java:78)
        at sun.reflect.GeneratedMethodAccessor5.invoke(Unknown Source)
        at sun.reflect.DelegatingMethodAccessorImpl.invoke(DelegatingMethodAccessorImpl.java:43)
        at java.lang.reflect.Method.invoke(Method.java:606)
        at org.jboss.arquillian.core.impl.ObserverImpl.invoke(ObserverImpl.java:94)
        at org.jboss.arquillian.core.impl.EventContextImpl.proceed(EventContextImpl.java:88)
        at org.jboss.arquillian.container.impl.client.ContainerDeploymentContextHandler.createContainerContext(ContainerDeploymentContextHandler.java:57)
        at sun.reflect.GeneratedMethodAccessor1.invoke(Unknown Source)
        at sun.reflect.DelegatingMethodAccessorImpl.invoke(DelegatingMethodAccessorImpl.java:43)
        at java.lang.reflect.Method.invoke(Method.java:606)
        at org.jboss.arquillian.core.impl.ObserverImpl.invoke(ObserverImpl.java:94)
        at org.jboss.arquillian.core.impl.EventContextImpl.proceed(EventContextImpl.java:88)
        at org.jboss.arquillian.core.impl.ManagerImpl.fire(ManagerImpl.java:135)
        at org.jboss.arquillian.core.impl.ManagerImpl.fire(ManagerImpl.java:115)
        at org.jboss.arquillian.core.impl.EventImpl.fire(EventImpl.java:67)
        at org.jboss.arquillian.container.test.impl.client.deployment.ClientDeployer.deploy(ClientDeployer.java:93)
        at org.jboss.as.test.clustering.NodeUtil.deploy(NodeUtil.java:41)
        at org.jboss.as.test.clustering.cluster.ClusterAbstractTestCase.deploy(ClusterAbstractTestCase.java:104)
        at org.jboss.as.test.clustering.cluster.ejb3.StatefulTimeoutTestCase.setup(StatefulTimeoutTestCase.java:101)
        at sun.reflect.NativeMethodAccessorImpl.invoke0(Native Method)
        at sun.reflect.NativeMethodAccessorImpl.invoke(NativeMethodAccessorImpl.java:57)
        at sun.reflect.DelegatingMethodAccessorImpl.invoke(DelegatingMethodAccessorImpl.java:43)
        at java.lang.reflect.Method.invoke(Method.java:606)
        at org.junit.runners.model.FrameworkMethod$1.runReflectiveCall(Fr ...
    

    Failed tests

    
    org.jboss.as.test.integration.ejb.timerservice.schedule.SimpleScheduleSecondTestCase.testScheduleMethodTimeout: java.lang.AssertionError
        at org.junit.Assert.fail(Assert.java:86)
        at org.junit.Assert.assertTrue(Assert.java:41)
    
    
    点赞 评论 复制链接分享
  • weixin_39680609 weixin_39680609 4月前

    Build 742 is now running using a merge of 119ba060437f7ff6925f4c9a5e9932abfdd6ff2a

    点赞 评论 复制链接分享
  • weixin_39680609 weixin_39680609 4月前

    Build 742 outcome was FAILURE using a merge of 119ba060437f7ff6925f4c9a5e9932abfdd6ff2a Summary: Execution timeout (new); tests failed: 2 (2 new), passed: 4648, ignored: 86; org.wildfly:wildfly-testsuite-integration-domain Build time: 2:30:13

    Build problems:

    Failed tests detected Execution timeout Process exited with code 137

    
    java.lang.reflect.UndeclaredThrowableException
    java.lang.reflect.UndeclaredThrowableException
        at com.sun.proxy.$Proxy23.runTestMethod(Unknown Source)
        at org.jboss.arquillian.protocol.jmx.JMXMethodExecutor.invoke(JMXMethodExecutor.java:71)
        at org.jboss.arquillian.container.test.impl.execution.RemoteTestExecuter.execute(RemoteTestExecuter.java:120)
        at sun.reflect.GeneratedMethodAccessor15.invoke(Unknown Source)
        at sun.reflect.DelegatingMethodAccessorImpl.invoke(DelegatingMethodAccessorImpl.java:43)
        at java.lang.reflect.Method.invoke(Method.java:606)
        at org.jboss.arquillian.core.impl.ObserverImpl.invoke(ObserverImpl.java:94)
        at org.jboss.arquillian.core.impl.EventContextImpl.invokeObservers(EventContextImpl.java:99)
        at org.jboss.arquillian.core.impl.EventContextImpl.proceed(EventContextImpl.java:81)
        at org.jboss.arquillian.core.impl.ManagerImpl.fire(ManagerImpl.java:135)
        at org.jboss.arquillian.core.impl.ManagerImpl.fire(ManagerImpl.java:115)
        at org.jboss.arquillian.core.impl.EventImpl.fire(EventImpl.java:67)
        at org.jboss.arquillian.container.test.impl.execution.ClientTestExecuter.execute(ClientTestExecuter.java:57)
        at sun.reflect.GeneratedMethodAccessor11.invoke(Unknown Source)
        at sun.reflect.DelegatingMethodAccessorImpl.invoke(DelegatingMethodAccessorImpl.java:43)
        at java.lang.reflect.Method.invoke(Method.java:606)
        at org.jboss.arquillian.core.impl.ObserverImpl.invoke(ObserverImpl.java:94)
        at org.jboss.arquillian.core.impl.EventContextImpl.invokeObservers(EventContextImpl.java:99)
        at org.jboss.arquillian.core.impl.EventContextImpl.proceed(EventContextImpl.java:81)
        at org.jboss.arquillian.container.test.impl.client.ContainerEventController.createContext(ContainerEventController.java:142)
        at org.jboss.arquillian.container.test.impl.client.ContainerEventController.createTestContext(ContainerEventController.java:129)
        at sun.reflect.GeneratedMethodAccessor10.invoke(Unknown Source)
        at sun.reflect.DelegatingMethodAccessorImpl.invoke(DelegatingMethodAccessorImpl.java:43)
        at java.lang.reflect.Method.invoke(Method.java:606)
        at org.jboss.arquillian.core.impl.ObserverImpl.invoke(ObserverImpl.java:94)
        at org.jboss.arquillian.core.impl.EventContextImpl.proceed(EventContextImpl.java:88)
        at org.jboss.arquillian.test.impl.TestContextHandler.createTestContext(TestContextHandler.java:89)
        at sun.reflect.GeneratedMethodAccessor3.invoke(Unknown Source)
        at sun.reflect.DelegatingMethodAccessorImpl.invoke(DelegatingMethodAccessorImpl.java:43)
        at java.lang.reflect.Method.invoke(Method.java:606)
        at org.jboss.arquillian.core.impl.ObserverImpl.invoke(ObserverImpl.java:94)
        at org.jboss.arquillian.core.impl.EventContextImpl.proceed(EventContextImpl.java:88)
        at org.jboss.arquillian.test.impl.TestContextHandler.createClassContext(TestContextHandler.java:75)
        at sun.reflect.GeneratedMethodAccessor2.invoke(Unknown Source)
        at sun.reflect.DelegatingMethodAccessorImpl.invoke(DelegatingMethodAccessorImpl.java:43)
        at java.lang.reflect.Method.invoke(Method.java:606)
        at org.jboss.arquillian.core.impl.ObserverImpl.invoke(ObserverImpl.java:94)
        at org.jboss.arquillian.core.impl.EventContextImpl.proceed(EventContextImpl.java:88)
        at org.jboss.arquillian.test.impl.TestContextHandler.createSuiteContext(TestContextHandler.java:60)
        at sun.reflect.GeneratedMethodAccessor1.invoke(Unknown Source)
        at sun.reflect.DelegatingMethodAccessorImpl.invoke(DelegatingMethodAccessorImpl.java:43)
        at java.lang.reflect.Method.invoke(Method.java:606)
        at org.jboss.arquillian.core.impl.ObserverImpl.invoke(ObserverImpl.java:94)
        at org.jboss.arquillian.core.impl.EventContextImpl.proceed(EventContextImpl.java:88)
        at org.jboss.arquillian.core.impl.ManagerImpl.fire(ManagerImpl.java:135)
        at org.jboss.arquillian.test.impl.EventTestRunnerAdaptor.test(EventTestRunnerAdaptor.java:111)
        at org.jboss.arquillian.junit.Arquillian$6.evaluate(Arquillian.java:263)
        at org.jboss.arquillian.junit.Arquillian$4.evaluate(Arquillian.java:226)
        at org.jboss.arquillian.junit.Arquillian.multiExecute(Arquillian.java:314)
        at o ...
    java.util.concurrent.TimeoutException
    java.util.concurrent.TimeoutException
        at java.util.concurrent.FutureTask$Sync.innerGet(FutureTask.java:258)
        at java.util.concurrent.FutureTask.get(FutureTask.java:119)
        at org.jboss.as.test.integration.common.HttpRequest.execute(HttpRequest.java:50)
        at org.jboss.as.test.integration.common.HttpRequest.get(HttpRequest.java:137)
        at org.jboss.as.test.integration.ejb.security.AuthenticationTestCase.testICIR_ViaServlet(AuthenticationTestCase.java:318)
        at sun.reflect.NativeMethodAccessorImpl.invoke0(Native Method)
        at sun.reflect.NativeMethodAccessorImpl.invoke(NativeMethodAccessorImpl.java:57)
        at sun.reflect.DelegatingMethodAccessorImpl.invoke(DelegatingMethodAccessorImpl.java:43)
        at java.lang.reflect.Method.invoke(Method.java:606)
        at org.junit.runners.model.FrameworkMethod$1.runReflectiveCall(FrameworkMethod.java:47)
        at org.junit.internal.runners.model.ReflectiveCallable.run(ReflectiveCallable.java:12)
        at org.junit.runners.model.FrameworkMethod.invokeExplosively(FrameworkMethod.java:44)
        at org.jboss.arquillian.junit.Arquillian$6$1.invoke(Arquillian.java:270)
        at org.jboss.arquillian.container.test.impl.execution.LocalTestExecuter.execute(LocalTestExecuter.java:60)
        at sun.reflect.GeneratedMethodAccessor46.invoke(Unknown Source)
        at sun.reflect.DelegatingMethodAccessorImpl.invoke(DelegatingMethodAccessorImpl.java:43)
        at java.lang.reflect.Method.invoke(Method.java:606)
        at org.jboss.arquillian.core.impl.ObserverImpl.invoke(ObserverImpl.java:94)
        at org.jboss.arquillian.core.impl.EventContextImpl.invokeObservers(EventContextImpl.java:99)
        at org.jboss.arquillian.core.impl.EventContextImpl.proceed(EventContextImpl.java:81)
        at org.jboss.arquillian.core.impl.ManagerImpl.fire(ManagerImpl.java:135)
        at org.jboss.arquillian.core.impl.ManagerImpl.fire(ManagerImpl.java:115)
        at org.jboss.arquillian.core.impl.EventImpl.fire(EventImpl.java:67)
        at org.jboss.arquillian.container.test.impl.execution.ContainerTestExecuter.execute(ContainerTestExecuter.java:38)
        at sun.reflect.GeneratedMethodAccessor45.invoke(Unknown Source)
        at sun.reflect.DelegatingMethodAccessorImpl.invoke(DelegatingMethodAccessorImpl.java:43)
        at java.lang.reflect.Method.invoke(Method.java:606)
        at org.jboss.arquillian.core.impl.ObserverImpl.invoke(ObserverImpl.java:94)
        at org.jboss.arquillian.core.impl.EventContextImpl.invokeObservers(EventContextImpl.java:99)
        at org.jboss.arquillian.core.impl.EventContextImpl.proceed(EventContextImpl.java:81)
        at org.jboss.arquillian.test.impl.TestContextHandler.createTestContext(TestContextHandler.java:89)
        at sun.reflect.GeneratedMethodAccessor22.invoke(Unknown Source)
        at sun.reflect.DelegatingMethodAccessorImpl.invoke(DelegatingMethodAccessorImpl.java:43)
        at java.lang.reflect.Method.invoke(Method.java:606)
        at org.jboss.arquillian.core.impl.ObserverImpl.invoke(ObserverImpl.java:94)
        at org.jboss.arquillian.core.impl.EventContextImpl.proceed(EventContextImpl.java:88)
        at org.jboss.arquillian.test.impl.TestContextHandler.createClassContext(TestContextHandler.java:75)
        at sun.reflect.GeneratedMethodAccessor18.invoke(Unknown Source)
        at sun.reflect.DelegatingMethodAccessorImpl.invoke(DelegatingMethodAccessorImpl.java:43)
        at java.lang.reflect.Method.invoke(Method.java:606)
        at org.jboss.arquillian.core.impl.ObserverImpl.invoke(ObserverImpl.java:94)
        at org.jboss.arquillian.core.impl.EventContextImpl.proceed(EventContextImpl.java:88)
        at org.jboss.arquillian.test.impl.TestContextHandler.createSuiteContext(TestContextHandler.java:60)
        at sun.reflect.GeneratedMethodAccessor15.invoke(Unknown Source)
        at sun.reflect.DelegatingMethodAccessorImpl.invoke(DelegatingMethodAccessorImpl.java:43)
        at java.lang.reflect.Method.invoke(Method.java:606)
        at org.jboss.arquillian.core.impl.ObserverImpl.invoke(ObserverImpl.java:94)
        at org.jboss.arquillian.core.impl.EventContextImpl.proceed(EventContextImpl.java:88)
        at org.jboss.arquillian.core.impl.ManagerImpl.fire(ManagerImpl.java:135)
        at org.jboss.arquillian.test.impl.EventTestRunnerAdaptor.t ...
    The build WildFly::Pull request #742 {builId=3240} has been running for more than 150 minutes. Terminating...
    

    Failed tests

    
    org.jboss.as.test.integration.ejb.security.AuthenticationTestCase.testAuthentication_ViaServlet: java.lang.reflect.UndeclaredThrowableException
        at com.sun.proxy.$Proxy23.runTestMethod(Unknown Source)
        at org.jboss.arquillian.protocol.jmx.JMXMethodExecutor.invoke(JMXMethodExecutor.java:71)
    
    org.jboss.as.test.integration.ejb.security.AuthenticationTestCase.testICIR_ViaServlet: java.util.concurrent.TimeoutException
        at java.util.concurrent.FutureTask$Sync.innerGet(FutureTask.java:258)
        at java.util.concurrent.FutureTask.get(FutureTask.java:119)
    
    
    点赞 评论 复制链接分享
  • weixin_39842937 weixin_39842937 4月前

    Merged.

    点赞 评论 复制链接分享
  • weixin_39680609 weixin_39680609 4月前

    Build 498 is now running using a merge of cf9da278618b4c1a1e77f87206981ca089033037

    点赞 评论 复制链接分享
  • weixin_39680609 weixin_39680609 4月前

    Build 498 outcome was FAILURE using a merge of cf9da278618b4c1a1e77f87206981ca089033037 Summary: Tests failed: 1 (1 new), passed: 4742, ignored: 88 Build time: 1:30:40

    Build problems:

    Failed tests detected

    
    java.lang.AssertionError: 0
    java.lang.AssertionError: 0
        at org.junit.Assert.fail(Assert.java:88)
        at org.junit.Assert.assertTrue(Assert.java:41)
        at org.jboss.as.test.clustering.cluster.ejb3.stateless.RemoteStatelessFailoverTestCase.testFailoverOnUndeploy(RemoteStatelessFailoverTestCase.java:160)
        at sun.reflect.NativeMethodAccessorImpl.invoke0(Native Method)
        at sun.reflect.NativeMethodAccessorImpl.invoke(NativeMethodAccessorImpl.java:57)
        at sun.reflect.DelegatingMethodAccessorImpl.invoke(DelegatingMethodAccessorImpl.java:43)
        at java.lang.reflect.Method.invoke(Method.java:606)
        at org.junit.runners.model.FrameworkMethod$1.runReflectiveCall(FrameworkMethod.java:47)
        at org.junit.internal.runners.model.ReflectiveCallable.run(ReflectiveCallable.java:12)
        at org.junit.runners.model.FrameworkMethod.invokeExplosively(FrameworkMethod.java:44)
        at org.jboss.arquillian.junit.Arquillian$6$1.invoke(Arquillian.java:270)
        at org.jboss.arquillian.container.test.impl.execution.LocalTestExecuter.execute(LocalTestExecuter.java:60)
        at sun.reflect.GeneratedMethodAccessor20.invoke(Unknown Source)
        at sun.reflect.DelegatingMethodAccessorImpl.invoke(DelegatingMethodAccessorImpl.java:43)
        at java.lang.reflect.Method.invoke(Method.java:606)
        at org.jboss.arquillian.core.impl.ObserverImpl.invoke(ObserverImpl.java:94)
        at org.jboss.arquillian.core.impl.EventContextImpl.invokeObservers(EventContextImpl.java:99)
        at org.jboss.arquillian.core.impl.EventContextImpl.proceed(EventContextImpl.java:81)
        at org.jboss.arquillian.core.impl.ManagerImpl.fire(ManagerImpl.java:135)
        at org.jboss.arquillian.core.impl.ManagerImpl.fire(ManagerImpl.java:115)
        at org.jboss.arquillian.core.impl.EventImpl.fire(EventImpl.java:67)
        at org.jboss.arquillian.container.test.impl.execution.ClientTestExecuter.execute(ClientTestExecuter.java:53)
        at sun.reflect.GeneratedMethodAccessor19.invoke(Unknown Source)
        at sun.reflect.DelegatingMethodAccessorImpl.invoke(DelegatingMethodAccessorImpl.java:43)
        at java.lang.reflect.Method.invoke(Method.java:606)
        at org.jboss.arquillian.core.impl.ObserverImpl.invoke(ObserverImpl.java:94)
        at org.jboss.arquillian.core.impl.EventContextImpl.invokeObservers(EventContextImpl.java:99)
        at org.jboss.arquillian.core.impl.EventContextImpl.proceed(EventContextImpl.java:81)
        at org.jboss.arquillian.container.test.impl.client.ContainerEventController.createContext(ContainerEventController.java:142)
        at org.jboss.arquillian.container.test.impl.client.ContainerEventController.createTestContext(ContainerEventController.java:129)
        at sun.reflect.GeneratedMethodAccessor18.invoke(Unknown Source)
        at sun.reflect.DelegatingMethodAccessorImpl.invoke(DelegatingMethodAccessorImpl.java:43)
        at java.lang.reflect.Method.invoke(Method.java:606)
        at org.jboss.arquillian.core.impl.ObserverImpl.invoke(ObserverImpl.java:94)
        at org.jboss.arquillian.core.impl.EventContextImpl.proceed(EventContextImpl.java:88)
        at org.jboss.arquillian.test.impl.TestContextHandler.createTestContext(TestContextHandler.java:89)
        at sun.reflect.GeneratedMethodAccessor6.invoke(Unknown Source)
        at sun.reflect.DelegatingMethodAccessorImpl.invoke(DelegatingMethodAccessorImpl.java:43)
        at java.lang.reflect.Method.invoke(Method.java:606)
        at org.jboss.arquillian.core.impl.ObserverImpl.invoke(ObserverImpl.java:94)
        at org.jboss.arquillian.core.impl.EventContextImpl.proceed(EventContextImpl.java:88)
        at org.jboss.arquillian.test.impl.TestContextHandler.createClassContext(TestContextHandler.java:75)
        at sun.reflect.GeneratedMethodAccessor3.invoke(Unknown Source)
        at sun.reflect.DelegatingMethodAccessorImpl.invoke(DelegatingMethodAccessorImpl.java:43)
        at java.lang.reflect.Method.invoke(Method.java:606)
        at org.jboss.arquillian.core.impl.ObserverImpl.invoke(ObserverImpl.java:94)
        at org.jboss.arquillian.core.impl.EventContextImpl.proceed(EventContextImpl.java:88)
        at org.jboss.arquillian.test.impl.TestContextHandler.createSuiteContext(TestContextHandler.java:60)
        at sun.reflect.GeneratedMethodAccessor2.invoke(Unknown Source)
        at  ...
    

    Failed tests

    
    org.jboss.as.test.clustering.cluster.ejb3.stateless.RemoteStatelessFailoverTestCase(SYNC-tcp).testFailoverOnUndeploy: java.lang.AssertionError: 0
        at org.junit.Assert.fail(Assert.java:88)
        at org.junit.Assert.assertTrue(Assert.java:41)
    
    
    点赞 评论 复制链接分享
  • weixin_39710561 weixin_39710561 4月前

    Doesn't seem related. please retest

    点赞 评论 复制链接分享
  • weixin_39890708 weixin_39890708 4月前

    retest this please

    点赞 评论 复制链接分享
  • weixin_39680609 weixin_39680609 4月前

    Build 505 is now running using a merge of cf9da278618b4c1a1e77f87206981ca089033037

    点赞 评论 复制链接分享
  • weixin_39680609 weixin_39680609 4月前

    Build 505 outcome was SUCCESS using a merge of cf9da278618b4c1a1e77f87206981ca089033037 Summary: Tests passed: 4743, ignored: 88 Build time: 1:29:47

    点赞 评论 复制链接分享
  • weixin_39680609 weixin_39680609 4月前

    Build 528 is now running using a merge of 8e388d0ce59417d8ec1d97359be4c48e0412df6d

    点赞 评论 复制链接分享
  • weixin_39680609 weixin_39680609 4月前

    Build 528 outcome was FAILURE using a merge of 8e388d0ce59417d8ec1d97359be4c48e0412df6d Summary: Tests failed: 1 (1 new), passed: 4780, ignored: 88 Build time: 1:30:59

    Build problems:

    Failed tests detected

    
    java.lang.AssertionError
    java.lang.AssertionError
        at org.junit.Assert.fail(Assert.java:86)
        at org.junit.Assert.assertTrue(Assert.java:41)
        at org.junit.Assert.assertTrue(Assert.java:52)
        at org.jboss.as.test.integration.ejb.timerservice.schedule.SimpleScheduleSecondTestCase.testScheduleMethodTimeout(SimpleScheduleSecondTestCase.java:58)
        at sun.reflect.NativeMethodAccessorImpl.invoke0(Native Method)
        at sun.reflect.NativeMethodAccessorImpl.invoke(NativeMethodAccessorImpl.java:57)
        at sun.reflect.DelegatingMethodAccessorImpl.invoke(DelegatingMethodAccessorImpl.java:43)
        at java.lang.reflect.Method.invoke(Method.java:606)
        at org.junit.runners.model.FrameworkMethod$1.runReflectiveCall(FrameworkMethod.java:47)
        at org.junit.internal.runners.model.ReflectiveCallable.run(ReflectiveCallable.java:12)
        at org.junit.runners.model.FrameworkMethod.invokeExplosively(FrameworkMethod.java:44)
        at org.jboss.arquillian.junit.Arquillian$6$1.invoke(Arquillian.java:270)
        at org.jboss.arquillian.container.test.impl.execution.LocalTestExecuter.execute(LocalTestExecuter.java:60)
        at sun.reflect.NativeMethodAccessorImpl.invoke0(Native Method)
        at sun.reflect.NativeMethodAccessorImpl.invoke(NativeMethodAccessorImpl.java:57)
        at sun.reflect.DelegatingMethodAccessorImpl.invoke(DelegatingMethodAccessorImpl.java:43)
        at java.lang.reflect.Method.invoke(Method.java:606)
        at org.jboss.arquillian.core.impl.ObserverImpl.invoke(ObserverImpl.java:94)
        at org.jboss.arquillian.core.impl.EventContextImpl.invokeObservers(EventContextImpl.java:99)
        at org.jboss.arquillian.core.impl.EventContextImpl.proceed(EventContextImpl.java:81)
        at org.jboss.arquillian.core.impl.ManagerImpl.fire(ManagerImpl.java:135)
        at org.jboss.arquillian.core.impl.ManagerImpl.fire(ManagerImpl.java:115)
        at org.jboss.arquillian.core.impl.EventImpl.fire(EventImpl.java:67)
        at org.jboss.arquillian.container.test.impl.execution.ContainerTestExecuter.execute(ContainerTestExecuter.java:38)
        at sun.reflect.NativeMethodAccessorImpl.invoke0(Native Method)
        at sun.reflect.NativeMethodAccessorImpl.invoke(NativeMethodAccessorImpl.java:57)
        at sun.reflect.DelegatingMethodAccessorImpl.invoke(DelegatingMethodAccessorImpl.java:43)
        at java.lang.reflect.Method.invoke(Method.java:606)
        at org.jboss.arquillian.core.impl.ObserverImpl.invoke(ObserverImpl.java:94)
        at org.jboss.arquillian.core.impl.EventContextImpl.invokeObservers(EventContextImpl.java:99)
        at org.jboss.arquillian.core.impl.EventContextImpl.proceed(EventContextImpl.java:81)
        at org.jboss.arquillian.test.impl.TestContextHandler.createTestContext(TestContextHandler.java:89)
        at sun.reflect.NativeMethodAccessorImpl.invoke0(Native Method)
        at sun.reflect.NativeMethodAccessorImpl.invoke(NativeMethodAccessorImpl.java:57)
        at sun.reflect.DelegatingMethodAccessorImpl.invoke(DelegatingMethodAccessorImpl.java:43)
        at java.lang.reflect.Method.invoke(Method.java:606)
        at org.jboss.arquillian.core.impl.ObserverImpl.invoke(ObserverImpl.java:94)
        at org.jboss.arquillian.core.impl.EventContextImpl.proceed(EventContextImpl.java:88)
        at org.jboss.arquillian.test.impl.TestContextHandler.createClassContext(TestContextHandler.java:75)
        at sun.reflect.GeneratedMethodAccessor13.invoke(Unknown Source)
        at sun.reflect.DelegatingMethodAccessorImpl.invoke(DelegatingMethodAccessorImpl.java:43)
        at java.lang.reflect.Method.invoke(Method.java:606)
        at org.jboss.arquillian.core.impl.ObserverImpl.invoke(ObserverImpl.java:94)
        at org.jboss.arquillian.core.impl.EventContextImpl.proceed(EventContextImpl.java:88)
        at org.jboss.arquillian.test.impl.TestContextHandler.createSuiteContext(TestContextHandler.java:60)
        at sun.reflect.GeneratedMethodAccessor12.invoke(Unknown Source)
        at sun.reflect.DelegatingMethodAccessorImpl.invoke(DelegatingMethodAccessorImpl.java:43)
        at java.lang.reflect.Method.invoke(Method.java:606)
        at org.jboss.arquillian.core.impl.ObserverImpl.invoke(ObserverImpl.java:94)
        at org.jboss.arquillian.core.impl.EventContextImpl.proceed(EventContextImpl.java:88)
        at org.jboss.arquillian.cor ...
    

    Failed tests

    
    org.jboss.as.test.integration.ejb.timerservice.schedule.SimpleScheduleSecondTestCase.testScheduleMethodTimeout: java.lang.AssertionError
        at org.junit.Assert.fail(Assert.java:86)
        at org.junit.Assert.assertTrue(Assert.java:41)
    
    
    点赞 评论 复制链接分享
  • weixin_39957647 weixin_39957647 4月前

    retest this please

    点赞 评论 复制链接分享
  • weixin_39680609 weixin_39680609 4月前

    Build 539 is now running using a merge of 8e388d0ce59417d8ec1d97359be4c48e0412df6d

    点赞 评论 复制链接分享
  • weixin_39680609 weixin_39680609 4月前

    Build 539 outcome was SUCCESS using a merge of 8e388d0ce59417d8ec1d97359be4c48e0412df6d Summary: Tests passed: 4780, ignored: 88, muted: 1 Build time: 1:31:26

    点赞 评论 复制链接分享
  • weixin_39842937 weixin_39842937 4月前

    Jason, is this OK? An EAP 6.2 PR is blocking on this.

    点赞 评论 复制链接分享
  • weixin_39957647 weixin_39957647 4月前

    Yeah it's fine. I'll put it in the next set.

    点赞 评论 复制链接分享

相关推荐