VS2013 build命令提示符不好使,菜鸟问菜鸟问题 10C

VS2013 build命令提示符不好使。
VS2013 x64 兼容工具命令提示或者本机工具命令提示里,用build命令编译,提示不是内部或者外部命令,也不是可执行程序。
怎么办?
代码里有makefile和makefile.inc文件。
我是个菜鸟,请问用命令提示符怎么 编译?谢谢

7个回答

build 是 WIN DDK 里面带的 ,原来在 win ddk 7600 中有,现在新的WDK 中已经被微软取消了。驱动程序也可以用vs2013 编写了。
可以用 NMake 编译
或者实验一下msbuild,这个我还没用过。

编译出来的错误详细信息是什么。。。。

用build命令编译,提示build不是内部或者外部命令,也不是可执行程序。

给个图片,让我知道错误信息

图片说明

我就是想编译ddk中的例子,但是例子里面提示 用 build 命令提示符编译,我执行build命令,就是这样的。
哪位大侠指点迷津

已经安装了vs2013

Csdn user default icon
上传中...
上传图片
插入图片
抄袭、复制答案,以达到刷声望分或其他目的的行为,在CSDN问答是严格禁止的,一经发现立刻封号。是时候展现真正的技术了!
其他相关推荐
VS2013安装错误 build tool 安装时发生严重错误

VS2013安装错误 build tool 安装时发生严重错误![](file\\C:\Users\Administrator\Desktop\QQ截图20141215020945.png)

angular项目执行构建命令 ng build花费时间问题

# angular项目执行构建命令 ng build花费时间问题,有时候2分多钟,有时候要10多分钟,求解? # 执行的时同样的命令 ``` ng build --prod -e=prod --build-optimizer --extract-licenses=false ``` ![这次花费了10多分钟](https://img-ask.csdn.net/upload/201803/13/1520907803_763761.png) ![比上面的少了一位数](https://img-ask.csdn.net/upload/201803/13/1520907890_630096.png)

『求助』poco C++在VS2013怎么配置

下载好了poco 1.6.1版本的源代码 按照网上的教程用VS命令提示符执行buildwin 120 命令。 提示如下错误: ``` '"vsvars32.bat' 不是内部或外部命令,也不是可运行的程序 或批处理文件。 Error: No Visual C++ environment found. Please run this script from a Visual Studio Command Prompt or run "%VSnnCOMNTOOLS%\vsvars32.bat" first. ``` "vsvars32.bat这里提示多了个引号,于是我打开目录下的build_vs_120.cmd,里面居然有句call "%VS120COMNTOOLS%vsvars32.bat 确实是少了引号(不过这是源码则嗯么可能有问题。。。) 我试着多加个引号 还是报错 ``` '"vsvars32.bat"' 不是内部或外部命令,也不是可运行的程序 或批处理文件。 Error: No Visual C++ environment found. Please run this script from a Visual Studio Command Prompt or run "%VSnnCOMNTOOLS%\vsvars32.bat" first. ``` 搞了一个晚上还是没解决 求助!!!!!!!!!!!!!!!!!

如何使用VS2013编译apm_planner源代码?

如何使用VS2013编译apm_planner源代码?,使用qt5.5.1,vs2013,c++编译器编译 两个月之前,网上很多资料,不知道现在怎么了,没有资料了,真愁人, 好像在cmd下,用qmake,就能生成vs2013的项目文件,关键是我命令参数忘记了

'ndk-build' 不是内部或外部命令,也不是可运行的程序 或批处理文件。

进行Android ndk开发,在terminal中执行ndk-build命令一直提示 “不是内部或外部命令,也不是可运行的程序 或批处理文件“,是什么原因?(确实已经将路径添加到环境变量path中了)

opencv3.0.0生成成功 但是vs2013intellisense报100个错误

opencv3.0.0生成成功,测试图片运行时也能正常显示,但是vs2013环境下intellisense会提示100个莫名其妙的错误,如果新建新项目同样是会报100个与下列错误一样的错误,同样可以生成成功,也可以运行,到底是什么原因呢?**** 编程环境为win7 64位专业版+opencv3.0.0+visual studio2013 Intellisense100个错误如下所示:**** opencv3.0.0生成成功,测试图片运行时也能正常显示,但是vs2013环境下intellisense会提示100个莫名其妙的错误,如果新建新项目同样是会报100个与下列错误一样的错误,同样可以生成成功,也可以运行,到底是什么原因呢?**** 编程环境为win7 64位专业版+opencv3.0.0+visual studio2013 Intellisense100个错误如下所示:**** 16 IntelliSense: “operator=”必须是成员函数 c:\Program Files (x86)\Microsoft Visual Studio 12.0\VC\include\sstream 72 8 Project1 59 IntelliSense: “operator=”必须是成员函数 c:\Program Files (x86)\Microsoft Visual Studio 12.0\VC\include\sstream 440 8 Project1 71 IntelliSense: “operator=”必须是成员函数 c:\Program Files (x86)\Microsoft Visual Studio 12.0\VC\include\sstream 533 8 Project1 83 IntelliSense: “operator=”必须是成员函数 c:\Program Files (x86)\Microsoft Visual Studio 12.0\VC\include\sstream 632 8 Project1 2 IntelliSense: Ptr 不是模板 f:\opencv\build\include\opencv2\core\operations.hpp 371 1 Project1 6 IntelliSense: 不允许使用类型名 f:\opencv\build\include\opencv2\core\operations.hpp 377 15 Project1 29 IntelliSense: 此声明没有存储类或类型说明符 c:\Program Files (x86)\Microsoft Visual Studio 12.0\VC\include\sstream 149 4 Project1 37 IntelliSense: 此声明没有存储类或类型说明符 c:\Program Files (x86)\Microsoft Visual Studio 12.0\VC\include\sstream 182 4 Project1 96 IntelliSense: 此声明没有存储类或类型说明符 f:\opencv\build\include\opencv2\core\utility.hpp 889 35 Project1 97 IntelliSense: 此声明没有存储类或类型说明符 f:\opencv\build\include\opencv2\core\persistence.hpp 1195 42 Project1 24 IntelliSense: 非成员函数上不允许使用类型限定符 c:\Program Files (x86)\Microsoft Visual Studio 12.0\VC\include\sstream 92 15 Project1 64 IntelliSense: 非成员函数上不允许使用类型限定符 c:\Program Files (x86)\Microsoft Visual Studio 12.0\VC\include\sstream 446 17 Project1 66 IntelliSense: 非成员函数上不允许使用类型限定符 c:\Program Files (x86)\Microsoft Visual Studio 12.0\VC\include\sstream 451 15 Project1 76 IntelliSense: 非成员函数上不允许使用类型限定符 c:\Program Files (x86)\Microsoft Visual Studio 12.0\VC\include\sstream 539 17 Project1 78 IntelliSense: 非成员函数上不允许使用类型限定符 c:\Program Files (x86)\Microsoft Visual Studio 12.0\VC\include\sstream 544 15 Project1 88 IntelliSense: 非成员函数上不允许使用类型限定符 c:\Program Files (x86)\Microsoft Visual Studio 12.0\VC\include\sstream 638 17 Project1 90 IntelliSense: 非成员函数上不允许使用类型限定符 c:\Program Files (x86)\Microsoft Visual Studio 12.0\VC\include\sstream 643 15 Project1 20 IntelliSense: 后面有“::”的名称一定是类名或命名空间名 c:\Program Files (x86)\Microsoft Visual Studio 12.0\VC\include\sstream 88 19 Project1 21 IntelliSense: 后面有“::”的名称一定是类名或命名空间名 c:\Program Files (x86)\Microsoft Visual Studio 12.0\VC\include\sstream 89 19 Project1 22 IntelliSense: 后面有“::”的名称一定是类名或命名空间名 c:\Program Files (x86)\Microsoft Visual Studio 12.0\VC\include\sstream 90 19 Project1 34 IntelliSense: 后面有“::”的名称一定是类名或命名空间名 c:\Program Files (x86)\Microsoft Visual Studio 12.0\VC\include\sstream 152 21 Project1 39 IntelliSense: 后面有“::”的名称一定是类名或命名空间名 c:\Program Files (x86)\Microsoft Visual Studio 12.0\VC\include\sstream 184 5 Project1 41 IntelliSense: 后面有“::”的名称一定是类名或命名空间名 c:\Program Files (x86)\Microsoft Visual Studio 12.0\VC\include\sstream 184 23 Project1 53 IntelliSense: 后面有“::”的名称一定是类名或命名空间名 c:\Program Files (x86)\Microsoft Visual Studio 12.0\VC\include\sstream 353 22 Project1 4 IntelliSense: 仅函数声明中允许内联说明符 f:\opencv\build\include\opencv2\core\operations.hpp 376 8 Project1 18 IntelliSense: 类声明外部的说明符无效 c:\Program Files (x86)\Microsoft Visual Studio 12.0\VC\include\sstream 74 2 Project1 61 IntelliSense: 类声明外部的说明符无效 c:\Program Files (x86)\Microsoft Visual Studio 12.0\VC\include\sstream 442 2 Project1 73 IntelliSense: 类声明外部的说明符无效 c:\Program Files (x86)\Microsoft Visual Studio 12.0\VC\include\sstream 535 2 Project1 85 IntelliSense: 类声明外部的说明符无效 c:\Program Files (x86)\Microsoft Visual Studio 12.0\VC\include\sstream 634 2 Project1 95 IntelliSense: 全局范围没有 "_C_double_complex" c:\Program Files (x86)\Microsoft Visual Studio 12.0\VC\include\complex 44 15 Project1 32 IntelliSense: 未定义标识符 "_Al" c:\Program Files (x86)\Microsoft Visual Studio 12.0\VC\include\sstream 151 21 Project1 31 IntelliSense: 未定义标识符 "_Elem" c:\Program Files (x86)\Microsoft Visual Studio 12.0\VC\include\sstream 151 4 Project1 33 IntelliSense: 未定义标识符 "_Elem" c:\Program Files (x86)\Microsoft Visual Studio 12.0\VC\include\sstream 152 4 Project1

mvn命令错误提示,BUILD FAILURE

使用的是myeclipse2015 stable2,maven3.3.9,SDk1.7 现在在命令行下执行mvn -v 版本信息正确; 但是直接执行mvn就错误了,信息如下: C:\Users\dansan>mvn [INFO] Scanning for projects... [INFO] ------------------------------------------------------------------------ [INFO] BUILD FAILURE [INFO] ------------------------------------------------------------------------ [INFO] Total time: 0.121 s [INFO] Finished at: 2016-07-09T20:11:49+08:00 [INFO] Final Memory: 5M/152M [INFO] ------------------------------------------------------------------------ [ERROR] No goals have been specified for this build. You must specify a valid li fecycle phase or a goal in the format <plugin-prefix>:<goal> or <plugin-group-id >:<plugin-artifact-id>[:<plugin-version>]:<goal>. Available lifecycle phases are : validate, initialize, generate-sources, process-sources, generate-resources, p rocess-resources, compile, process-classes, generate-test-sources, process-test- sources, generate-test-resources, process-test-resources, test-compile, process- test-classes, test, prepare-package, package, pre-integration-test, integration- test, post-integration-test, verify, install, deploy, pre-clean, clean, post-cle an, pre-site, site, post-site, site-deploy. -> [Help 1] [ERROR] [ERROR] To see the full stack trace of the errors, re-run Maven with the -e swit ch. [ERROR] Re-run Maven using the -X switch to enable full debug logging. [ERROR] [ERROR] For more information about the errors and possible solutions, please rea d the following articles: [ERROR] [Help 1] http://cwiki.apache.org/confluence/display/MAVEN/NoGoalSpecifie dException 这个到底是什么问题,已经在网络上找了好多问题,都没有解决

VS2013生成时候报 error MSB3073?

RT,在使用vs2013重新生成一个在虚拟机上的项目时候,突然跳出这个报错,报错的半个小时前才正常生成过一次,期间也就加了一两条输出语句,并未对项目生成路径有过任何操作。 错误提示如下: 错误 2 error : Command-line action failed D:\project\newgame2\newgame2\VisualGDB newgame2 错误 3 error : Build has failed. See the Output window for more details. D:\project\newgame2\newgame2\EXEC newgame2 错误 4 error MSB3073: 命令“"C:\Program Files (x86)\Sysprogs\VisualGDB\\VisualGDB.exe" /rebuild "D:\project\newgame2\newgame2\newgame2.vcxproj" "/solution:D:\project\newgame2\newgame2.sln" "/config:Debug" "/platform:Win32" ”已退出,代码为 1。 C:\Program Files (x86)\MSBuild\Microsoft.Cpp\v4.0\V120\Microsoft.MakeFile.Targets 43 5 newgame2 输出如下: 1>C:\Program Files (x86)\MSBuild\Microsoft.Cpp\v4.0\V120\Microsoft.MakeFile.Targets(43,5): error MSB3073: 命令“"C:\Program Files (x86)\Sysprogs\VisualGDB\\VisualGDB.exe" /rebuild "D:\project\newgame2\newgame2\newgame2.vcxproj" "/solution:D:\project\newgame2\newgame2.sln" "/config:Debug" "/platform:Win32" 点击错误跳转到C:\Program Files (x86)\MSBuild\Microsoft.Cpp\v4.0\V120下的Microsoft.MakeFile.Targets文件中,截图如下: ![图片说明](https://img-ask.csdn.net/upload/201908/12/1565576576_268594.png) 麻烦遇到过同样问题并解决了的老哥、大神们指点一下,万分感谢

VS2013编译错误!!!!!!!!!!!!!!!!

1>------ 已启动生成: 项目: Project1, 配置: Debug Win32 ------ 1> TRACKER : 错误 TRK0002: 未能执行命令: “"D:\Program Files (x86)\Microsoft Visual Studio 12.0\VC\bin\CL.exe" @C:\Users\hp\AppData\Local\Temp\tmpeffdf93a59c84ba09104b2fe131a05ed.rsp”。存储控制块地址无效。 1> 1> 1>C:\Program Files (x86)\MSBuild\Microsoft.Cpp\v4.0\V120\Microsoft.CppCommon.targets(341,5): error MSB6006: “CL.exe”已退出,代码为 2。 ========== 生成: 成功 0 个,失败 1 个,最新 0 个,跳过 0 个 ==========

opencv3.1+win10+vs2013配置问题

新手一枚,配置了两天了,一直都没成功 直接上配置的图吧,一直都是提示无法打开opencv_world310d.dll ![图片说明](https://img-ask.csdn.net/upload/201608/25/1472114623_950772.png) ![图片说明](https://img-ask.csdn.net/upload/201608/25/1472114648_77517.png) ![图片说明](https://img-ask.csdn.net/upload/201608/25/1472114656_534691.png) 代码是这段 #include<opencv2/opencv.hpp> using namespace cv; int main() { Mat picture = imread("D://zhifubao.jpg"); imshow("测试程序", picture); waitKey(0); } 有人知道问题出在哪里么?

boost库安装时 failed to build boost.build engine

我用的VS2013,目前已经更新到Update5,安装的是1.64的boost库, 按照正常的方法来安装就出现了如图所示的问题,请问有熟悉的朋友知道该怎么做吗? ![图片说明](https://img-ask.csdn.net/upload/201706/04/1496545301_55420.png) ![图片说明](https://img-ask.csdn.net/upload/201706/04/1496545312_508776.png)

Maven help命令报错build failure

![图片说明](https://img-ask.csdn.net/upload/201811/12/1542021051_792846.png) mvn -v成功 镜像也换过了 代理也试过了 都无法解决该问题

在VS2013中配置opencv2.4.13时,出现如下错误怎么办?

求大神指导! ![图片说明](https://img-ask.csdn.net/upload/201709/12/1505186186_875492.png)

Android开发执行Build APK命令报错

在使用Android Studio进行开发时,引入了C++代码,使用CMake进行了配置,现在在执行Build APK命令时,报了标题的错 'neon_vector_type' attribute is not supported for this target,请问该如何解决

visual studio生成时出现build failed怎么解决

visual studio生成时出现build failed怎么解决

用vs2013编译之前用vc++6.0写的程序报错

用vs2013编译之前用vc++6.0写的程序 <VCMessage Code="MSB8021" Type="Error" Condition="'$(_MBCS_Using)' =='true'and'$(_MBCS_Installed)' !='true' and'$(DesignTimeBuild)' !='true'" /> 以上是报错代码 错误 1 error MSB8021: The value '{0}' of the variable '{1}' is incompatible with the value '{2}' of the variable '{3}'. C:\Program Files (x86)\MSBuild\Microsoft.Cpp\v4.0\V120\Microsoft.CppBuild.targets 369 5 GRMS 以上是编译错误

Spring build Path提示错误

<bean> <context:component-scan base-package="com.java.spring.aop.impl"> </context:component-scan> <!---添加下方,就报-> ** <aop:aspectj-autoproxy></aop:aspectj-autoproxy>** <bean> <!-报错提示-> Build path is incomplete. Cannot find class file for org/aspectj/weaver/reflect/ReflectionWorld$ReflectionWorldException

C语言 compile时没问题,build出问题了

我是新手,不知道哪里出问题了,如下图。求大神帮助![图片](https://img-ask.csdn.net/upload/201703/18/1489816137_341663.jpg)![图片](https://img-ask.csdn.net/upload/201703/18/1489816148_975194.jpg)

如何解决Unity打包Gradle build failed问题

问题: CommandInvokationFailure: Gradle build failed. F:/Program Files/Unity/2019.3.0b3/Editor/Data/PlaybackEngines/AndroidPlayer/Tools\OpenJDK\Windows\bin\java.exe -classpath "F:\Program Files\Unity\2019.3.0b3\Editor\Data\PlaybackEngines\AndroidPlayer\Tools\gradle\lib\gradle-launcher-5.1.1.jar" org.gradle.launcher.GradleMain "-Dorg.gradle.jvmargs=-Xmx4096m" "assembleRelease" FAILURE: Build failed with an exception. * What went wrong: Execution failed for task ':unityLibrary:packageReleaseResources'. > Could not resolve all files for configuration ':unityLibrary:_internal_aapt2_binary'. > Could not resolve com.android.tools.build:aapt2:3.4.0-5326820. Required by: project :unityLibrary > Could not resolve com.android.tools.build:aapt2:3.4.0-5326820. > Could not get resource 'https://dl.google.com/dl/android/maven2/com/android/tools/build/aapt2/3.4.0-5326820/aapt2-3.4.0-5326820.pom'. > Could not GET 'https://dl.google.com/dl/android/maven2/com/android/tools/build/aapt2/3.4.0-5326820/aapt2-3.4.0-5326820.pom'. > Connect to mirrors.opencas.ac.cn:80 [mirrors.opencas.ac.cn/124.16.75.211] failed: Connection timed out: connect > Could not resolve com.android.tools.build:aapt2:3.4.0-5326820. > Could not get resource 'https://jcenter.bintray.com/com/android/tools/build/aapt2/3.4.0-5326820/aapt2-3.4.0-5326820.pom'. > Could not GET 'https://jcenter.bintray.com/com/android/tools/build/aapt2/3.4.0-5326820/aapt2-3.4.0-5326820.pom'. > Connect to mirrors.opencas.ac.cn:80 [mirrors.opencas.ac.cn/124.16.75.211] failed: Connection timed out: connect 尝试过论坛里的方法,目前JDK的版本是1.8.0,SDK的版本是26.1.1,之前是25,但是因为报错需要26,所以升级上去了,但是还是没有解决 怀疑是环境变量设置的问题,但是小弟并非计算机专业,没有办法非常系统的debug,麻烦各位大佬帮我看看具体是哪里出现了问题 ![图片说明](https://img-ask.csdn.net/upload/201909/20/1568912455_512805.png)![图片说明](https://img-ask.csdn.net/upload/201909/20/1568912467_242775.png)![图片说明](https://img-ask.csdn.net/upload/201909/20/1568912486_584120.png)![图片说明](https://img-ask.csdn.net/upload/201909/20/1568912494_751240.png)![图片说明](https://img-ask.csdn.net/upload/201909/20/1568912502_553839.png)![图片说明](https://img-ask.csdn.net/upload/201909/20/1568912507_195203.png)

在中国程序员是青春饭吗?

今年,我也32了 ,为了不给大家误导,咨询了猎头、圈内好友,以及年过35岁的几位老程序员……舍了老脸去揭人家伤疤……希望能给大家以帮助,记得帮我点赞哦。 目录: 你以为的人生 一次又一次的伤害 猎头界的真相 如何应对互联网行业的「中年危机」 一、你以为的人生 刚入行时,拿着傲人的工资,想着好好干,以为我们的人生是这样的: 等真到了那一天,你会发现,你的人生很可能是这样的: ...

程序员请照顾好自己,周末病魔差点一套带走我。

程序员在一个周末的时间,得了重病,差点当场去世,还好及时挽救回来了。

Java基础知识面试题(2020最新版)

文章目录Java概述何为编程什么是Javajdk1.5之后的三大版本JVM、JRE和JDK的关系什么是跨平台性?原理是什么Java语言有哪些特点什么是字节码?采用字节码的最大好处是什么什么是Java程序的主类?应用程序和小程序的主类有何不同?Java应用程序与小程序之间有那些差别?Java和C++的区别Oracle JDK 和 OpenJDK 的对比基础语法数据类型Java有哪些数据类型switc...

技术大佬:我去,你写的 switch 语句也太老土了吧

昨天早上通过远程的方式 review 了两名新来同事的代码,大部分代码都写得很漂亮,严谨的同时注释也很到位,这令我非常满意。但当我看到他们当中有一个人写的 switch 语句时,还是忍不住破口大骂:“我擦,小王,你丫写的 switch 语句也太老土了吧!” 来看看小王写的代码吧,看完不要骂我装逼啊。 private static String createPlayer(PlayerTypes p...

和黑客斗争的 6 天!

互联网公司工作,很难避免不和黑客们打交道,我呆过的两家互联网公司,几乎每月每天每分钟都有黑客在公司网站上扫描。有的是寻找 Sql 注入的缺口,有的是寻找线上服务器可能存在的漏洞,大部分都...

Intellij IDEA 实用插件安利

1. 前言从2020 年 JVM 生态报告解读 可以看出Intellij IDEA 目前已经稳坐 Java IDE 头把交椅。而且统计得出付费用户已经超过了八成(国外统计)。IDEA 的...

女程序员,为什么比男程序员少???

昨天看到一档综艺节目,讨论了两个话题:(1)中国学生的数学成绩,平均下来看,会比国外好?为什么?(2)男生的数学成绩,平均下来看,会比女生好?为什么?同时,我又联想到了一个技术圈经常讨...

总结了 150 余个神奇网站,你不来瞅瞅吗?

原博客再更新,可能就没了,之后将持续更新本篇博客。

副业收入是我做程序媛的3倍,工作外的B面人生是怎样的?

提到“程序员”,多数人脑海里首先想到的大约是:为人木讷、薪水超高、工作枯燥…… 然而,当离开工作岗位,撕去层层标签,脱下“程序员”这身外套,有的人生动又有趣,马上展现出了完全不同的A/B面人生! 不论是简单的爱好,还是正经的副业,他们都干得同样出色。偶尔,还能和程序员的特质结合,产生奇妙的“化学反应”。 @Charlotte:平日素颜示人,周末美妆博主 大家都以为程序媛也个个不修边幅,但我们也许...

MySQL数据库面试题(2020最新版)

文章目录数据库基础知识为什么要使用数据库什么是SQL?什么是MySQL?数据库三大范式是什么mysql有关权限的表都有哪几个MySQL的binlog有有几种录入格式?分别有什么区别?数据类型mysql有哪些数据类型引擎MySQL存储引擎MyISAM与InnoDB区别MyISAM索引与InnoDB索引的区别?InnoDB引擎的4大特性存储引擎选择索引什么是索引?索引有哪些优缺点?索引使用场景(重点)...

如果你是老板,你会不会踢了这样的员工?

有个好朋友ZS,是技术总监,昨天问我:“有一个老下属,跟了我很多年,做事勤勤恳恳,主动性也很好。但随着公司的发展,他的进步速度,跟不上团队的步伐了,有点...

我入职阿里后,才知道原来简历这么写

私下里,有不少读者问我:“二哥,如何才能写出一份专业的技术简历呢?我总感觉自己写的简历太烂了,所以投了无数份,都石沉大海了。”说实话,我自己好多年没有写过简历了,但我认识的一个同行,他在阿里,给我说了一些他当年写简历的方法论,我感觉太牛逼了,实在是忍不住,就分享了出来,希望能够帮助到你。 01、简历的本质 作为简历的撰写者,你必须要搞清楚一点,简历的本质是什么,它就是为了来销售你的价值主张的。往深...

魂迁光刻,梦绕芯片,中芯国际终获ASML大型光刻机

据羊城晚报报道,近日中芯国际从荷兰进口的一台大型光刻机,顺利通过深圳出口加工区场站两道闸口进入厂区,中芯国际发表公告称该光刻机并非此前盛传的EUV光刻机,主要用于企业复工复产后的生产线扩容。 我们知道EUV主要用于7nm及以下制程的芯片制造,光刻机作为集成电路制造中最关键的设备,对芯片制作工艺有着决定性的影响,被誉为“超精密制造技术皇冠上的明珠”,根据之前中芯国际的公报,目...

优雅的替换if-else语句

场景 日常开发,if-else语句写的不少吧??当逻辑分支非常多的时候,if-else套了一层又一层,虽然业务功能倒是实现了,但是看起来是真的很不优雅,尤其是对于我这种有强迫症的程序"猿",看到这么多if-else,脑袋瓜子就嗡嗡的,总想着解锁新姿势:干掉过多的if-else!!!本文将介绍三板斧手段: 优先判断条件,条件不满足的,逻辑及时中断返回; 采用策略模式+工厂模式; 结合注解,锦...

离职半年了,老东家又发 offer,回不回?

有小伙伴问松哥这个问题,他在上海某公司,在离职了几个月后,前公司的领导联系到他,希望他能够返聘回去,他很纠结要不要回去? 俗话说好马不吃回头草,但是这个小伙伴既然感到纠结了,我觉得至少说明了两个问题:1.曾经的公司还不错;2.现在的日子也不是很如意。否则应该就不会纠结了。 老实说,松哥之前也有过类似的经历,今天就来和小伙伴们聊聊回头草到底吃不吃。 首先一个基本观点,就是离职了也没必要和老东家弄的苦...

2020阿里全球数学大赛:3万名高手、4道题、2天2夜未交卷

阿里巴巴全球数学竞赛( Alibaba Global Mathematics Competition)由马云发起,由中国科学技术协会、阿里巴巴基金会、阿里巴巴达摩院共同举办。大赛不设报名门槛,全世界爱好数学的人都可参与,不论是否出身数学专业、是否投身数学研究。 2020年阿里巴巴达摩院邀请北京大学、剑桥大学、浙江大学等高校的顶尖数学教师组建了出题组。中科院院士、美国艺术与科学院院士、北京国际数学...

为什么你不想学习?只想玩?人是如何一步一步废掉的

不知道是不是只有我这样子,还是你们也有过类似的经历。 上学的时候总有很多光辉历史,学年名列前茅,或者单科目大佬,但是虽然慢慢地长大了,你开始懈怠了,开始废掉了。。。 什么?你说不知道具体的情况是怎么样的? 我来告诉你: 你常常潜意识里或者心理觉得,自己真正的生活或者奋斗还没有开始。总是幻想着自己还拥有大把时间,还有无限的可能,自己还能逆风翻盘,只不是自己还没开始罢了,自己以后肯定会变得特别厉害...

男生更看重女生的身材脸蛋,还是思想?

往往,我们看不进去大段大段的逻辑。深刻的哲理,往往短而精悍,一阵见血。问:产品经理挺漂亮的,有点心动,但不知道合不合得来。男生更看重女生的身材脸蛋,还是...

为什么程序员做外包会被瞧不起?

二哥,有个事想询问下您的意见,您觉得应届生值得去外包吗?公司虽然挺大的,中xx,但待遇感觉挺低,马上要报到,挺纠结的。

当HR压你价,说你只值7K,你该怎么回答?

当HR压你价,说你只值7K时,你可以流畅地回答,记住,是流畅,不能犹豫。 礼貌地说:“7K是吗?了解了。嗯~其实我对贵司的面试官印象很好。只不过,现在我的手头上已经有一份11K的offer。来面试,主要也是自己对贵司挺有兴趣的,所以过来看看……”(未完) 这段话主要是陪HR互诈的同时,从公司兴趣,公司职员印象上,都给予对方正面的肯定,既能提升HR的好感度,又能让谈判气氛融洽,为后面的发挥留足空间。...

面试:第十六章:Java中级开发

HashMap底层实现原理,红黑树,B+树,B树的结构原理 Spring的AOP和IOC是什么?它们常见的使用场景有哪些?Spring事务,事务的属性,传播行为,数据库隔离级别 Spring和SpringMVC,MyBatis以及SpringBoot的注解分别有哪些?SpringMVC的工作原理,SpringBoot框架的优点,MyBatis框架的优点 SpringCould组件有哪些,他们...

面试阿里p7,被按在地上摩擦,鬼知道我经历了什么?

面试阿里p7被问到的问题(当时我只知道第一个):@Conditional是做什么的?@Conditional多个条件是什么逻辑关系?条件判断在什么时候执...

Python爬虫,高清美图我全都要(彼岸桌面壁纸)

爬取彼岸桌面网站较为简单,用到了requests、lxml、Beautiful Soup4

差点跪了...

最近微信又搞出了一个大利器,甚至都上了热搜,当然消息最敏捷的自媒体人,纷纷都开通了自己的视频号。01 视频号是什么呢?视频号是微信体系内的短视频,它不同...

面试了一个 31 岁程序员,让我有所触动,30岁以上的程序员该何去何从?

最近面试了一个31岁8年经验的程序猿,让我有点感慨,大龄程序猿该何去何从。

Vue回炉重造之router路由(更新中)

你好,我是Vam的金豆之路,可以叫我豆哥。2019年年度博客之星、技术领域博客专家。主要领域:前端开发。我的微信是 maomin9761,有什么疑问可以加我哦,自己创建了一个微信技术交流群,可以加我邀请你一起交流学习。最后自己也创建了一个微信公众号,里面的文章是我自己精挑细选的文章,主要介绍各种IT新技术。欢迎关注哦,微信搜索:臻美IT,等你来。 欢迎阅读本博文,本博文主要讲述【】,文字通...

大三实习生,字节跳动面经分享,已拿Offer

说实话,自己的算法,我一个不会,太难了吧

程序员垃圾简历长什么样?

已经连续五年参加大厂校招、社招的技术面试工作,简历看的不下于万份 这篇文章会用实例告诉你,什么是差的程序员简历! 疫情快要结束了,各个公司也都开始春招了,作为即将红遍大江南北的新晋UP主,那当然要为小伙伴们做点事(手动狗头)。 就在公众号里公开征简历,义务帮大家看,并一一点评。《启舰:春招在即,义务帮大家看看简历吧》 一石激起千层浪,三天收到两百多封简历。 花光了两个星期的所有空闲时...

Java岗开发3年,公司临时抽查算法,离职后这几题我记一辈子

前几天我们公司做了一件蠢事,非常非常愚蠢的事情。我原以为从学校出来之后,除了找工作有测试外,不会有任何与考试有关的事儿。 但是,天有不测风云,公司技术总监、人事总监两位大佬突然降临到我们事业线,叫上我老大,给我们组织了一场别开生面的“考试”。 那是一个风和日丽的下午,我翘着二郎腿,左手端着一杯卡布奇诺,右手抓着我的罗技鼠标,滚动着轮轴,穿梭在头条热点之间。 “淡黄的长裙~蓬松的头发...

大胆预测下未来5年的Web开发

在2019年的ReactiveConf 上,《Elm in Action》的作者Richard Feldman对未来5年Web开发的发展做了预测,很有意思,分享给大家。如果你有机会从头...

立即提问
相关内容推荐