cygwin 下 运行make 报错

报错具体信息:
查了很多资料,gcc也安装了,就是不明白为什么会这样
有看出问题指点一二
图片说明

2个回答

你确定gcc安装了吗?配置了吗? 输个gcc -v试下吧

aidon1428
Aidon_Zhang gcc -v 用来测试GCC是否安装,事实是我安装了的。 这个问题是由于我们的SDK用的mips编译链,我误删了PC上的编译链工具 ,谢谢
接近 3 年之前 回复
 gcc -v

用来测试GCC是否安装,事实是我安装了的。
这个问题是由于我们的SDK用的mips编译链,我误删了PC上的编译链工具 ,谢谢

Csdn user default icon
上传中...
上传图片
插入图片
抄袭、复制答案,以达到刷声望分或其他目的的行为,在CSDN问答是严格禁止的,一经发现立刻封号。是时候展现真正的技术了!
其他相关推荐
Python+OpenCV计算机视觉

Python+OpenCV计算机视觉

cygwin下解压unzip报错!

![图片说明](https://img-ask.csdn.net/upload/201511/17/1447746656_87787.jpg)

Cygwin mpi 代码运行报错,请问是安装时少选择了文件吗?

![图片说明](https://img-ask.csdn.net/upload/201908/26/1566819029_585411.png) Cygwin mpi 代码运行报错,请问是安装时少选择了文件吗? Fortran90代码如下: PROGRAM TUTE2Q1 IMPLICIT NONE INCLUDE 'mpif.h' ! Variable declartion INTEGER :: i,pid,nprocs,ierr CALL MPI_INIT(ierr) ! Initialize MPI Program CALL MPI_COMM_SIZE(MPI_COMM_WORLD,nprocs,ierr) ! Get Size of Communicator (Number of procs) CALL MPI_COMM_RANK(MPI_COMM_WORLD,pid,ierr) ! Get Rank of Communicator (proc id) ! If root write header IF (pid.EQ.0) THEN WRITE(*,1100) "N Procs","PID","Message" ENDIF ! Synchronize CALL MPI_BARRIER(MPI_COMM_WORLD,ierr) ! Write out sequentially DO i = 0,nprocs-1 IF (pid.EQ.i) THEN ! Write out data WRITE(*,1200) nprocs,pid,"Hello World" ENDIF ! Synchronize CALL MPI_BARRIER(MPI_COMM_WORLD,ierr) ENDDO 1100 FORMAT(3(A12,1x)) 1200 FORMAT(2(I12.1,1x),A12) ! Finalize MPI program CALL MPI_FINALIZE(ierr) END PROGRAM TUTE2Q1

Cygwin下Fortran mpi 代码运行报错,请问是安装时少选择了文件吗?

Cygwin mpi 代码运行报错,请问是安装时少选择了文件吗? Fortran90代码如下: PROGRAM TUTE2Q1 IMPLICIT NONE INCLUDE 'mpif.h' ! Variable declartion INTEGER :: i,pid,nprocs,ierr CALL MPI_INIT(ierr) ! Initialize MPI Program CALL MPI_COMM_SIZE(MPI_COMM_WORLD,nprocs,ierr) ! Get Size of Communicator (Number of procs) CALL MPI_COMM_RANK(MPI_COMM_WORLD,pid,ierr) ! Get Rank of Communicator (proc id) ! If root write header IF (pid.EQ.0) THEN WRITE(*,1100) "N Procs","PID","Message" ENDIF ! Synchronize CALL MPI_BARRIER(MPI_COMM_WORLD,ierr) ! Write out sequentially DO i = 0,nprocs-1 IF (pid.EQ.i) THEN ! Write out data WRITE(*,1200) nprocs,pid,"Hello World" ENDIF ! Synchronize CALL MPI_BARRIER(MPI_COMM_WORLD,ierr) ENDDO 1100 FORMAT(3(A12,1x)) 1200 FORMAT(2(I12.1,1x),A12) ! Finalize MPI program CALL MPI_FINALIZE(ierr) END PROGRAM TUTE2Q1

cygwin 下 make 出现的问题

makefile.txt: abc.o: abc.c gcc -c abc.c out:abc.o gcc abc.o -o out make abc.o 成功 make out 没有规则可制作目标 求大神解答啊! makefile 我试了各种版本写法 都一样 gcc abc.o -o out 是没有问题的

cygwin下使用make 显示no targets specified and no makefile found

cygwin下使用make 显示no targets specified and no makefile found,确定在文件夹下有makefile,求教是什么问题?

eclipse+ C++ +cygwin调试C++时报错

Could not determin GDB version after sending:gdb --version

在cygwin下使用make指令出现不兼容的情况

![图片说明](https://img-ask.csdn.net/upload/202002/17/1581947702_133750.png) 如图 小白求助 请问如何解决 cygwin当时选了完全安装 足足装了60个G 是否需要重新安装? 原本是想借助cygwin做CSAPP配套的CMU实验....

cygwin安装后如何添加cmake

我在安装cygwin时忘记安装cmake了,后来编译的时候报错才发现这个问题,除了重新装cygwin外,有没有其他的解决办法啊?求大神指点迷津

Cygwin本地安装时,无法识别已下载的包,如何解决?

Cygwin本地安装时,无法识别已下载的包,如何解决?无论选择的安装包的下载路径到哪一级的文件夹均显示“no packages found”!急求大神解答!

nodejs创建kraken项目报错,使用vs2013

创建一个KRAKEN项目,npm install -g generator-kraken,报错提示node版本过低,手动升级版本0.10.28至4.2.4,继续创建,报错: 在此解决方案中一次生成一个项目。若要启用并行生成,请添加“/m”开关。 C:\Program Files (x86)\MSBuild\Microsoft.Cpp\v4.0\V120\Microsoft.CppBuild.targets(399,5): error MSB3191: 无法创建目录“Release\obj\thread_sleep\thread_sleep.tlog\”。指定的路径或文件名太长,或者两者都太长。完全限定文件名必须少于 260 个字符,并且目录名必须少于 248 个字符。 [C:\Users\liuxiang\AppData\Roaming\npm\node_modules\generator-kraken\node_modules\yeoman-generator\node_modules\cross-spawn\node_modules\spawn-sync\node_modules\try-thread-sleep\node_modules\thread-sleep\build\thread_sleep.vcxproj] gyp ERR! build error gyp ERR! stack Error: `C:\Program Files (x86)\MSBuild\12.0\bin\msbuild.exe` fail ed with exit code: 1 gyp ERR! stack at ChildProcess.onExit (C:\Document\node.js\node_modules\npm\node_modules\node-gyp\lib\build.js:270:23) gyp ERR! stack at emitTwo (events.js:87:13) gyp ERR! stack at ChildProcess.emit (events.js:172:7) gyp ERR! stack at Process.ChildProcess._handle.onexit (internal/child_proces s.js:200:12) gyp ERR! System Windows_NT 6.1.7601 gyp ERR! command "C:\\Document\\node.js\\node.exe" "C:\\Document\\node.js\\node_ modules\\npm\\node_modules\\node-gyp\\bin\\node-gyp.js" "build" "--fallback-to-b uild" "--module=C:\\Users\\liuxiang\\AppData\\Roaming\\npm\\node_modules\\genera tor-kraken\\node_modules\\yeoman-generator\\node_modules\\cross-spawn\\node_modu les\\spawn-sync\\node_modules\\try-thread-sleep\\node_modules\\thread-sleep\\lib \\binding\\Release\\node-v46-win32-x64\\thread_sleep.node" "--module_name=thread _sleep" "--module_path=C:\\Users\\liuxiang\\AppData\\Roaming\\npm\\node_modules\ \generator-kraken\\node_modules\\yeoman-generator\\node_modules\\cross-spawn\\no de_modules\\spawn-sync\\node_modules\\try-thread-sleep\\node_modules\\thread-sle ep\\lib\\binding\\Release\\node-v46-win32-x64" gyp ERR! cwd C:\Users\liuxiang\AppData\Roaming\npm\node_modules\generator-kraken \node_modules\yeoman-generator\node_modules\cross-spawn\node_modules\spawn-sync\ node_modules\try-thread-sleep\node_modules\thread-sleep gyp ERR! node -v v4.2.4 gyp ERR! node-gyp -v v3.0.3 gyp ERR! not ok node-pre-gyp ERR! build error node-pre-gyp ERR! stack Error: Failed to execute 'node-gyp.cmd build --fallback- to-build --module=C:\Users\liuxiang\AppData\Roaming\npm\node_modules\generator-k raken\node_modules\yeoman-generator\node_modules\cross-spawn\node_modules\spawn- sync\node_modules\try-thread-sleep\node_modules\thread-sleep\lib\binding\Release \node-v46-win32-x64\thread_sleep.node --module_name=thread_sleep --module_path=C :\Users\liuxiang\AppData\Roaming\npm\node_modules\generator-kraken\node_modules\ yeoman-generator\node_modules\cross-spawn\node_modules\spawn-sync\node_modules\t ry-thread-sleep\node_modules\thread-sleep\lib\binding\Release\node-v46-win32-x64 ' (1) node-pre-gyp ERR! stack at ChildProcess.<anonymous> (C:\Users\liuxiang\AppDa ta\Roaming\npm\node_modules\generator-kraken\node_modules\yeoman-generator\node_ modules\cross-spawn\node_modules\spawn-sync\node_modules\try-thread-sleep\node_m odules\thread-sleep\node_modules\node-pre-gyp\lib\util\compile.js:83:29) node-pre-gyp ERR! stack at emitTwo (events.js:87:13) node-pre-gyp ERR! stack at ChildProcess.emit (events.js:172:7) node-pre-gyp ERR! stack at maybeClose (internal/child_process.js:818:16) node-pre-gyp ERR! stack at Process.ChildProcess._handle.onexit (internal/chi ld_process.js:211:5) node-pre-gyp ERR! System Windows_NT 6.1.7601 node-pre-gyp ERR! command "C:\\Document\\node.js\\node.exe" "C:\\Users\\liuxiang \\AppData\\Roaming\\npm\\node_modules\\generator-kraken\\node_modules\\yeoman-ge nerator\\node_modules\\cross-spawn\\node_modules\\spawn-sync\\node_modules\\try- thread-sleep\\node_modules\\thread-sleep\\node_modules\\node-pre-gyp\\bin\\node- pre-gyp" "install" "--fallback-to-build" node-pre-gyp ERR! cwd C:\Users\liuxiang\AppData\Roaming\npm\node_modules\generat or-kraken\node_modules\yeoman-generator\node_modules\cross-spawn\node_modules\sp awn-sync\node_modules\try-thread-sleep\node_modules\thread-sleep node-pre-gyp ERR! node -v v4.2.4 node-pre-gyp ERR! node-pre-gyp -v v0.6.9 node-pre-gyp ERR! not ok Failed to execute 'node-gyp.cmd build --fallback-to-build --module=C:\Users\liux iang\AppData\Roaming\npm\node_modules\generator-kraken\node_modules\yeoman-gener ator\node_modules\cross-spawn\node_modules\spawn-sync\node_modules\try-thread-sl eep\node_modules\thread-sleep\lib\binding\Release\node-v46-win32-x64\thread_slee p.node --module_name=thread_sleep --module_path=C:\Users\liuxiang\AppData\Roamin g\npm\node_modules\generator-kraken\node_modules\yeoman-generator\node_modules\c ross-spawn\node_modules\spawn-sync\node_modules\try-thread-sleep\node_modules\th read-sleep\lib\binding\Release\node-v46-win32-x64' (1) npm WARN optional dep failed, continuing thread-sleep@1.0.4 > spawn-sync@1.0.15 postinstall C:\Users\liuxiang\AppData\Roaming\npm\node_modul es\generator-kraken\node_modules\yeoman-generator\node_modules\cross-spawn\node_ modules\spawn-sync > node postinstall generator-kraken@2.2.2 C:\Users\liuxiang\AppData\Roaming\npm\node_modules\genera tor-kraken ├── debuglog@1.0.1 ├── underscore.string@3.2.2 ├── mkdirp@0.5.1 (minimist@0.0.8) ├── chalk@1.1.1 (escape-string-regexp@1.0.4, ansi-styles@2.1.0, supports-colo r@2.0.0, has-ansi@2.0.0, strip-ansi@3.0.0) ├── update-notifier@0.3.2 (is-npm@1.0.0, string-length@1.0.1, semver-diff@2.1 .0, latest-version@1.0.1, configstore@0.3.2) └── yeoman-generator@0.20.3 (detect-conflict@1.0.0, read-chunk@1.0.1, yeoman- assert@2.1.1, path-exists@1.0.0, yeoman-welcome@1.0.1, path-is-absolute@1.0.0, a sync@1.5.2, mime@1.3.4, class-extend@0.1.2, text-table@0.2.0, diff@2.2.1, dargs@ 4.1.0, xdg-basedir@2.0.0, user-home@2.0.0, istextorbinary@1.0.2, shelljs@0.5.3, nopt@3.0.6, debug@2.2.0, run-async@0.1.0, cli-table@0.3.1, through2@2.0.0, glob@ 5.0.15, findup-sync@0.2.1, rimraf@2.5.0, mem-fs-editor@2.1.0, sinon@1.17.2, gith ub-username@2.1.0, dateformat@1.0.12, pretty-bytes@2.0.1, yeoman-environment@1.5 .2, gruntfile-editor@1.1.0, html-wiring@1.2.0, download@4.4.3, lodash@3.10.1, in quirer@0.8.5, cross-spawn@2.1.4)

windows7下载cygwin下运行hadoop

为什么我输入bin/start-all.sh显示xxxx:ssh: connect to host xxxx port 22: Connect timed out.该如何解决呢? 我第一次学习这个在windows上配置hadoop,按照网上的一个方法进行的http://www.cnblogs.com/kinglau/archive/2013/08/20/3270160.html,就是进行到最后两步的时候,问题解决不了了,知道的还请麻烦一下,帮个忙

win7下cygwin编译ffmpeg编译错误

在cygwin下编译ffmpeg时出现如果错误 ,跪求大牛指点 LD libswscale/libswscale-4.so d:/worktool/android-ndk-r10c/toolchains/arm-linux-androideabi-4.9/prebuilt/windows-x86_64/bin/../lib/gcc/arm-linux-androideabi/4.9/../../../../arm-linux-androideabi/bin/ld.exe: error: libavutil/libavutil.so:1:1: syntax error, unexpected '!', expecting $end d:/worktool/android-ndk-r10c/toolchains/arm-linux-androideabi-4.9/prebuilt/windows-x86_64/bin/../lib/gcc/arm-linux-androideabi/4.9/../../../../arm-linux-androideabi/bin/ld.exe: error: libavutil/libavutil.so: not an object or archive collect2.exe: error: ld returned 1 exit status library.mak:97: recipe for target 'libswscale/libswscale-4.so' failed make: *** [libswscale/libswscale-4.so] Error 1 ffmpeg的configure的配置已经完成,配置的sh脚本如下: #!/bin/bash NDK=D:/worktool/android-ndk-r10c SYSROOT=$NDK/platforms/android-21/arch-arm TOOLCHAIN=$NDK/toolchains/arm-linux-androideabi-4.9/prebuilt/windows-x86_64 function build_one { ./configure \ --prefix=$PREFIX \ --enable-shared \ --disable-static \ --disable-doc \ --disable-ffmpeg \ --disable-ffplay \ --disable-ffprobe \ --disable-ffserver \ --disable-avdevice \ --disable-doc \ --disable-symver \ --cross-prefix=$TOOLCHAIN/bin/arm-linux-androideabi- \ --target-os=linux \ --arch=arm \ --enable-cross-compile \ --sysroot=$SYSROOT \ --extra-cflags="-Os -fpic $ADDI_CFLAGS" \ --extra-ldflags="$ADDI_LDFLAGS" \ $ADDITIONAL_CONFIGURE_FLAG } CPU=arm PREFIX=$(pwd)/android/$CPU ADDI_CFLAGS="-marm" build_one

安装完Cygwin后无法打开,老是报错缺少mintty

老是有这张报错,但是我已经下载好几次了,下载的时候没有报错 ![图片说明](https://img-ask.csdn.net/upload/201604/07/1460008415_491323.jpg)

在cygwin中配置gearman时提示”fileno在此作用域中尚未声明“无法解决了

在cygwin中make gearman时总是在最后提示:‘fileno’在此作用域中尚未声明,翻遍了整个网上都找不到解决方法,哪位能给提点一下?对这两个东东都是白门,搞了几天都没搞定。 bin/gearman.cc: 在函数‘gearman_return_t _client_data(gearman_task_st*)’中: bin/gearman.cc:448:26: 错误:‘fileno’在此作用域中尚未声明 if (write(fileno(stdout), gearman_task_data(task), gearman_task_data_size(task)) == -1) ^ bin/gearman.cc: 在函数‘gearman_return_t _client_warning(gearman_task_st*)’中: bin/gearman.cc:466:26: 错误:‘fileno’在此作用域中尚未声明 if (write(fileno(stderr), gearman_task_data(task), gearman_task_data_size(task)) == -1) bin/gearman.cc: 在函数‘void* _worker_cb(gearman_job_st*, void*, size_t*, gearman_return_t*)’中: bin/gearman.cc:672:38: 错误:‘fdopen’在此作用域中尚未声明 FILE *f= fdopen(out_fds[0], "r"); ^ Makefile:5516: recipe for target 'bin/gearman.o' failed make[1]: *** [bin/gearman.o] Error 1 make[1]: Leaving directory '/cygdrive/d/web/cygwin/gearmand-1.1.12' Makefile:3050: recipe for target 'all' failed make: *** [all] Error 2 ![图片说明](https://img-ask.csdn.net/upload/201507/30/1438249424_820129.png)

如何通过Go连接到Cygwin / X?

<div class="post-text" itemprop="text"> <p>I am using BurntSushi/xgbutil library which I have gotten to work on Linux. Now I am trying to get it to create a window on my Win7 running cygwin with xorg-server installed.</p> <p>I'm not sure what I need to do to initialize the display, if anything.</p> <p>My Go code looks like this:</p> <pre><code>X, err := xgbutil.NewConnDisplay(displayname) if err != nil { log.Fatal(err) } </code></pre> <p>When <code>displayname = ":0"</code> I get <code>cannot connect to :0: dial unix /tmp/.X11-unix/X0: socket: An address incompatible with the requested protocol was used.</code></p> <p>When <code>displayname = "localhost:0"</code> I get <code>cannot connect to localhost:0: dial tcp [::1]:6000: connectex: No connection could be made because the target machine actively refused it.</code></p> <p>I'm not sure whether my problem is the displayname I'm using or if there is something I need to do in cygwin to make it work?</p> <p>I <em>have</em> started xwin by using the xlaunch utility and an empty window sits on my desktop and identifies itself as "Cygwin/x:0.0" in the title bar.</p> </div>

cygwin64安装相关的问题

最近要在window下开发Linux的c++程序,需要用到cygwin,但是发现安装包很多,很大,有不了解。提几个问题: cygwin64相关的目录和包是不是64位系统用的? 安装包的包名里面有很多带有-debuginfo的包,很大,不知道有没有用处。

在Cygwin上捕捉Ctrl + c

<div class="post-text" itemprop="text"> <p>The following golang code catches <kbd>CTRL</kbd>+<kbd>C</kbd> when run from a DOS prompt, but when I run it from Cygwin it doesn't catch anything when <kbd>CTRL</kbd>+<kbd>C</kbd> is pressed.</p> <p>What does Cygwin do when <kbd>CTRL</kbd>+<kbd>C</kbd> is pressed? My OS is Win7 64 bit running 32 bit Cygwin.</p> <pre><code> func main() { c := make(chan os.Signal, 1) signal.Notify(c, os.Interrupt) go func(){ for sig := range c { fmt.Println(sig.String()) } }() time.Sleep(5000 * time.Millisecond) fmt.Println("Done") } </code></pre> </div>

cygwin :make micaz sim

Jon@JON-KING /opt/tinyos-2.x/apps/Blink $ make micaz sim mkdir -p simbuild/micaz placing object files in simbuild/micaz writing XML schema to app.xml compiling BlinkAppC to object file sim.o ncc -c -DUSE_DL_IMPORT -fpic -o simbuild/micaz/sim.o -g -O0 -tossim -fnesc-nido-tosnodes=1000 -fnesc-simulate -fnesc-nido-motenumber=sim_node\(\) -fnesc-gcc=gcc -Wall -Wshadow -Wnesc-all -target=micaz -fnesc-cfile=simbuild/micaz/app.c -board=micasb -DDEFINED_TOS_AM_GROUP=0x22 --param max-inline-insns-single=100000 -DIDENT_APPNAME=\"BlinkAppC\" -DIDENT_USERNAME=\"Jon\" -DIDENT_HOSTNAME=\"JON-KING\" -DIDENT_USERHASH=0x61d0b451L -DIDENT_TIMESTAMP=0x55081143L -DIDENT_UIDHASH=0x7fe3aefcL -Wno-nesc-data-race BlinkAppC.nc -fnesc-dump=components -fnesc-dump=variables -fnesc-dump=constants -fnesc-dump=typedefs -fnesc-dump=interfacedefs -fnesc-dump=tags -fnesc-dumpfile=app.xml gcc: error: unrecognized command line option ‘-_fnesc-gcc=gcc’ gcc: error: unrecognized command line option ‘-_fnesc-include=nesc_nx’ gcc: error: unrecognized command line option ‘-_fnesc-include=tos’ gcc: error: unrecognized command line option ‘-_fnesc-scheduler=TinySchedulerC,TinySchedulerC.TaskBasic,TaskBasic,TaskBasic,runTask,postTask’ gcc: error: unrecognized command line option ‘-_fnesc-nido-tosnodes=1000’ gcc: error: unrecognized command line option ‘-_fnesc-simulate’ gcc: error: unrecognized command line option ‘-_fnesc-nido-motenumber=sim_node()’ gcc: error: unrecognized command line option ‘-_fnesc-gcc=gcc’ gcc: error: unrecognized command line option ‘-_Wnesc-all’ gcc: error: unrecognized command line option ‘-_fnesc-cfile=simbuild/micaz/app.c’ gcc: error: unrecognized command line option ‘-_Wno-nesc-data-race’ gcc: error: unrecognized command line option ‘-_fnesc-dump=components’ gcc: error: unrecognized command line option ‘-_fnesc-dump=variables’ gcc: error: unrecognized command line option ‘-_fnesc-dump=constants’ gcc: error: unrecognized command line option ‘-_fnesc-dump=typedefs’ gcc: error: unrecognized command line option ‘-_fnesc-dump=interfacedefs’ gcc: error: unrecognized command line option ‘-_fnesc-dump=tags’ gcc: error: unrecognized command line option ‘-_fnesc-dumpfile=app.xml’ gcc: error: unrecognized command line option ‘-_fnesc-no-debug’ gcc: error: unrecognized command line option ‘-_fnesc-scheduler=TinySchedulerC,TinySchedulerC.TaskBasic,TaskBasic,TaskBasic,runTask,postTask’ /opt/tinyos-2.x/support/make/sim.extra:66: recipe for target 'sim-exe' failed make: *** [sim-exe] Error 1

在Cygwin上/usr/local/bin/run:行1330: gedit: 未找到命令

Cygwin运行doris 出现/usr/local/bin/run:行1330: gedit: 未找到命令

2019 Python开发者日-培训

2019 Python开发者日-培训

150讲轻松搞定Python网络爬虫

150讲轻松搞定Python网络爬虫

设计模式(JAVA语言实现)--20种设计模式附带源码

设计模式(JAVA语言实现)--20种设计模式附带源码

YOLOv3目标检测实战:训练自己的数据集

YOLOv3目标检测实战:训练自己的数据集

java后台+微信小程序 实现完整的点餐系统

java后台+微信小程序 实现完整的点餐系统

三个项目玩转深度学习(附1G源码)

三个项目玩转深度学习(附1G源码)

初级玩转Linux+Ubuntu(嵌入式开发基础课程)

初级玩转Linux+Ubuntu(嵌入式开发基础课程)

2019 AI开发者大会

2019 AI开发者大会

玩转Linux:常用命令实例指南

玩转Linux:常用命令实例指南

一学即懂的计算机视觉(第一季)

一学即懂的计算机视觉(第一季)

4小时玩转微信小程序——基础入门与微信支付实战

4小时玩转微信小程序——基础入门与微信支付实战

Git 实用技巧

Git 实用技巧

Python数据清洗实战入门

Python数据清洗实战入门

使用TensorFlow+keras快速构建图像分类模型

使用TensorFlow+keras快速构建图像分类模型

实用主义学Python(小白也容易上手的Python实用案例)

实用主义学Python(小白也容易上手的Python实用案例)

程序员的算法通关课:知己知彼(第一季)

程序员的算法通关课:知己知彼(第一季)

MySQL数据库从入门到实战应用

MySQL数据库从入门到实战应用

机器学习初学者必会的案例精讲

机器学习初学者必会的案例精讲

手把手实现Java图书管理系统(附源码)

手把手实现Java图书管理系统(附源码)

极简JAVA学习营第四期(报名以后加助教微信:eduxy-1)

极简JAVA学习营第四期(报名以后加助教微信:eduxy-1)

.net core快速开发框架

.net core快速开发框架

玩转Python-Python3基础入门

玩转Python-Python3基础入门

Python数据挖掘简易入门

Python数据挖掘简易入门

微信公众平台开发入门

微信公众平台开发入门

程序员的兼职技能课

程序员的兼职技能课

Windows版YOLOv4目标检测实战:训练自己的数据集

Windows版YOLOv4目标检测实战:训练自己的数据集

HoloLens2开发入门教程

HoloLens2开发入门教程

微信小程序开发实战

微信小程序开发实战

Java8零基础入门视频教程

Java8零基础入门视频教程

相关热词 c# 开发接口 c# 中方法上面的限制 c# java 时间戳 c#单元测试入门 c# 数组转化成文本 c#实体类主外键关系设置 c# 子函数 局部 c#窗口位置设置 c# list 查询 c# 事件 执行顺序
立即提问