android stdio项目运行时报错app:compileDebugJavaWithJavac

本人刚装android stdio。运行时报错:Error:Execution failed for task ':app:compileDebugJavaWithJavac'.

Unexpected lock protocol found in lock file. Expected 3, found 0.
图片说明
我尝试过将工程目录里的.gradle文件删除重新启动AndroidStudio导入,结果还是如上报错。

后来我查看报错信息
图片说明
网上没搜到相同的错误。老铁们,能不能指导一下。谢谢大家了。

** 最新进展,这个问题已经被解决了,具体方法参见**
Error:Unexpected lock protocol found in lock file.

5个回答

Error:Execution failed for task ':app:compileDebugJavaWithJavac'.这是我遇到这个问题的解决方法

初步估计,是不是Java的环境变量没有配置好 ??

brayo
brayo 老铁,我觉得java环境变量设置没问题。我还可以运行eclipse。
接近 2 年之前 回复

是不是Java的环境变量没有配置好

brayo
brayo 老铁,我觉得java环境变量设置没问题。我还可以运行eclipse。
接近 2 年之前 回复

缺少一个类,在app-build.gradle中添加一个依赖库:implementation "io.reactivex.rxjava2:rxjava:2.2.4",即可解决问题

Csdn user default icon
上传中...
上传图片
插入图片
抄袭、复制答案,以达到刷声望分或其他目的的行为,在CSDN问答是严格禁止的,一经发现立刻封号。是时候展现真正的技术了!
其他相关推荐
android stdio环境搭建报错调试
今天配置jdk+android stdio开发环境过程中,新建项目反复报错 dl.google.com:443 failed to respond 定位到是gradle位置报错 结果方法如下 Please try dependencies { classpath 'com.android.tools.build:gradle:3.1.2' classpath 'com....
springMVC项目运行时报错
n跪求,急急急!!!哪位大神知道?n```n [2018-03-18 08:19:23,256] Artifact csams:war exploded: Artifact is being deployed, please wait...n18-Mar-2018 20:19:26.923 信息 [RMI TCP Connection(3)-127.0.0.1] org.apache.jasper.servlet.TldScanner.scanJars At least one JAR was scanned for TLDs yet contained no TLDs. Enable debug logging for this logger for a complete list of JARs that were scanned but no TLDs were found in them. Skipping unneeded JARs during scanning can improve startup time and JSP compilation time.n18-Mar-2018 20:19:28.456 严重 [RMI TCP Connection(3)-127.0.0.1] org.apache.catalina.core.StandardContext.startInternal One or more listeners failed to start. Full details will be found in the appropriate container log filen18-Mar-2018 20:19:28.457 严重 [RMI TCP Connection(3)-127.0.0.1] org.apache.catalina.core.StandardContext.startInternal Context [] startup failed due to previous errorsn[2018-03-18 08:19:28,500] Artifact csams:war exploded: Error during artifact deployment. See server log for details.n18-Mar-2018 20:19:32.972 信息 [localhost-startStop-1] org.apache.catalina.startup.HostConfig.deployDirectory Deploying web application directory D:\softWare\apache-tomcat-8.5.9-windows-x86\apache-tomcat-8.5.9\webapps\managern18-Mar-2018 20:19:33.043 信息 [localhost-startStop-1] org.apache.catalina.startup.HostConfig.deployDirectory Deployment of web application directory D:\softWare\apache-tomcat-8.5.9-windows-x86\apache-tomcat-8.5.9\webapps\manager has finished in 72 msnn```nn
Android studio 导入eclipse项目 运行时报错
Error:Android Packager: [sport5] java.io.IOException: Cannot pack file E:\444\libs\production\sport5\sport5.unaligned.apk into itself 这几天一直在用Android studio 今天尝试了下把eclipse项目导入Android studio 然后运行时产生了
Android Studio运行时报错
一:Error:Execution failed for task ':app:_compileDebugJava'. > 找不到目录: E:\AndroidStudioProjects\example\app\build\generated\source\apt\debug 解决办法: 在E:\AndroidStudioProjects\example\app\build\gene
android运行时报错记
1.安装失败更新不兼容:INSTALL_FAILED_UPDATE_INCOMPATIBLE出现原因:我出现这个情况是因为我手机安装了 我打包成APK的项目,后来又插上手机在eclipse上运行,结果出现这个问题。解决办法:在百度上看到许多 要先进手机data/data目录下面把 包删掉 太麻烦了,直接把APP卸载就行了2.for循环list,用list.remove(bean)删除报错java....
android studio运行时报错
刚遇到一个问题在Android studio编译的时候不会报错,但是运行的时候会报 Error:Execution failed for task ':video:transformClassesWithDexForDebug'. > com.android.build.api.transform.TransformException: com.android.ide.common.proce
项目运行时更改app图标
if (![[UIApplication sharedApplication] supportsAlternateIcons]) {// 系统不支持换图标 return; } [[UIApplication sharedApplication] setAlternateIconName:@"1212.jpg" completionHandler:^(NSE
Error:Execution failed for task ':app:compileDebugJavaWithJavac'.
以前没用过Android studio,这是以前的同事做的程序,让我维护,可是运行的时候出现这个错误。实在不知道怎么错的,求大神帮忙看看rn错误提示:Error:Execution failed for task ':app:compileDebugJavaWithJavac'.rn> java.io.FileNotFoundException: H:\APP\MyDbProject(shui)\MyDbProject\app\lib\alipaySdk-20160516.jar (系统找不到指定的路径。)
android stdio
android官网下载的android stdio,我放在网盘了,可以通过网盘链接下载哦
DPAP项目在Jetty下运行时报错
[color=blue][size=medium]在DPAP项目工程搭建好以后,在Jetty下运行的时候报错: 原因就是Jetty容器缺少一些DPAP项目必须的一些Jar包,而用Tomcat容器是没问题的。[/size][/color] [img]http://dl2.iteye.com/upload/attachment/0094/8153/f39d41b7-a137-3428-95...
android databinding 数据绑定错误 错误:任务':app:compileDebugJavaWithJavac' 的执行失败
今天到公司照常打开项目,突然运行不了显示databinding错误Error:Execution failed for task ':app:compileDebugJavaWithJavac'. > android.databinding.tool.util.LoggedErrorException: Found data binding errors.   ****/ data bind...
android 打包发布app 报错
错误如下 :  Information:Gradle tasks [:lvchedingdang:assembleRelease] :brokenview:preBuild :lvchedingdang:preBuild :lvcheapplib:preBuild :lvchedingdang:preBuild UP-TO-DATE :lvcheapplib:preBuild UP-TO-DAT
Android打包app报错
在我们打包app的时候会出现打包不成功String文件报错,解决方法如下: 点击要打包的项目,然后properties--》Android Lint Preferences--》点击右边的configure workspace settings--》取消掉Run full error check when exporting app选项--》apply--》ok。
android app报错
点击登录的时候报错如下:[img=https://img-bbs.csdn.net/upload/201501/28/1422411669_248746.png][/img]rnrnrn网络权限已加。。。rnrnrn求大神,,在线等。。。还需要提供什么可以说,本人刚接触android
visual stdio原码报错
我从网上下载的源码,也没有编译错误,但就是就有错误,不知道为什么[img=https://img-bbs.csdn.net/upload/201906/10/1560140302_316331.png][/img]
Android Studio运行时报错:Could not resolve all dependencies for configuration ':app:_
第一次用Android Studio开发。但在Android Studio运行时报错:rnCould not resolve all dependencies for configuration ':app:_debugCompile'.rnCould not find any version that matches com.android.support:appcompat-v7:15.+.rn[img=https://img-bbs.csdn.net/upload/201612/11/1481461246_84118.png][/img]rn但我的SDK Manager安装了该有的组件了啊,求大神帮我看看问题出现在哪里了?rn[img=https://img-bbs.csdn.net/upload/201612/11/1481461448_395172.png][/img][img=https://img-bbs.csdn.net/upload/201612/11/1481461507_176640.png][/img]rnrn再附上build.gradle文件内容:rn[code=java]rnapply plugin: 'com.android.application'rnrnandroid rn compileSdkVersion 15rn buildToolsVersion "24.0.0"rnrn defaultConfig rn applicationId "com.test.helloworld"rn minSdkVersion 14rn targetSdkVersion 15rn versionCode 1rn versionName "1.0"rn rn buildTypes rn release rn minifyEnabled falsern proguardFiles getDefaultProguardFile('proguard-android.txt'), 'proguard-rules.pro'rn rn rnrnrndependencies rn compile fileTree(dir: 'libs', include: ['*.jar'])rn testCompile 'junit:junit:4.12'rn compile 'com.android.support:appcompat-v7:15.+'rnrnrn[/code]rnrnrnrn
android studio真机调试运行时报错
提示Error running app: Instant Run requires 'Tools | Android | Enable ADB integration' to be enabled.n这是什么问题呢?求大神解答谢谢
Android Studio 真机运行时报错
rn[img=https://img-bbs.csdn.net/upload/201702/08/1486541661_632639.png][/img][img=https://img-bbs.csdn.net/upload/201702/08/1486541673_169322.png][/img]rnDELETE_FAILED_INTERNAL_ERRORrnError while Installing APKs
Android Studio真机运行时报错
Error running app: No target device found.错误 一般是没有识别手机设备, 注意一定要打开手机开发者模式是在  关于手机——》点击  版本号6-10次就进入开发者模式了 之后找到开发者选项 注意 Android Studio要选中usb
Android完整的app项目
以下内容整理出自:http://jcodecraeer.com/plus/list.php?tid=31&codecategory=22000,那里有更丰富的资料。 1.RxWeather 项目地址: https://github.com/SmartDengg/RxWeather这是一个简单的天气预报项目,目的是用来演示如何使用RxJava构造一个清晰的Android应用框架,并且加入
android项目app,旅游服务
android项目app,旅游服务,复杂布局,访问网络真实数据,提供给大家学习了
Android 项目运行时报错,提醒找不到R文件
写给遇到同样问题的安卓开发小白 在日常开发工作中,Android Studio会时不时报“cannot resolve symbol R”的错误,这让人很纳闷了 ,为什么好像昨天下班前能顺利运行项目,上班时再去运行就报错呢?网上找了挺多答案都没解决我的问题,于是我就自己去排查原因了。 查到了根本原因是我在项目的res文件中某个xml文件里引用了资源文件,然后这个文件被我不知道何时修改了标签名,所以...
【Android Stdio新手上路】
[img=https://img-bbs.csdn.net/upload/201801/13/1515809872_865505.png][/img]rn请问为什么打开后会是这样(有些文件名从src开始的下面会有红色的杠杠。。我现在配置的SDK版本是2.3(三明治),安卓手机API版本是23,如图)rn[img=https://img-bbs.csdn.net/upload/201801/13/1515810003_286605.png][/img]rn既然可以向下兼容(老版本的SDK兼容新版本的Android手机),为什么不可以正常运行(会有红杠杠。。)rn顺便一提,我的打开Modules setting是这样的,如果要使用更老版本的Build Tools Version怎么办?[img=https://img-bbs.csdn.net/upload/201801/13/1515810224_489910.png][/img]rn谢谢!
android stdio快捷键
从Eclipse转成android stdio不容易
Android 关闭APP报错弹窗
Android 关闭APP报错弹窗 最近测试部门反馈说我们的机器一个APP经常性的报错,然后就会弹出一个"很抱歉,xxx已停止运行"这样的弹窗,由于这个问题和硬件有关,硬件部门一时半会找不到问题,因此需要在Android系统层临时将这个弹窗屏蔽.弹窗如下: 在没做过此类修改之前,不知到如何下手的情况下,请做如下几步: 在Android目录下全局搜索关键字"很抱歉",然后会有一个路径frame...
Android启动第三方app报错
1.使用一下方法均报错 Permission Denial: starting Intent...................... a Intent intent=new Intent(); intent.setClassName("cn.kuwo.kwmusiccar", "cn.kuwo.kwmusiccar.MainActivity"); s
Android stdio无法启动
首先我的JDK的环境已经弄好,java,javac,Java -version 都能正常,但是android stdio总说找不到,截图如下rn[img=https://img-bbs.csdn.net/upload/201503/23/1427117295_859328.png][/img]rn后来查解决方法,说是可能是少了个分号或者是\ 都试了一下变成了这样 [img=https://img-bbs.csdn.net/upload/201503/23/1427117394_480875.png][/img] 求解决方法,eclipse那个也试了,都不行
android stdio build error
在build的时候出错了,错误如下:rnrnError:Execution failed for task ':app:processDebugManifest'.rn> Manifest merger failed : Attribute meta-data#android.support.VERSION@value value=(26.0.0-alpha1) from [com.android.support:design:26.0.0-alpha1] AndroidManifest.xml:27:9-38rn is also present at [com.android.support:cardview-v7:25.3.1] AndroidManifest.xml:24:9-31 value=(25.3.1).rn Suggestion: add 'tools:replace="android:value"' to element at AndroidManifest.xml:25:5-27:41 to override.rnrn配置如下:rncompile 'com.android.support:appcompat-v7:26.+'rn compile 'com.android.support.constraint:constraint-layout:1.0.2'rn compile 'com.android.support:recyclerview-v7:26.0.0-alpha1'rn compile 'com.android.support:design:26.+'rn compile 'com.android.support:support-v4:26.+'
Android Stdio实现简单计算器
因为个人时间有限,算法实现比较简单。 封面: 布局文件activity_main.xml: <?xml version="1.0" encoding="utf-8"?> <GridLayout xmlns:android="http://schemas.android.com/apk/res/android" android:layout_width="ma...
Android Stdio安装与使用
关于Android Stdio和Genymotion的安装与使用过程,记录安装步骤和遇到的问题。
Android Stdio与Bmob
本文档教你如何实现Android Stdio新建一个项目,把项目关联到Bmob云后端。
Android stdio—创建项目
本课将向您介绍如何使用 Android Studio 创建新的 Android 项目并说明该项目中的一些文件。
运行时报错
[img=https://img-bbs.csdn.net/upload/201904/07/1554607425_695539.png][/img]
ShareDevelop3.0建立Python项目运行时报错
之前我的电脑上安装了IronPython2.0,后安装ShareDevelop3.0,采用默认设置rn我在ShareDevelop中建立了一个默认的Python的控制台或窗体项目,运行时报错如下:rnrn调试器抛出异常System.IO.FileNotFoundException:rn未能加载文件或程序集“IronPython, Version=1.1.0.0, Culture=neutral, PublicKeyToken=31bf3856ad364e35”或它的某一个依赖项。系统找不到指定的文件。rnrnrn显然是.net找不到IronPython1.1的程序集,我在"选项"窗口中的"工具"一栏中的"Python"项看到,唯一的一个参数"Command"已配置成了指向ShareDevelop安装目录下的..\PythonBinding\下的ipy.exe,而且该目录下也有IronPython.dll(1.1版),要怎么设置才能让.net找到IronPython?rnrn我也想让ShareDevelop能使用IronPython2.0,应该怎么设置?
jsp项目运行时浏览器总是报错
HTTP Status 404 - /luntan/index.jsprnrn--------------------------------------------------------------------------------rnrntype Status reportrnrnmessage /luntan/index.jsprnrndescription The requested resource (/luntan/index.jsp) is not available.rnrnrn--------------------------------------------------------------------------------rnrnApache Tomcat/6.0.18rnrn这是什么原因 哪位大神能帮忙解释下 谢谢啦
IIS部署Asp.Net Core 项目运行时报错
IIS部署Asp.Net Core 项目运行时报错,处理程序“aspNetCore”在其模块列表中有一个错误模块“AspNetCoreModuleV2" 解决办法 错误分析: IIS服务器上的.net core 运行时不是最新的、或者没有安装.NetCoreRuntime,导致AspNetCoreModuleV2模块缺失或者报错 解决方法: 下载最新的:《.Net Core Runtim...
ASP.NET项目运行时报错,高手帮忙啊!!!
项目如果从解决方案右击页面名在流浏览器查看可以正常运行,但如果F5运行的话就会出现这样的错误rn[img=C:\Documents and Settings\Administrator\桌面、QQ截图未命名.png][/img]rn打的开的页面也是空白的rn[img=http://C:\Documents and Settings\Administrator\桌面\QQ截图未命名1.png][/img]rn而且还不能关闭,只能从任务管理器中结束任务才能关闭rn最最最重要的是它出现还有机率,如果有错误,可能过几分钟又可以正常按F5运行,可能过一会又会报这样的错rn求高手指教
vue项目运行时报错整理1
vue-cli刚搭建好项目,运行时报错 项目下面报错 error in ./src/components/Hello.vue Syntax Error: Unexpected token { @ ./~/vue-style-loader!./~/css-loader?{"minimize":false,"sourceMap":false}!./~/vue-loader/lib/style-
Django 项目(python 3.6)运行时连接数据库报错
现场一: django.core.exceptions.ImproperlyConfigured: Error loading MySQLdb module. Did you install mysqlclient? 这个报错可以说是非常常见的一个报错,解决办法很简单,在init.py文件里,加入如下代码: “` import pymysql if name == ‘main‘: ...
springboot的gradle项目导入后,运行时报错
springboot的gradle项目导入idea后,运行时报错; 看报错提示信息:   解决方案:    
相关热词 c#入门推荐书 c# 解码海康数据流 c# xml的遍历循环 c# 取 查看源码没有的 c#解决高并发 委托 c#日期转化为字符串 c# 显示问号 c# 字典对象池 c#5.0 安装程序 c# 分页算法