Qt编译报错'float' is not a class, struct, or union type 2C

本人刚刚在VS下写好了导师给的小项目,并且已经成功编译调试和运行,
图片说明
前两天被要求做一个简易的UI,决定使用Qtcreator,并且已经搭建好了环境,成功在Qtcreator下配置好了opencv,并且进行了简单的测试。
图片说明
而问题出现在我把VS中的代码转移过去,然后基本配置好了UI界面和函数之间的联系,准备调试的时候,出现了以下错误:
图片说明

根本就没有进入调试,在编译期间就出现了这个错误,而且错误定位在
图片说明
真的是无从下手。
上网看了以下,有说法是我自定义的函数和命名空间里面的函数冲突了,导致我给某个函数的实参数量或者类型不匹配。
然而我自定义的函数总共就这么俩:
图片说明
重命名后也没有解决问题。
卡这儿两天了,感觉又是个不痛不痒的问题,拖延我的进度,求大神指教!

1个回答

float是关键字,是不是你把变量定义为这个了

lpx930711
咸鱼新 肯定没有啊,VS编译调试都是通过的。
接近 3 年之前 回复
Csdn user default icon
上传中...
上传图片
插入图片
抄袭、复制答案,以达到刷声望分或其他目的的行为,在CSDN问答是严格禁止的,一经发现立刻封号。是时候展现真正的技术了!
其他相关推荐
关于QT上编译运行报错的问题

最近在编写一个试验程序,中间需要用到读取一个文件夹中全部txt文件的操作,便谢了个小程序返回指定文件夹下所有txt文件名的小程序,开始用QT编译运行,才输出一行就报错 截图如下图一二: 开始一直以为是自己程序的问题,检查觉得没错,就用DevC++编译了一下 能够成功运行并输出,截图如下图三 求问大神,这是什么问题呢 并求解决办法 谢谢 附加我的代码: ``` #include <stdio.h> #include <io.h> #include <iostream> #include <string> using namespace std; const char *to_search="D:\\FileTest\\test\\*.txt"; //欲查找的文件,支持通配符 int main() { string location_base="D:\\FileTest\\test\\"; string location[4]; long handle; //用于查找的句柄 struct _finddata_t fileinfo; //文件信息的结构体 handle=_findfirst(to_search,&fileinfo); //第一次查找 int i=0; if(-1==handle)return -1; printf("%s\n",fileinfo.name); //打印出找到的文件的文件名 location[i]=location_base; location[i].append(fileinfo.name); cout<<location[i]<<endl; while(_findnext(handle,&fileinfo)==0) //循环查找其他符合的文件,知道找不到其他的为止 { i++; printf("%s\n",fileinfo.name); location[i]=location_base; location[i].append(fileinfo.name); cout<<location[i]<<endl; } _findclose(handle); //关闭句柄 return 0; } ``` ![图片说明](https://img-ask.csdn.net/upload/201610/15/1476497715_84069.png)![图片说明](https://img-ask.csdn.net/upload/201610/15/1476497734_728545.png) ![图片说明](https://img-ask.csdn.net/upload/201610/15/1476498026_396549.png)

Qt编译报错,请各位大佬帮忙解决一下,谢谢

Qt小白,写代码的时候在定义全局变量的时候发生了问题,请大佬帮忙解决一下,谢谢 相关报错信息: ![报错](https://img-ask.csdn.net/upload/202003/01/1583074912_213652.png) mainwindow.h ![mainwindow.h](https://img-ask.csdn.net/upload/202003/01/1583075032_110334.png) mainwindow.cpp ![图片说明](https://img-ask.csdn.net/upload/202003/01/1583075083_445614.png) mainwindow.h 和 mainwindow.cpp ``` #ifndef MAINWINDOW_H #define MAINWINDOW_H #include <QMainWindow> #include <QDialog> #include <QLabel> #include <QLineEdit> #include <QPushButton> #include <QString> #include <allinall.h> #include <winborrow.h> #define M 11 #define MAXN 1000000 namespace Ui { class MainWindow; } class MainWindow : public QMainWindow { Q_OBJECT public: explicit MainWindow(QWidget *parent = 0); ~MainWindow(); struct position{ int area; int row; }; static struct BooksA{ QString ISBN="-1"; QString name="-1"; position pos; }bookA[MAXN],init; private slots: void on_BorrowBTN_clicked(); private: Ui::MainWindow *ui; }; #endif // MAINWINDOW_H ------------------------------------------------------------ #include <mainwindow.h> #include <ui_mainwindow.h> #include <bits/stdc++.h> #define M 11 #define MAXN 1000000 MainWindow::BooksA MainWindow::bookA[MAXN]; bookA[1].ISBN="12345"; bookA[2].ISBN="54321"; bookA[1].name="宝可梦图鉴"; bookA[2].name="武林外传"; MainWindow::MainWindow(QWidget *parent) : QMainWindow(parent), ui(new Ui::MainWindow) { ui->setupUi(this); } MainWindow::~MainWindow() { delete ui; } //int main(int argc, char *argv[]){ // ifstream input; // input.open("D:\\SESbooktest.txt"); // input>>n // for(int i=1;i<=n;i++){ // QString loca1,loca2; // input>>WinBorrow::bookA[i].ISBN>>WinBorrow::bookA[i].name>>WinBorrow::bookA[i].pos.area // } //} void MainWindow::on_BorrowBTN_clicked() { WinBorrow *winborrow; winborrow = new WinBorrow; winborrow->show(); } ```

VS2017+Qt开发环境,编译报错“error LNK2001: 无法解析的外部符号”,请各位大神指导。

1、问题描述 VS2017+Qt开发环境,编译报错“error LNK2001: 无法解析的外部符号”,编译具体结果如下图所示。 ![图片说明](https://img-ask.csdn.net/upload/201907/04/1562240644_143448.jpg) 请各位大神帮忙看下,多谢了。

MFC编程错误;must have class/struct/union type

![图片说明](https://img-ask.csdn.net/upload/201511/23/1448277212_961233.png)![图片说明](https://img-ask.csdn.net/upload/201511/23/1448277328_126135.png) 应该如何解决,求大神赐教!

QT头文件报错,请问下大家有没有遇到过类似的问题

QT头文件qextserialport.h报错 报错问题/home/zdd/桌面/t/X86/moc_qextserialport.cpp:97: 错误:invalid use of incomplete type 'struct QextSerialPortPrivate' /home/zdd/桌面/t/X86/../qextserialport.h:167: 错误:forward declaration of 'struct QextSerialPortPrivate' ![图片说明](https://img-ask.csdn.net/upload/201910/17/1571276836_79366.png) ![图片说明](https://img-ask.csdn.net/upload/201910/17/1571276852_531721.png)

求解决Error C2039 'CLASS': is not a member of 'STUINFO'

struct STUINFO { // 学号、名字、班级 char NUM[10], NAME[10], ClASS[10]; // 三门成绩 int CHINESE, MATH, ENGLISH,AVERAGE; };

C++ 结构体在C#中托管调用,编译报错误is not supported by the language

初学C#调用C++代码,想在C#中调用C++ 动态库的一个结构体,但编译时,报“XXX is not supported by the language”错误,不知道怎么修改。 代码如下: ``` C++: #define TEST_STRUCT(name) [StructLayoutAttribute(LayoutKind::Sequential, Pack = 1)]\ typedef public ref struct name namespace CPlusPlusDll { TEST_STRUCT(A) { unsigned long a; void operator=(const unsigned long val) { a = val; } unsigned long GetID() { return a; } }A; TEST_STRUCT(B) { A aTest; unsigned long c; }B; TEST_STRUCT(C) { B b; C() { b.aTest = b.c; } }C; } C#: using System; using System.Runtime.InteropServices; using CPlusPlusDll; namespace CSharpTest { class Program { static void Main(string[] args) { B b = new B(); b.a.GetID(); int len = Marshal.SizeOf(typeof(B)); Console.WriteLine("length of B is: {0}", len); Console.Read(); } } } ``` 编译报错: 'CPlusPlusDll.C.b' is not supported by the language 请高手指点一下,要如何修改才能完全编译通过,在C#下可以使用?

QT编译错误:XXX does not name a type【如图】

![![图片说明](https://img-ask.csdn.net/upload/201607/14/1468486745_711623.png)图片说明](https://img-ask.csdn.net/upload/201607/14/1468486734_573715.png)

Qt5Qftp编译报错,外部链接问题

我明明用的是源码,就是QFtp的源码编译,还是会出现 1>filetrans.obj : error LNK2019: 无法解析的外部符号 "public: __thiscall QFtp::QFtp(class QObject *)" (??0QFtp@@QAE@PAVQObject@@@Z),该符号在函数 "public: __thiscall FileTrans::FileTrans(void)" (??0FileTrans@@QAE@XZ) 中被引用 1>filetrans.obj : error LNK2019: 无法解析的外部符号 "public: virtual __thiscall QFtp::~QFtp(void)" (??1QFtp@@UAE@XZ),该符号在函数 "public: virtual __thiscall FileTrans::~FileTrans(void)" (??1FileTrans@@UAE@XZ) 中被引用 1>filetrans.obj : error LNK2019: 无法解析的外部符号 "public: int __thiscall QFtp::get(class QString const &,class QIODevice *,enum QFtp::TransferType)" (?get@QFtp@@QAEHABVQString@@PAVQIODevice@@W4TransferType@1@@Z),该符号在函数 "public: void __thiscall FileTrans::DownlodFile(class QString const &,class QString const &)" (?DownlodFile@FileTrans@@QAEXABVQString@@0@Z) 中被引用 1>filetrans.obj : error LNK2019: 无法解析的外部符号 "public: int __thiscall QFtp::put(class QIODevice *,class QString const &,enum QFtp::TransferType)" (?put@QFtp@@QAEHPAVQIODevice@@ABVQString@@W4TransferType@1@@Z),该符号在函数 "public: void __thiscall FileTrans::UploadFile(class QString const &,class QString const &)" (?UploadFile@FileTrans@@QAEXABVQString@@0@Z) 中被引用 1>moc_filetrans.obj : error LNK2001: 无法解析的外部符号 "public: static struct QMetaObject const QFtp::staticMetaObject" (?staticMetaObject@QFtp@@2UQMetaObject@@B) 1>moc_filetrans.obj : error LNK2019: 无法解析的外部符号 "public: virtual void * __thiscall QFtp::qt_metacast(char const *)" (?qt_metacast@QFtp@@UAEPAXPBD@Z),该符号在函数 "public: virtual void * __thiscall FileTrans::qt_metacast(char const *)" (?qt_metacast@FileTrans@@UAEPAXPBD@Z) 中被引用 1>moc_filetrans.obj : error LNK2019: 无法解析的外部符号 "public: virtual int __thiscall QFtp::qt_metacall(enum QMetaObject::Call,int,void * *)" (?qt_metacall@QFtp@@UAEHW4Call@QMetaObject@@HPAPAX@Z),该符号在函数 "public: virtual int __thiscall FileTrans::qt_metacall(enum QMetaObject::Call,int,void * *)" (?qt_metacall@FileTrans@@UAEHW4Call@QMetaObject@@HPAPAX@Z) 中被引用 1>winscp.obj : error LNK2019: 无法解析的外部符号 "public: int __thiscall QFtp::connectToHost(class QString const &,unsigned short)" (?connectToHost@QFtp@@QAEHABVQString@@G@Z),该符号在函数 __catch$?slot_btn_Get_clicked@WinScp@@AAEXXZ$0 中被引用 1>winscp.obj : error LNK2019: 无法解析的外部符号 "public: int __thiscall QFtp::login(class QString const &,class QString const &)" (?login@QFtp@@QAEHABVQString@@0@Z),该符号在函数 __catch$?slot_btn_Get_clicked@WinScp@@AAEXXZ$0 中被引用 1>winscp.obj : error LNK2019: 无法解析的外部符号 "public: void __thiscall QFtp::abort(void)" (?abort@QFtp@@QAEXXZ),该符号在函数 __catch$?slot_btn_Get_clicked@WinScp@@AAEXXZ$0 中被引用 1>D:\workspace\test\WinScp\Win32\Debug\\WinScp.exe : fatal error LNK1120: 10 个无法解析的外部命令 报错,运行环境是vs2012+Qt5.2,求大神解答。。

qt 中结构体添加构造函数后报错

我定义了一个结构体并添加了构造函数: ``` struct DataInfo{ GLenum type; const char* filename; int note; DataInfo(){ type = 0; filename = nullptr; note = 0; } }; ``` 但是在初始化一个结构体时: ``` DataInfo pain = {1,"../texture/red.file",null}; ``` qt报错:could not convert '{1, "../texture/red.file"}' from 'brace-enclosed initializer list' to 'ShaderInfo'

有Json标记,但未导出[重复]

<div class="post-text" itemprop="text"> <div class="question-status question-originals-of-duplicate"> <p>This question already has an answer here:</p> <ul> <li> <a href="/questions/11126793/json-and-dealing-with-unexported-fields" dir="ltr">JSON and dealing with unexported fields</a> <span class="question-originals-answer-count"> 2 answers </span> </li> <li> <a href="/questions/25595096/unmarshalling-json-golang-not-working" dir="ltr">(un)marshalling json golang not working</a> <span class="question-originals-answer-count"> 2 answers </span> </li> </ul> </div> <p>Begining to study golang. Task: Get Json and Unmarshall it. But I get mistake:</p> <pre><code>Json tag but not exported </code></pre> <p>How to make unexported fields become exported and then implement it using methods?</p> <p>Here is the code:</p> <pre><code>package main import ( "encoding/json" "fmt" "io/ioutil" "net/http" ) type Time struct { time } type time struct { id string `json:"$id"` currentDateTime string `json:"currentDateTime,string"` utcOffset float64 `json:"utcOffset,string"` isDayLightSavingsTime bool `json:"isDayLightSavingsTime,string"` dayOfTheWeek string `json:"dayOfTheWeek,string"` timeZoneName string `json:"timeZoneName,string"` currentFileTime float64 `json:"currentFileTime,string"` ordinalDate string `json:"ordinalDate,string"` serviceResponse string `json:"serviceResponse,string"` } func (t *Time) GetTime() (Time, error) { result := Time{} return result, t.Timenow(result) } func (t *Time) Timenow(result interface{}) error { res, err := http.Get("http://worldclockapi.com/api/json/utc/now") if err != nil { fmt.Println("Cannot get Json", err) } body, err := ioutil.ReadAll(res.Body) if err != nil { fmt.Println("Cannot create Body", err) } defer res.Body.Close() var resultJson interface{} return json.Unmarshal(body, &amp;resultJson) } func main() { var a Time t, err := a.GetTime() if err != nil { fmt.Println("Error ", err) } fmt.Println("Time:", t) } </code></pre> <p>Please explain in details whats wrong with struct and how to get right response?</p> </div>

Linux 下学习hook函数使用时用GCC编译报错

使用linux下netfilter和hook函数,使用结构体nf_hook_ops定义时总是报错 invalid use of undefined type ‘struct nf_hook_ops’,我已经在添加了该有的头文件,代码和网上很多一样,就是简单的netfilter hook代码。求dalao解惑!linux是火帽3.2.2-5,。代码和编译情况如下: ``` #ifndef MODULE #define MODULE #endif #ifndef __KERNEL__ #define __KERNEL__ #endif #include <linux/module.h> #include <linux/kernel.h> #include <linux/netdevice.h> #include <linux/netfilter.h> #include <linux/netfilter_ipv4.h> /*hook处理函数*/ unsigned int hook_func(unsigned int hook, struct sk_buff *skb, const struct net_device *in, const struct net_device *out, int (*okfn)(struct sk_buff *)); /*注册hook函数数据结构*/ static struct nf_hook_ops my_hook; /*初始化程序*/ int init_module() { my_hook.hook=hook_func; //my_hook.owner=THIS_MODULE; my_hook.pf= PF_INET; my_hook.hooknum= NF_IP_LOCAL_IN; my_hook.priority = NF_IP_PRI_FIRST; nf_register_hook(my_hook);//注册入内核 return 0; } /*清除钩子*/ void cleanup_moudule() { nf_unregister_hook(&my_hook);//将用户定义的钩子从内核中删除 } ``` gcc编译报错: Myfirewall.c:21: warning: `struct net_device' declared inside parameter list Myfirewall.c:21: warning: its scope is only this definition or declaration, which is probably not what you want Myfirewall.c:21: warning: `struct sk_buff' declared inside parameter list Myfirewall.c: In function `init_module': Myfirewall.c:37: invalid use of undefined type `struct nf_hook_ops' Myfirewall.c:39: invalid use of undefined type `struct nf_hook_ops' Myfirewall.c:40: invalid use of undefined type `struct nf_hook_ops' Myfirewall.c:41: invalid use of undefined type `struct nf_hook_ops' Myfirewall.c:43: `my_hook' has an incomplete type Myfirewall.c: At top level: Myfirewall.c:28: storage size of `my_hook' isn't known

结构体 编译报错 求大神帮助

S32 iRetVal = 0; IA_LPR_ROI_SET_S stLprRoi; stLprRoi.astIveImage[0].enType = IVE_IMAGE_TYPE_YUV420SP; iRetVal = IVE_CREATE_IMAGE_S(&stLprRoi.astIveImage[0], IVE_IMAGE_TYPE_YUV420SP, 1280, 720); if (LPR_OK != iRetVal) { printf("[FUNC:%s][LINE:%d]:detect init err %d\n",iRetVal); return LPR_ERROR; } int iReadNum = 0; stLprRoi.astIveImage[0].enType = IVE_IMAGE_TYPE_YUV420SP; //stLprRoi.astIveImage[0].u16Stride[0] = stLprRoi.astIveImage[0].u16Stride[0]; FILE *pScaleFile = fopen("./pic_720P/0.yuv", "rb"); for (i = 0; i < stLprRoi.astIveImage[0].u16Height * 3 / 2; i++) { iReadNum = fread(stLprRoi.astIveImage[0].pu8VirAddr[0] + i * stLprRoi.astIveImage[0].u16Stride[0], sizeof(U8), stLprRoi.astIveImage[0].u16Width, pScaleFile); if (iReadNum != stLprRoi.astIveImage[0].u16Width) { printf("ReadFile err"); } } fclose(pScaleFile); typedef struct tagIaLprROISet { #define MAX_IMAGE_NUM (5) IVE_IMAGE_S astIveImage[MAX_IMAGE_NUM]; pU8 pucImage; pU8 pucImageU; pU8 pucImageV; S32 iCandiNum; IA_LPR_PLATE_SET_S stPlateSet; } IA_LPR_ROI_SET_S; typedef struct hiIVE_IMAGE_S { IVE_IMAGE_TYPE_E enType; HI_U32 u32PhyAddr[3]; HI_U8 *pu8VirAddr[3]; HI_U16 u16Stride[3]; HI_U16 u16Width; HI_U16 u16Height; HI_U16 u16Reserved; }IVE_IMAGE_S; IA_Lpr_Test.c:177:41: error: request for member 'u16Height' in something not a structure or union for (i = 0; i < stLprRoi.astIveImage[0].u16Height * 3 / 2; i++) ^ IA_Lpr_Test.c:179:49: error: request for member 'pu8VirAddr' in something not a structure or union iReadNum = fread(stLprRoi.astIveImage[0].pu8VirAddr[0] + i * stLprRoi.astIveImage[0].u16Stride[0], sizeof(U8), stLprRoi.astIveImage[0].u16Width, pScaleFile); ^ IA_Lpr_Test.c:179:93: error: request for member 'u16Stride' in something not a structure or union iReadNum = fread(stLprRoi.astIveImage[0].pu8VirAddr[0] + i * stLprRoi.astIveImage[0].u16Stride[0], sizeof(U8), stLprRoi.astIveImage[0].u16Width, pScaleFile); ^ IA_Lpr_Test.c:179:143: error: request for member 'u16Width' in something not a structure or union iReadNum = fread(stLprRoi.astIveImage[0].pu8VirAddr[0] + i * stLprRoi.astIveImage[0].u16Stride[0], sizeof(U8), stLprRoi.astIveImage[0].u16Width, pScaleFile); ^ IA_Lpr_Test.c:180:48: error: request for member 'u16Width' in something not a structure or union if (iReadNum != stLprRoi.astIveImage[0].u16Width)

编译内核报错,请问是什么原因啊。

make uImage ARCH=arm CROSS_COMPILE=arm-linux- .......... LD .tmp_vmlinux1 arch/arm/kernel/head.o: In function `__error_p': /home/gm/study/test2/linux-2.6.39/arch/arm/kernel/head-common.S:164: relocation truncated to fit: R_ARM_CALL against symbol `printascii' defined in .text section in arch/arm/kernel/built-in.o /home/gm/study/test2/linux-2.6.39/arch/arm/kernel/head-common.S:166: relocation truncated to fit: R_ARM_CALL against symbol `printhex8' defined in .text section in arch/arm/kernel/built-in.o /home/gm/study/test2/linux-2.6.39/arch/arm/kernel/head-common.S:168: relocation truncated to fit: R_ARM_CALL against symbol `printascii' defined in .text section in arch/arm/kernel/built-in.o init/built-in.o: In function `loglevel': /home/gm/study/test2/linux-2.6.39/init/main.c:212: relocation truncated to fit: R_ARM_CALL against symbol `get_option' defined in .text section in lib/lib.a(cmdline.o) init/built-in.o: In function `parse_early_options': /home/gm/study/test2/linux-2.6.39/init/main.c:399: relocation truncated to fit: R_ARM_CALL against symbol `parse_args' defined in .text section in kernel/built-in.o init/built-in.o: In function `kernel_init': /home/gm/study/test2/linux-2.6.39/init/main.c:781: relocation truncated to fit: R_ARM_CALL against symbol `wait_for_completion' defined in .sched.text section in kernel/built-in.o init/built-in.o: In function `do_pre_smp_initcalls': /home/gm/study/test2/linux-2.6.39/init/main.c:726: relocation truncated to fit: R_ARM_CALL against symbol `do_one_initcall' defined in .text section in init/built-in.o init/built-in.o: In function `do_basic_setup': /home/gm/study/test2/linux-2.6.39/init/main.c:716: relocation truncated to fit: R_ARM_CALL against symbol `init_irq_proc' defined in .text section in kernel/built-in.o init/built-in.o: In function `do_initcalls': /home/gm/study/test2/linux-2.6.39/init/main.c:700: relocation truncated to fit: R_ARM_CALL against symbol `do_one_initcall' defined in .text section in init/built-in.o init/built-in.o: In function `kernel_init': /home/gm/study/test2/linux-2.6.39/init/main.c:804: relocation truncated to fit: R_ARM_CALL against symbol `sys_open' defined in .text section in fs/built-in.o /home/gm/study/test2/linux-2.6.39/init/main.c:807: additional relocation overflows omitted from the output make: *** [.tmp_vmlinux1] Error 1

在go中导入struct,得到“ not a type”错误

<div class="post-text" itemprop="text"> <p>I import a struct defined in another package, when try to use it to construct a literal, get a "not a type" error.</p> <p>In publish.go</p> <pre><code>type Book struct { Name string Author string Published bool } </code></pre> <p>In store.go</p> <pre><code>import "publish" func Init() { var reading publish.Book b := &amp;reading { Name: "Learn Go Lang", Author: "Rob", Published: true } } </code></pre> <p>Error: reading is not a type</p> </div>

c语言“结构体”一直报错

按照网课输入下列代码,一直报错。 看起来应该是 结构体 部分有错 但是网课的代码就这么写的…… 求问大家怎么修改! #include<stdio.h> typedef struct Lnode *List; struct Lnode{ int a[100]; int length; }; int sequentialSearch(list tb1,int k); int main(void) { int n,key; int a[100]; scanf("%d",&n); for(int i = 0 ; i < n ; i++) scanf("%d",&a[i]); scanf("%d",&key); printf("%d "sequentialSearch(a,key)); } int sequentialSearch(list tb1,int k){ int i; tb1->a[0] = k; for(i = tb1->length; &&tb1->a[i] != k;i--) ; return i; } ``` ``` ![图片说明](https://img-ask.csdn.net/upload/201807/05/1530800128_17387.png)

busybox编译报错,如何解决

用busybox编译最小根文件系统,帮忙看下错误,如果不管它继续安装的话,文件系统会缺少大部分必需的文件夹,在线等![图片说明](https://img-ask.csdn.net/upload/201807/04/1530703128_410731.jpg)

vs2008编译报错如下,求助!

1>QAxContainerd.lib(qaxobject.obj) : warning LNK4217: 本地定义的符号 ?qt_metacall@QObject@@UAEHW4Call@QMetaObject@@HPAPAX@Z (public: virtual int __thiscall QObject::qt_metacall(enum QMetaObject::Call,int,void * *)) 在函数 "public: virtual int __thiscall QAxObject::qt_metacall(enum QMetaObject::Call,int,void * *)" (?qt_metacall@QAxObject@@UAEHW4Call@QMetaObject@@HPAPAX@Z) 中导入 1>qmfcapp.obj : error LNK2019: 无法解析的外部符号 "__declspec(dllimport) public: static void __cdecl QCoreApplication::sendPostedEvents(void)" (__imp_?sendPostedEvents@QCoreApplication@@SAXXZ),该符号在函数 "long __stdcall QtFilterProc(int,unsigned int,long)" (?QtFilterProc@@YGJHIJ@Z) 中被引用 1>qwinwidget.obj : error LNK2019: 无法解析的外部符号 "__declspec(dllimport) public: bool __thiscall QChildEvent::removed(void)const " (__imp_?removed@QChildEvent@@QBE_NXZ),该符号在函数 "protected: virtual void __thiscall QWinWidget::childEvent(class QChildEvent *)" (?childEvent@QWinWidget@@MAEXPAVQChildEvent@@@Z) 中被引用 1>ui.lib(QYMainWindow.obj) : error LNK2019: 无法解析的外部符号 "__declspec(dllimport) public: static class QString __cdecl QString::fromStdWString(class std::basic_string<wchar_t,struct std::char_traits<wchar_t>,class std::allocator<wchar_t> > const &)" (__imp_?fromStdWString@QString@@SA?AV1@ABV?$basic_string@_WU?$char_traits@_W@std@@V?$allocator@_W@2@@std@@@Z),该符号在函数 "public: long __thiscall CQYMainWindow::Invoke(struct WebExternalObjectInvokeParam const &,class HtmlDialog *)" (?Invoke@CQYMainWindow@@QAEJABUWebExternalObjectInvokeParam@@PAVHtmlDialog@@@Z) 中被引用 1>libqyqtui.lib(HtmlDialog.obj) : error LNK2001: 无法解析的外部符号 "__declspec(dllimport) public: static class QString __cdecl QString::fromStdWString(class std::basic_string<wchar_t,struct std::char_traits<wchar_t>,class std::allocator<wchar_t> > const &)" (__imp_?fromStdWString@QString@@SA?AV1@ABV?$basic_string@_WU?$char_traits@_W@std@@V?$allocator@_W@2@@std@@@Z) 1>QAxContainerd.lib(qaxobject.obj) : error LNK2001: 无法解析的外部符号 "__declspec(dllimport) public: __thiscall QUuid::QUuid(struct _GUID const &)" (__imp_??0QUuid@@QAE@ABU_GUID@@@Z) 1>libqyqtui.lib(HtmlDialog.obj) : error LNK2019: 无法解析的外部符号 "__declspec(dllimport) public: __thiscall QUuid::QUuid(struct _GUID const &)" (__imp_??0QUuid@@QAE@ABU_GUID@@@Z),该符号在函数 "public: __thiscall HtmlDialog::HtmlDialog(class QWidget *,class QFlags<enum Qt::WindowType>)" (??0HtmlDialog@@QAE@PAVQWidget@@V?$QFlags@W4WindowType@Qt@@@@@Z) 中被引用 1>QAxContainerd.lib(qaxbase.obj) : error LNK2001: 无法解析的外部符号 "__declspec(dllimport) public: __thiscall QUuid::QUuid(struct _GUID const &)" (__imp_??0QUuid@@QAE@ABU_GUID@@@Z) 1>QAxContainerd.lib(qaxwidget.obj) : error LNK2001: 无法解析的外部符号 "__declspec(dllimport) public: __thiscall QUuid::QUuid(struct _GUID const &)" (__imp_??0QUuid@@QAE@ABU_GUID@@@Z) 1>QAxContainerd.lib(qaxtypes.obj) : error LNK2001: 无法解析的外部符号 "__declspec(dllimport) public: __thiscall QUuid::QUuid(struct _GUID const &)" (__imp_??0QUuid@@QAE@ABU_GUID@@@Z) 1>libqyqtui.lib(HtmlDialog.obj) : error LNK2019: 无法解析的外部符号 "__declspec(dllimport) public: class std::basic_string<wchar_t,struct std::char_traits<wchar_t>,class std::allocator<wchar_t> > __thiscall QString::toStdWString(void)const " (__imp_?toStdWString@QString@@QBE?AV?$basic_string@_WU?$char_traits@_W@std@@V?$allocator@_W@2@@std@@XZ),该符号在函数 "private: void __thiscall HtmlDialog::OnWebNavigateComplete(class QString const &)" (?OnWebNavigateComplete@HtmlDialog@@AAEXABVQString@@@Z) 中被引用 1>libqyqtui.lib(QyQtUIDialog.obj) : error LNK2019: 无法解析的外部符号 "__declspec(dllimport) public: void __thiscall QPainter::drawPixmap(int,int,int,int,class QPixmap const &,int,int,int,int)" (__imp_?drawPixmap@QPainter@@QAEXHHHHABVQPixmap@@HHHH@Z),该符号在函数 "void __cdecl DrawNinePatch(class QPainter &,class QPixmap const &,class QSize const &,int)" (?DrawNinePatch@@YAXAAVQPainter@@ABVQPixmap@@ABVQSize@@H@Z) 中被引用 1>libqyqtui.lib(NcFramelessHelper.obj) : error LNK2019: 无法解析的外部符号 "__declspec(dllimport) public: void __thiscall QRubberBand::move(class QPoint const &)" (__imp_?move@QRubberBand@@QAEXABVQPoint@@@Z),该符号在函数 "private: void __thiscall NcWidgetData::moveWidget(class QPoint const &)" (?moveWidget@NcWidgetData@@AAEXABVQPoint@@@Z) 中被引用 1>QAxContainerd.lib(qaxbase.obj) : error LNK2019: 无法解析的外部符号 "__declspec(dllimport) public: static class QString __cdecl QString::fromWCharArray(unsigned short const *,int)" (__imp_?fromWCharArray@QString@@SA?AV1@PBGH@Z),该符号在函数 "public: class QByteArray __thiscall QAxEventSink::findProperty(long)" (?findProperty@QAxEventSink@@QAE?AVQByteArray@@J@Z) 中被引用 1>QAxContainerd.lib(qaxwidget.obj) : error LNK2001: 无法解析的外部符号 "__declspec(dllimport) public: static class QString __cdecl QString::fromWCharArray(unsigned short const *,int)" (__imp_?fromWCharArray@QString@@SA?AV1@PBGH@Z) 1>QAxContainerd.lib(qaxtypes.obj) : error LNK2001: 无法解析的外部符号 "__declspec(dllimport) public: static class QString __cdecl QString::fromWCharArray(unsigned short const *,int)" (__imp_?fromWCharArray@QString@@SA?AV1@PBGH@Z) 1>QAxContainerd.lib(qaxbase.obj) : error LNK2019: 无法解析的外部符号 "__declspec(dllimport) public: class QString __thiscall QUuid::toString(void)const " (__imp_?toString@QUuid@@QBE?AVQString@@XZ),该符号在函数 "public: bool __thiscall QAxBase::setControl(class QString const &)" (?setControl@QAxBase@@QAE_NABVQString@@@Z) 中被引用 1>QAxContainerd.lib(qaxbase.obj) : error LNK2019: 无法解析的外部符号 "__declspec(dllimport) public: bool __thiscall QUuid::isNull(void)const " (__imp_?isNull@QUuid@@QBE_NXZ),该符号在函数 "public: bool __thiscall QAxBase::setControl(class QString const &)" (?setControl@QAxBase@@QAE_NABVQString@@@Z) 中被引用 1>QAxContainerd.lib(qaxbase.obj) : error LNK2019: 无法解析的外部符号 "__declspec(dllimport) public: __thiscall QUuid::QUuid(class QString const &)" (__imp_??0QUuid@@QAE@ABVQString@@@Z),该符号在函数 "public: bool __thiscall QAxBase::setControl(class QString const &)" (?setControl@QAxBase@@QAE_NABVQString@@@Z) 中被引用 1>QAxContainerd.lib(qaxbase.obj) : error LNK2019: 无法解析的外部符号 "__declspec(dllimport) public: __thiscall QUuid::operator struct _GUID(void)const " (__imp_??BQUuid@@QBE?AU_GUID@@XZ),该符号在函数 "protected: virtual bool __thiscall QAxBase::initialize(struct IUnknown * *)" (?initialize@QAxBase@@MAE_NPAPAUIUnknown@@@Z) 中被引用 1>QAxContainerd.lib(qaxbase.obj) : error LNK2019: 无法解析的外部符号 "__declspec(dllimport) public: __thiscall QUuid::QUuid(void)" (__imp_??0QUuid@@QAE@XZ),该符号在函数 "public: __thiscall MetaObjectGenerator::MetaObjectGenerator(class QAxBase *,class QAxBasePrivate *)" (??0MetaObjectGenerator@@QAE@PAVQAxBase@@PAVQAxBasePrivate@@@Z) 中被引用 1>QAxContainerd.lib(qaxbase.obj) : error LNK2019: 无法解析的外部符号 "__declspec(dllimport) public: struct QUuid & __thiscall QUuid::operator=(struct _GUID const &)" (__imp_??4QUuid@@QAEAAU0@ABU_GUID@@@Z),该符号在函数 "private: void __thiscall MetaObjectGenerator::init(void)" (?init@MetaObjectGenerator@@AAEXXZ) 中被引用 1>QAxContainerd.lib(qaxbase.obj) : error LNK2019: 无法解析的外部符号 "__declspec(dllimport) public: bool __thiscall QMetaProperty::isValid(void)const " (__imp_?isValid@QMetaProperty@@QBE_NXZ),该符号在函数 "private: int __thiscall QAxBase::internalProperty(enum QMetaObject::Call,int,void * *)" (?internalProperty@QAxBase@@AAEHW4Call@QMetaObject@@HPAPAX@Z) 中被引用 1>QAxContainerd.lib(qaxbase.obj) : error LNK2019: 无法解析的外部符号 "__declspec(dllimport) public: bool __thiscall QUuid::operator==(struct QUuid const &)const " (__imp_??8QUuid@@QBE_NABU0@@Z),该符号在函数 "public: class QBool __thiscall QList<struct QUuid>::contains(struct QUuid const &)const " (?contains@?$QList@UQUuid@@@@QBE?AVQBool@@ABUQUuid@@@Z) 中被引用 1>QAxContainerd.lib(qaxbase.obj) : error LNK2019: 无法解析的外部符号 "__declspec(dllimport) public: __thiscall QUuid::operator class QString(void)const " (__imp_??BQUuid@@QBE?AVQString@@XZ),该符号在函数 "private: struct QHashNode<struct QUuid,class QMap<class QByteArray,class QList<struct QPair<class QByteArray,int> > > > * * __thiscall QHash<struct QUuid,class QMap<class QByteArray,class QList<struct QPair<class QByteArray,int> > > >::findNode(struct QUuid const &,unsigned int *)const " (?findNode@?$QHash@UQUuid@@V?$QMap@VQByteArray@@V?$QList@U?$QPair@VQByteArray@@H@@@@@@@@ABEPAPAU?$QHashNode@UQUuid@@V?$QMap@VQByteArray@@V?$QList@U?$QPair@VQByteArray@@H@@@@@@@@ABUQUuid@@PAI@Z) 中被引用 1>QAxContainerd.lib(qaxbase.obj) : error LNK2019: 无法解析的外部符号 "__declspec(dllimport) public: bool __thiscall QUuid::operator<(struct QUuid const &)const " (__imp_??MQUuid@@QBE_NABU0@@Z),该符号在函数 "bool __cdecl qMapLessThanKey<struct QUuid>(struct QUuid const &,struct QUuid const &)" (??$qMapLessThanKey@UQUuid@@@@YA_NABUQUuid@@0@Z) 中被引用 1>C:\CC-trunk\vsproject\..\bin\CC.exe : fatal error LNK1120: 18 个无法解析的外部命令 1>生成日志保存在“file://c:\CC-trunk\vsproject\CC\Debug\BuildLog.htm” 1>CC - 26 个错误,1146 个警告 ========== 生成: 成功 0 个,失败 1 个,最新 54 个,跳过 0 个 ==========

请问一下这个c程序有什么问题

题目:有n=3个结构体变量,内含学生学号,姓名和3门课程的成绩。要求输出平均成绩最高的学生的信息。 ``` #include <stdio.h> #define n 3 struct student {long int number; char name[20]; float s1,s2,s3; float average; }; int main() {void input(struct student *p); struct student max(struct student *p); void print(struct student p); struct student stu[n],*p=stu; input(p); print(max(p)); return 0; } void input(struct student *p) {int i; for(i=0;i<n;i++) {printf("enter student%d's number,name,3 scores:",i+1); scanf("%ld%s%f%f%f",&*(p+i).number,*(p+i).name,&*(p+i).s1,&*(p+i).s2,&*(p+i).s3); *(p+i).average=(*(p+i).s1+*(p+i).s2+*(p+i).s3)/3.0; } } struct student max(struct student *p) {int i,max; max=0; for(i=1;i<n;i++) if(*(p+max).average<*(p+i).average) max=i; return *(p+max); } void print(struct student p) { printf("number=&ld,name=%s,score1=%f,score2=%f,score3=%f",p.number,p.name,p.s1,p.s2,p.s3); } ``` --------------------Configuration: 6 - Win32 Debug-------------------- Compiling... 66.cpp D:\vc 6.0\Microsoft Visual Studio\MyProjects\6\66.cpp(22) : error C2228: left of '.number' must have class/struct/union type D:\vc 6.0\Microsoft Visual Studio\MyProjects\6\66.cpp(22) : error C2228: left of '.name' must have class/struct/union type D:\vc 6.0\Microsoft Visual Studio\MyProjects\6\66.cpp(22) : error C2228: left of '.s1' must have class/struct/union type D:\vc 6.0\Microsoft Visual Studio\MyProjects\6\66.cpp(22) : error C2228: left of '.s2' must have class/struct/union type D:\vc 6.0\Microsoft Visual Studio\MyProjects\6\66.cpp(22) : error C2228: left of '.s3' must have class/struct/union type D:\vc 6.0\Microsoft Visual Studio\MyProjects\6\66.cpp(23) : error C2228: left of '.average' must have class/struct/union type D:\vc 6.0\Microsoft Visual Studio\MyProjects\6\66.cpp(23) : error C2228: left of '.s1' must have class/struct/union type D:\vc 6.0\Microsoft Visual Studio\MyProjects\6\66.cpp(23) : error C2228: left of '.s2' must have class/struct/union type D:\vc 6.0\Microsoft Visual Studio\MyProjects\6\66.cpp(23) : error C2228: left of '.s3' must have class/struct/union type D:\vc 6.0\Microsoft Visual Studio\MyProjects\6\66.cpp(31) : error C2228: left of '.average' must have class/struct/union type D:\vc 6.0\Microsoft Visual Studio\MyProjects\6\66.cpp(31) : error C2228: left of '.average' must have class/struct/union type 执行 cl.exe 时出错.

定量遥感中文版 梁顺林著 范闻捷译

这是梁顺林的定量遥感的中文版,由范闻捷等翻译的,是电子版PDF,解决了大家看英文费时费事的问题,希望大家下载看看,一定会有帮助的

Java 最常见的 200+ 面试题:面试必备

这份面试清单是从我 2015 年做了 TeamLeader 之后开始收集的,一方面是给公司招聘用,另一方面是想用它来挖掘在 Java 技术栈中,还有那些知识点是我不知道的,我想找到这些技术盲点,然后修复它,以此来提高自己的技术水平。虽然我是从 2009 年就开始参加编程工作了,但我依旧觉得自己现在要学的东西很多,并且学习这些知识,让我很有成就感和满足感,那所以何乐而不为呢? 说回面试的事,这份面试...

机器学习初学者必会的案例精讲

通过六个实际的编码项目,带领同学入门人工智能。这些项目涉及机器学习(回归,分类,聚类),深度学习(神经网络),底层数学算法,Weka数据挖掘,利用Git开源项目实战等。

远程工具,免费

远程工具,免费

java jdk 8 帮助文档 中文 文档 chm 谷歌翻译

JDK1.8 API 中文谷歌翻译版 java帮助文档 JDK API java 帮助文档 谷歌翻译 JDK1.8 API 中文 谷歌翻译版 java帮助文档 Java最新帮助文档 本帮助文档是使用谷

csma/ca和csma/cd的matlab仿真源代码带有详细的注释

csma/ca和csma/cd的matlab仿真源代码带有详细的注释,载波侦听,随意设置节点数,带有炫酷的图形展示效果。

Java基础知识面试题(2020最新版)

文章目录Java概述何为编程什么是Javajdk1.5之后的三大版本JVM、JRE和JDK的关系什么是跨平台性?原理是什么Java语言有哪些特点什么是字节码?采用字节码的最大好处是什么什么是Java程序的主类?应用程序和小程序的主类有何不同?Java应用程序与小程序之间有那些差别?Java和C++的区别Oracle JDK 和 OpenJDK 的对比基础语法数据类型Java有哪些数据类型switc...

软件测试入门、SQL、性能测试、测试管理工具

软件测试2小时入门,让您快速了解软件测试基本知识,有系统的了解; SQL一小时,让您快速理解和掌握SQL基本语法 jmeter性能测试 ,让您快速了解主流来源性能测试工具jmeter 测试管理工具-禅道,让您快速学会禅道的使用,学会测试项目、用例、缺陷的管理、

pokemmo的资源

pokemmo必须的4个rom 分别为绿宝石 火红 心金 黑白 还有汉化补丁 资源不错哦 记得下载

三个项目玩转深度学习(附1G源码)

从事大数据与人工智能开发与实践约十年,钱老师亲自见证了大数据行业的发展与人工智能的从冷到热。事实证明,计算机技术的发展,算力突破,海量数据,机器人技术等,开启了第四次工业革命的序章。深度学习图像分类一直是人工智能的经典任务,是智慧零售、安防、无人驾驶等机器视觉应用领域的核心技术之一,掌握图像分类技术是机器视觉学习的重中之重。针对现有线上学习的特点与实际需求,我们开发了人工智能案例实战系列课程。打造:以项目案例实践为驱动的课程学习方式,覆盖了智能零售,智慧交通等常见领域,通过基础学习、项目案例实践、社群答疑,三维立体的方式,打造最好的学习效果。

无线通信中的智能天线:IS-95和第3代CDMA应用_.pdf

无线通信中的智能天线:IS-95和第3代CDMA应用_.pdf

设计模式(JAVA语言实现)--20种设计模式附带源码

课程亮点: 课程培训详细的笔记以及实例代码,让学员开始掌握设计模式知识点 课程内容: 工厂模式、桥接模式、组合模式、装饰器模式、外观模式、享元模式、原型模型、代理模式、单例模式、适配器模式 策略模式、模板方法模式、观察者模式、迭代器模式、责任链模式、命令模式、备忘录模式、状态模式、访问者模式 课程特色: 笔记设计模式,用笔记串连所有知识点,让学员从一点一滴积累,学习过程无压力 笔记标题采用关键字标识法,帮助学员更加容易记住知识点 笔记以超链接形式让知识点关联起来,形式知识体系 采用先概念后实例再应用方式,知识点深入浅出 提供授课内容笔记作为课后复习以及工作备查工具 部分图表(电脑PC端查看):

Java8零基础入门视频教程

这门课程基于主流的java8平台,由浅入深的详细讲解了java SE的开发技术,可以使java方向的入门学员,快速扎实的掌握java开发技术!

玩转Linux:常用命令实例指南

人工智能、物联网、大数据时代,Linux正有着一统天下的趋势,几乎每个程序员岗位,都要求掌握Linux。本课程零基础也能轻松入门。 本课程以简洁易懂的语言手把手教你系统掌握日常所需的Linux知识,每个知识点都会配合案例实战让你融汇贯通。课程通俗易懂,简洁流畅,适合0基础以及对Linux掌握不熟练的人学习; 【限时福利】 1)购课后按提示添加小助手,进答疑群,还可获得价值300元的编程大礼包! 2)本月购买此套餐加入老师答疑交流群,可参加老师的免费分享活动,学习最新技术项目经验。 --------------------------------------------------------------- 29元=掌握Linux必修知识+社群答疑+讲师社群分享会+700元编程礼包。 &nbsp;

极简JAVA学习营第四期(报名以后加助教微信:eduxy-1)

想学好JAVA必须要报两万的培训班吗? Java大神勿入 如果你: 零基础想学JAVA却不知道从何入手 看了一堆书和视频却还是连JAVA的环境都搭建不起来 囊中羞涩面对两万起的JAVA培训班不忍直视 在职没有每天大块的时间专门学习JAVA 那么恭喜你找到组织了,在这里有: 1. 一群志同道合立志学好JAVA的同学一起学习讨论JAVA 2. 灵活机动的学习时间完成特定学习任务+每日编程实战练习 3. 热心助人的助教和讲师及时帮你解决问题,不按时完成作业小心助教老师的家访哦 上一张图看看前辈的感悟: &nbsp; &nbsp; 大家一定迫不及待想知道什么是极简JAVA学习营了吧,下面就来给大家说道说道: 什么是极简JAVA学习营? 1. 针对Java小白或者初级Java学习者; 2. 利用9天时间,每天1个小时时间; 3.通过 每日作业 / 组队PK / 助教答疑 / 实战编程 / 项目答辩 / 社群讨论 / 趣味知识抢答等方式让学员爱上学习编程 , 最终实现能独立开发一个基于控制台的‘库存管理系统’ 的学习模式 极简JAVA学习营是怎么学习的? &nbsp; 如何报名? 只要购买了极简JAVA一:JAVA入门就算报名成功! &nbsp;本期为第四期极简JAVA学习营,我们来看看往期学员的学习状态: 作业看这里~ &nbsp; 助教的作业报告是不是很专业 不交作业打屁屁 助教答疑是不是很用心 &nbsp; 有奖抢答大家玩的很嗨啊 &nbsp; &nbsp; 项目答辩终于开始啦 &nbsp; 优秀者的获奖感言 &nbsp; 这是答辩项目的效果 &nbsp; &nbsp; 这么细致的服务,这么好的氛围,这样的学习效果,需要多少钱呢? 不要1999,不要199,不要99,只要9.9 是的你没听错,只要9.9以上所有就都属于你了 如果你: 1、&nbsp;想学JAVA没有基础 2、&nbsp;想学JAVA没有整块的时间 3、&nbsp;想学JAVA没有足够的预算 还等什么?赶紧报名吧,抓紧抢位,本期只招300人,错过只有等时间待定的下一期了 &nbsp; 报名请加小助手微信:eduxy-1 &nbsp; &nbsp;

Python数据清洗实战入门

本次课程主要以真实的电商数据为基础,通过Python详细的介绍了数据分析中的数据清洗阶段各种技巧和方法。

董付国老师Python全栈学习优惠套餐

购买套餐的朋友可以关注微信公众号“Python小屋”,上传付款截图,然后领取董老师任意图书1本。

linux下利用/proc进行进程树的打印

在linux下利用c语言实现的进程树的打印,主要通过/proc下的目录中的进程文件,获取status中的进程信息内容,然后利用递归实现进程树的打印

MySQL数据库面试题(2020最新版)

文章目录数据库基础知识为什么要使用数据库什么是SQL?什么是MySQL?数据库三大范式是什么mysql有关权限的表都有哪几个MySQL的binlog有有几种录入格式?分别有什么区别?数据类型mysql有哪些数据类型引擎MySQL存储引擎MyISAM与InnoDB区别MyISAM索引与InnoDB索引的区别?InnoDB引擎的4大特性存储引擎选择索引什么是索引?索引有哪些优缺点?索引使用场景(重点)...

HoloLens2开发入门教程

本课程为HoloLens2开发入门教程,讲解部署开发环境,安装VS2019,Unity版本,Windows SDK,创建Unity项目,讲解如何使用MRTK,编辑器模拟手势交互,打包VS工程并编译部署应用到HoloLens上等。

150讲轻松搞定Python网络爬虫

【为什么学爬虫?】 &nbsp; &nbsp; &nbsp; &nbsp;1、爬虫入手容易,但是深入较难,如何写出高效率的爬虫,如何写出灵活性高可扩展的爬虫都是一项技术活。另外在爬虫过程中,经常容易遇到被反爬虫,比如字体反爬、IP识别、验证码等,如何层层攻克难点拿到想要的数据,这门课程,你都能学到! &nbsp; &nbsp; &nbsp; &nbsp;2、如果是作为一个其他行业的开发者,比如app开发,web开发,学习爬虫能让你加强对技术的认知,能够开发出更加安全的软件和网站 【课程设计】 一个完整的爬虫程序,无论大小,总体来说可以分成三个步骤,分别是: 网络请求:模拟浏览器的行为从网上抓取数据。 数据解析:将请求下来的数据进行过滤,提取我们想要的数据。 数据存储:将提取到的数据存储到硬盘或者内存中。比如用mysql数据库或者redis等。 那么本课程也是按照这几个步骤循序渐进的进行讲解,带领学生完整的掌握每个步骤的技术。另外,因为爬虫的多样性,在爬取的过程中可能会发生被反爬、效率低下等。因此我们又增加了两个章节用来提高爬虫程序的灵活性,分别是: 爬虫进阶:包括IP代理,多线程爬虫,图形验证码识别、JS加密解密、动态网页爬虫、字体反爬识别等。 Scrapy和分布式爬虫:Scrapy框架、Scrapy-redis组件、分布式爬虫等。 通过爬虫进阶的知识点我们能应付大量的反爬网站,而Scrapy框架作为一个专业的爬虫框架,使用他可以快速提高我们编写爬虫程序的效率和速度。另外如果一台机器不能满足你的需求,我们可以用分布式爬虫让多台机器帮助你快速爬取数据。 &nbsp; 从基础爬虫到商业化应用爬虫,本套课程满足您的所有需求! 【课程服务】 专属付费社群+每周三讨论会+1v1答疑

MySQL 8.0.19安装教程(windows 64位)

话不多说直接开干 目录 1-先去官网下载点击的MySQL的下载​ 2-配置初始化的my.ini文件的文件 3-初始化MySQL 4-安装MySQL服务 + 启动MySQL 服务 5-连接MySQL + 修改密码 先去官网下载点击的MySQL的下载 下载完成后解压 解压完是这个样子 配置初始化的my.ini文件的文件 ...

Python数据挖掘简易入门

&nbsp; &nbsp; &nbsp; &nbsp; 本课程为Python数据挖掘方向的入门课程,课程主要以真实数据为基础,详细介绍数据挖掘入门的流程和使用Python实现pandas与numpy在数据挖掘方向的运用,并深入学习如何运用scikit-learn调用常用的数据挖掘算法解决数据挖掘问题,为进一步深入学习数据挖掘打下扎实的基础。

深度学习原理+项目实战+算法详解+主流框架(套餐)

深度学习系列课程从深度学习基础知识点开始讲解一步步进入神经网络的世界再到卷积和递归神经网络,详解各大经典网络架构。实战部分选择当下最火爆深度学习框架PyTorch与Tensorflow/Keras,全程实战演示框架核心使用与建模方法。项目实战部分选择计算机视觉与自然语言处理领域经典项目,从零开始详解算法原理,debug模式逐行代码解读。适合准备就业和转行的同学们加入学习! 建议按照下列课程顺序来进行学习 (1)掌握深度学习必备经典网络架构 (2)深度框架实战方法 (3)计算机视觉与自然语言处理项目实战。(按照课程排列顺序即可)

网络工程师小白入门--【思科CCNA、华为HCNA等网络工程师认证】

本课程适合CCNA或HCNA网络小白同志,高手请绕道,可以直接学习进价课程。通过本预科课程的学习,为学习网络工程师、思科CCNA、华为HCNA这些认证打下坚实的基础! 重要!思科认证2020年2月24日起,已启用新版认证和考试,包括题库都会更新,由于疫情原因,请关注官网和本地考点信息。题库网络上很容易下载到。

Ubuntu18.04安装教程

Ubuntu18.04.1安装一、准备工作1.下载Ubuntu18.04.1 LTS2.制作U盘启动盘3.准备 Ubuntu18.04.1 的硬盘空间二、安装Ubuntu18.04.1三、安装后的一些工作1.安装输入法2.更换软件源四、双系统如何卸载Ubuntu18.04.1新的改变功能快捷键合理的创建标题,有助于目录的生成如何改变文本的样式插入链接与图片如何插入一段漂亮的代码片生成一个适合你的列...

sql语句 异常 Err] 1064 - You have an error in your SQL syntax; check the manual that corresponds to your

在我们开发的工程中,有时候会报 [Err] 1064 - You have an error in your SQL syntax; check the manual that corresponds to your MySQL server version for the right syntax to use near ------ 这种异常 不用多想,肯定是我们的sql语句出现问题,下面...

西南交通大学新秀杯数学建模试题

题目比较难,如果符合大家的口味欢迎大家下载哈,提高你的思维想象能力

Windows版YOLOv4目标检测实战:训练自己的数据集

课程演示环境:Windows10; cuda 10.2; cudnn7.6.5; Python3.7; VisualStudio2019; OpenCV3.4 需要学习ubuntu系统上YOLOv4的同学请前往:《YOLOv4目标检测实战:训练自己的数据集》 课程链接:https://edu.csdn.net/course/detail/28745 YOLOv4来了!速度和精度双提升! 与 YOLOv3 相比,新版本的 AP (精度)和 FPS (每秒帧率)分别提高了 10% 和 12%。 YOLO系列是基于深度学习的端到端实时目标检测方法。本课程将手把手地教大家使用labelImg标注和使用YOLOv4训练自己的数据集。课程实战分为两个项目:单目标检测(足球目标检测)和多目标检测(足球和梅西同时检测)。 本课程的YOLOv4使用AlexyAB/darknet,在Windows系统上做项目演示。包括:安装软件环境、安装YOLOv4、标注自己的数据集、整理自己的数据集、修改配置文件、训练自己的数据集、测试训练出的网络模型、性能统计(mAP计算)和先验框聚类分析。还将介绍改善YOLOv4目标检测性能的技巧。 除本课程《Windows版YOLOv4目标检测实战:训练自己的数据集》外,本人将推出有关YOLOv4目标检测的系列课程。请持续关注该系列的其它视频课程,包括: 《Windows版YOLOv4目标检测实战:人脸口罩佩戴检测》 《Windows版YOLOv4目标检测实战:中国交通标志识别》 《Windows版YOLOv4目标检测:原理与源码解析》

Spring Boot -01- 快速入门篇(图文教程)

Spring Boot -01- 快速入门篇 今天开始不断整理 Spring Boot 2.0 版本学习笔记,大家可以在博客看到我的笔记,然后大家想看视频课程也可以到【慕课网】手机 app,去找【Spring Boot 2.0 深度实践】的课程,令人开心的是,课程完全免费! 什么是 Spring Boot? Spring Boot 是由 Pivotal 团队提供的全新框架。Spring Boot...

相关热词 c# 不能序列化继承类 c# char* 调用 c# 开发dll模板 c#添加控件到工具箱 c#控制台组合数 编程计算猴子吃桃问题c# c# wpf 背景透明 随机抽取号码软件c# c# 开发环境 c# 属性和字段
立即提问