reactnative启动报错 app:compileDebugJavaWithJavac

scanning folders for symlinks in E:\SimpleApp\SimpleApp\node_modules (30ms)
Starting JS server...
Building and installing the app on the device (cd android && gradlew.bat installDebug)...
Starting a new Gradle Daemon for this build (subsequent builds will be faster).
Incremental java compilation is an incubating feature.

:app:preBuild UP-TO-DATE

:app:preDebugBuild UP-TO-DATE
:app:checkDebugManifest
:app:preReleaseBuild UP-TO-DATE
:app:prepareComAndroidSupportAppcompatV72301Library UP-TO-DATE

:app:prepareComAndroidSupportSupportV42301Library UP-TO-DATE
:app:prepareComFacebookFbuiTextlayoutbuilderTextlayoutbuilder100Library UP-TO-DATE
:app:prepareComFacebookFrescoDrawee130Library UP-TO-DATE
:app:prepareComFacebookFrescoFbcore130Library UP-TO-DATE
:app:prepareComFacebookFrescoFresco130Library UP-TO-DATE
:app:prepareComFacebookFrescoImagepipeline130Library UP-TO-DATE
:app:prepareComFacebookFrescoImagepipelineBase130Library UP-TO-DATE
:app:prepareComFacebookFrescoImagepipelineOkhttp3130Library UP-TO-DATE
:app:prepareComFacebookReactReactNative0493Library UP-TO-DATE
:app:prepareComFacebookSoloaderSoloader010Library UP-TO-DATE
:app:prepareOrgWebkitAndroidJscR174650Library UP-TO-DATE
:app:prepareDebugDependencies
:app:compileDebugAidl UP-TO-DATE

:app:compileDebugRenderscript UP-TO-DATE
:app:generateDebugBuildConfig UP-TO-DATE
:app:mergeDebugShaders UP-TO-DATE
:app:compileDebugShaders UP-TO-DATE

:app:generateDebugAssets UP-TO-DATE
:app:mergeDebugAssets UP-TO-DATE
:app:generateDebugResValues UP-TO-DATE
:app:generateDebugResources UP-TO-DATE
:app:mergeDebugResources UP-TO-DATE

:app:bundleDebugJsAndAssets SKIPPED
:app:processDebugManifest UP-TO-DATE
:app:processDebugResources UP-TO-DATE
:app:generateDebugSources UP-TO-DATE
:app:incrementalDebugJavaCompilationSafeguard UP-TO-DATE
:app:compileDebugJavaWithJavac

:app:compileDebugJavaWithJavac - is not incremental (e.g. outputs have changed, no previous execution, etc.).
:app:compileDebugJavaWithJavac FAILED

FAILURE: Build failed with an exception.

  • What went wrong: Execution failed for task ':app:compileDebugJavaWithJavac'. > Unexpected lock protocol found in lock file. Expected 3, found 0.
app

1个回答

Csdn user default icon
上传中...
上传图片
插入图片
抄袭、复制答案,以达到刷声望分或其他目的的行为,在CSDN问答是严格禁止的,一经发现立刻封号。是时候展现真正的技术了!
其他相关推荐
android stdio项目运行时报错app:compileDebugJavaWithJavac
本人刚装android stdio。运行时报错:Error:Execution failed for task ':app:compileDebugJavaWithJavac'. > Unexpected lock protocol found in lock file. Expected 3, found 0. ![图片说明](https://img-ask.csdn.net/upload/201709/18/1505723042_33294.png) 我尝试过将工程目录里的.gradle文件删除重新启动AndroidStudio导入,结果还是如上报错。 后来我查看报错信息 ![图片说明](https://img-ask.csdn.net/upload/201709/18/1505741919_262421.png) 网上没搜到相同的错误。老铁们,能不能指导一下。谢谢大家了。 ** 最新进展,这个问题已经被解决了,具体方法参见** [Error:Unexpected lock protocol found in lock file. ](http://www.cnblogs.com/cjyboy/p/6230159.html "")
Android studio一直报错app:debugAnnotationProcessorClasspath
Error:Could not resolve all files for configuration ':app:debugAnnotationProcessorClasspath'. > Could not find com.jakewharton:butterknife-compiler:5.1.1. Searched in the following locations: file:/D:/mySoftware/sdk/extras/m2repository/com/jakewharton/butterknife-compiler/5.1.1/butterknife-compiler-5.1.1.pom file:/D:/mySoftware/sdk/extras/m2repository/com/jakewharton/butterknife-compiler/5.1.1/butterknife-compiler-5.1.1.jar file:/D:/mySoftware/sdk/extras/google/m2repository/com/jakewharton/butterknife-compiler/5.1.1/butterknife-compiler-5.1.1.pom file:/D:/mySoftware/sdk/extras/google/m2repository/com/jakewharton/butterknife-compiler/5.1.1/butterknife-compiler-5.1.1.jar file:/D:/mySoftware/sdk/extras/android/m2repository/com/jakewharton/butterknife-compiler/5.1.1/butterknife-compiler-5.1.1.pom file:/D:/mySoftware/sdk/extras/android/m2repository/com/jakewharton/butterknife-compiler/5.1.1/butterknife-compiler-5.1.1.jar file:/D:/mySoftware/Android/android-studio3.0/gradle/m2repository/com/jakewharton/butterknife-compiler/5.1.1/butterknife-compiler-5.1.1.pom file:/D:/mySoftware/Android/android-studio3.0/gradle/m2repository/com/jakewharton/butterknife-compiler/5.1.1/butterknife-compiler-5.1.1.jar https://dl.google.com/dl/android/maven2/com/jakewharton/butterknife-compiler/5.1.1/butterknife-compiler-5.1.1.pom https://dl.google.com/dl/android/maven2/com/jakewharton/butterknife-compiler/5.1.1/butterknife-compiler-5.1.1.jar https://jcenter.bintray.com/com/jakewharton/butterknife-compiler/5.1.1/butterknife-compiler-5.1.1.pom https://jcenter.bintray.com/com/jakewharton/butterknife-compiler/5.1.1/butterknife-compiler-5.1.1.jar Required by: project :app 已经按照步骤改了 可是一直报错 各种办法都试了! ![图片说明](https://img-ask.csdn.net/upload/201805/24/1527148814_688051.png) ![图片说明](https://img-ask.csdn.net/upload/201805/24/1527148675_887407.png)
android项目报gson jar包could not expand ZIP
android项目报错: Execution failed for task ':app:compileDebugJavaWithJavac'. > Could not expand ZIP 'C:\Users\admin\.gradle\caches\modules-2\files-2.1\com.google.code.gson\gson\2.8.6\9180733b7df8542621dc12e21e87557e8c99b8cb\gson-2.8.6.jar'. 启动都就报这个错,但是我项目中并没有用到gson,android小白上手就遇到这个,希望有大神帮忙解决,感谢感谢~
Android studio中我引用了c3p9的jar包以便使用连接池,可是编译报错
Error:(16, 12) 错误: 无法访问Referenceable 找不到javax.naming.Referenceable的类文件 Error:Execution failed for task ':app:compileDebugJavaWithJavac'. > Compilation failed; see the compiler error output for details.
appuim启动魅族手机app报错
报错信息:An unknown server-side error occurred while processing the command. Original error: Failed to launch Appium Settings app: Condition unmet after 5399 ms. Timing out.
app:processDebugResources'.
不知道为什么,在没有编辑“public class SlidingMenu extends HorizontalScrollView”此的代码以前,gradle好没有报错,遍完试运的时候就出现了一下问题 ``` Information:Gradle tasks [:app:assembleDebug] :app:preBuild UP-TO-DATE :app:preDebugBuild UP-TO-DATE :app:checkDebugManifest :app:preReleaseBuild UP-TO-DATE :app:prepareComAndroidSupportAnimatedVectorDrawable2321Library UP-TO-DATE :app:prepareComAndroidSupportAppcompatV72321Library UP-TO-DATE :app:prepareComAndroidSupportSupportV42321Library UP-TO-DATE :app:prepareComAndroidSupportSupportVectorDrawable2321Library UP-TO-DATE :app:prepareDebugDependencies :app:compileDebugAidl :app:compileDebugRenderscript :app:generateDebugBuildConfig UP-TO-DATE :app:generateDebugAssets UP-TO-DATE :app:mergeDebugAssets UP-TO-DATE :app:generateDebugResValues UP-TO-DATE :app:mergeDebugResources :app:generateDebugResources :app:processDebugManifest :app:processDebugResources FAILED Error:Execution failed for task ':app:processDebugResources'. > com.android.ide.common.process.ProcessException: org.gradle.process.internal.ExecException: Process 'command 'D:\java\sd\build-tools\23.0.3\aapt.exe'' finished with non-zero exit value 1 Information:Total time: 17.299 secs Information:BUILD FAILED Information:1 error Information:0 warnings Information:See complete output in console ``` 这是build.gradle文件 ``` apply plugin: 'com.android.application' android { compileSdkVersion 23 buildToolsVersion '23.0.3' defaultConfig { applicationId "com.fj_hooone.studys" minSdkVersion 15 targetSdkVersion 23 versionCode 1 versionName "1.0" } buildTypes { release { minifyEnabled false proguardFiles getDefaultProguardFile('proguard-android.txt'), 'proguard-rules.pro' } } } dependencies { compile fileTree(dir: 'libs', include: ['*.jar']) testCompile 'junit:junit:4.12' compile 'com.android.support:appcompat-v7:23.2.1' } ``` 求解救
人脸识别--编译问题 clean时候没有错误,运行时候就出现下面的问题
Information:Gradle tasks [:app:clean, :app:generateDebugSources, :app:prepareDebugUnitTestDependencies, :app:mockableAndroidJar, :app:generateDebugAndroidTestSources, :app:assembleDebug] :app:clean :app:preBuild UP-TO-DATE :app:preDebugBuild UP-TO-DATE :app:checkDebugManifest :app:preReleaseBuild UP-TO-DATE :app:prepareComAndroidSupportAnimatedVectorDrawable2330Library :app:prepareComAndroidSupportAppcompatV72330Library :app:prepareComAndroidSupportSupportV42330Library :app:prepareComAndroidSupportSupportVectorDrawable2330Library :app:prepareDebugDependencies :app:compileDebugAidl :app:compileDebugRenderscript :app:generateDebugBuildConfig :app:generateDebugAssets UP-TO-DATE :app:mergeDebugAssets :app:generateDebugResValues UP-TO-DATE :app:generateDebugResources :app:mergeDebugResources :app:processDebugManifest :app:processDebugResources :app:generateDebugSources :app:preDebugUnitTestBuild UP-TO-DATE :app:prepareDebugUnitTestDependencies :app:mockableAndroidJar UP-TO-DATE :app:preDebugAndroidTestBuild UP-TO-DATE :app:prepareDebugAndroidTestDependencies :app:compileDebugAndroidTestAidl :app:processDebugAndroidTestManifest :app:compileDebugAndroidTestRenderscript :app:generateDebugAndroidTestBuildConfig :app:generateDebugAndroidTestAssets UP-TO-DATE :app:mergeDebugAndroidTestAssets :app:generateDebugAndroidTestResValues UP-TO-DATE :app:generateDebugAndroidTestResources :app:mergeDebugAndroidTestResources :app:processDebugAndroidTestResources :app:generateDebugAndroidTestSources :app:compileDebugJavaWithJavac 注: D:\AS-Project\FaceApp4\app\src\main\java\com\example\helenchen\faceapp4\MainActivity.java使用或覆盖了已过时的 API。 注: 有关详细信息, 请使用 -Xlint:deprecation 重新编译。 :app:compileDebugNdk UP-TO-DATE :app:compileDebugSources :app:buildInfoDebugLoader :app:transformClassesWithExtractJarsForDebug :app:transformClassesWithInstantRunVerifierForDebug :app:transformClassesWithJavaResourcesVerifierForDebug UP-TO-DATE :app:mergeDebugJniLibFolders :app:transformNative_libsWithMergeJniLibsForDebug :app:processDebugJavaRes UP-TO-DATE :app:transformResourcesWithMergeJavaResForDebug :app:transformResourcesAndNative_libsWithJavaResourcesVerifierForDebug UP-TO-DATE :app:transformClassesWithInstantRunForDebug :app:transformClasses_enhancedWithInstant+reloadDexForDebug :app:incrementalDebugTasks :app:prePackageMarkerForDebug :app:fastDeployDebugExtractor :app:generateDebugInstantRunAppInfo :app:coldswapKickerDebug :app:transformClassesWithInstantRunSlicerForDebug :app:transformClassesWithDexForDebug Error:Error converting bytecode to dex: Cause: java.lang.RuntimeException: Exception parsing classes Error:1 error; aborting Error:Execution failed for task ':app:transformClassesWithDexForDebug'. > com.android.build.api.transform.TransformException: java.lang.RuntimeException: com.android.ide.common.process.ProcessException: java.util.concurrent.ExecutionException: com.android.ide.common.process.ProcessException: org.gradle.process.internal.ExecException: Process 'command 'C:\Program Files\Java\jdk1.7.0_79\bin\java.exe'' finished with non-zero exit value 1 Information:BUILD FAILED Information:Total time: 5.53 secs Information:3 errors Information:0 warnings Information:See complete output in console
kotlin配置dagger2报错':app:kaptAnzhiDebugKotlin
现在我是这样配置的: build.gradle: apply plugin: 'kotlin-android' apply plugin: 'kotlin-kapt' apply plugin: 'kotlin-android-extensions' android{ ····· } dependencies { compile 'com.google.dagger:dagger:2.5' kapt 'com.google.dagger:dagger-compiler:2.5' provided 'org.glassfish:javax.annotation:10.0-b28' } 之前项目是用java开发的,目前想融入kotlin,结果就出现了这种问题?不知道有没有哪位道友遇到过这种问题?该怎么解决呢?
Failed to launch Appium Settings app: Condition unmet after 5506 ms
Appium启动模拟器里的app的时候,用雷电模拟器会报错提示“An unknown server-side error occurred while processing the command. Original error: Failed to launch Appium Settings app: Condition unmet after 5506 ms. Timing out.”但是用夜神模拟器就可以启动,这是为什么
TabLayout的app:app:tabBackground属性怎么用代码设置
TabLayout的app:app:tabBackground属性怎么用代码设置
App自动化报错:Proxy error: Could not proxy command to remote server. Original error: 404 - undefined
    App启动参数如下(存放在Yaml文件中): ``` automationName: UiAutomator2 platformName: Android platformVersion: 7 deviceName: Android Emulator appPackage: com.ellabook appActivity: com.ellabook.startup.StartActivity noReset: False unicodeKeyboard: True # 将键盘给隐藏起来 resetKeyboard: True ```      其他信息:       Appium 1.15       模拟器: 雷电模拟器4.0.7       测试框架: pytest conftest.py内容如下: ``` def basedriver(port=4723, **kwargs): """ 根据设置的参数,启动会话,并返回会话对象 :param port: 会话启动端口号---int :param kwargs: 启动参数 :return: 会话对象 """ yamls = YAML(typ='safe') yaml_path = os.path.join(CAPS_PATH, "desire_caps.yaml") fs = open(yaml_path, encoding='UTF-8') desire_caps = yamls.load(fs) if kwargs: for key, value in kwargs.items(): desire_caps[key] = value driver = webdriver.Remote("http://localhost:{}/wd/hub".format(port), desire_caps) return driver @pytest.fixture(scope="class") def initdriver_first_start(): """App首次启动""" driver = basedriver(noReset=False) yield driver driver.close() ```     测试用例py文件内容: ``` @pytest.mark.usefixtures("initdriver_first_start") class TestAPPStart: """APP启动页测试: 是否进入启动页 、banner图正常滑动、点击"开始看书吧"进入登录界面 """ def test_0_into_start(self, initdriver_first_start): """APP首次启动,启动页是否展示“开始阅读吧”按钮 """ driver = initdriver_first_start AppStartPage(driver).check_read_book_is_exist() def test_banner_left_slip(self, initdriver_first_start): """APP首次启动,启动页广告图能够向左滑""" driver = initdriver_first_start AppStartPage(driver).slide_start_banner("left") # App首次启动,banner广告图正常切换 def test_banner_right_slip(self, initdriver_first_start): """APP首次启动,启动页广告图能够能够向右滑""" driver = initdriver_first_start AppStartPage(driver).slide_start_banner("right") # App首次启动,banner广告图正常切换 def test_click_button(self, initdriver_first_start): """APP首次启动,点击开始按钮,查看是否进入登录界面""" driver = initdriver_first_start AppStartPage(driver).click_start_read() # 点击“开始阅读” 按钮 LoginPage(driver).check_into_login_idle() # 查看是否进入登录界面 ```     APP启动页测试 测试类(pytest/py.test方式)运行,此时用例执行完成后,在进行测试类的teardown时,却报错: selenium.common.exceptions.WebDriverException: Message: An unknown server-side error occurred while processing the command. Original error: Could not proxy. Proxy error: Could not proxy command to remote server. Original error: 404 - undefined ![图片说明](https://img-ask.csdn.net/upload/201912/26/1577335992_418416.png)  网上百度了一堆资料,但依旧没有相关: 404 - undefined 的报错类型的解决方法(忧伤)
appium报错:Failed to launch Appium Settings app
我的步骤 1.使用adb devices中查看到我的设备(这里我使用的是雷电模拟器) 2.配置完desired caps后运行代码报错 ``` from appium import webdriver import time desired_caps ={ 'platformName':'Android', 'deviceName':'emulator-5554', 'platformVersion':'5.1', 'appPackage':'com.android.contacts', 'appActivity':'.activities.PeopleActivity', } driver = webdriver.Remote('http://localhost:4723/wd/hub',desired_caps) driver.quit() ``` 报错如下: ``` selenium.common.exceptions.WebDriverException: Message: An unknown server-side error occurred while processing the command. Original error: Failed to launch Appium Settings app: Condition unmet after 5384 ms. Timing out. ```
androidsee the compiler error output for details.
Error:Execution failed for task ':app:compileDebugJavaWithJavac'. > Compilation failed; see the compiler error output for details. 昨天在编译的时候出现这个问题,在出这个错误之前我升级了android studio, 还把云盘上面的工程下下来编译,而且没出现问题。后来某一次编译的时候就出现了这个问题,我开始以为是代码的问题,后面发现不是,各种goole百度都没有解决,已经被困扰两天了,求大神帮忙
AS 3.0 依赖报错,:app@debug/compileClasspath'
昨天在家里更新了最新的as,然后自己 开了个项目玩玩,但是到依赖glide的时候就有问题了 看了好多方法都没有用。 offline也关了, 也没有用vpn。 报错如下 Unable to resolve dependency for ':app@debug/compileClasspath': Could not resolve com.github.bumptech.glide:glide:4.8.0. Open File Show Details Unable to resolve dependency for ':app@debugAndroidTest/compileClasspath': Could not resolve com.github.bumptech.glide:glide:4.8.0. Open File Show Details Unable to resolve dependency for ':app@debugUnitTest/compileClasspath': Could not resolve com.github.bumptech.glide:glide:4.8.0. Open File Show Details Unable to resolve dependency for ':app@release/compileClasspath': Could not resolve com.github.bumptech.glide:glide:4.8.0. Open File Show Details Unable to resolve dependency for ':app@releaseUnitTest/compileClasspath': Could not resolve com.github.bumptech.glide:glide:4.8.0. Open File Show Details 。。 两个gradle app: apply plugin: 'com.android.application' android { compileSdkVersion 28 defaultConfig { applicationId "com.dl.pokemondex" minSdkVersion 26 targetSdkVersion 28 versionCode 1 versionName "1.0" testInstrumentationRunner "android.support.test.runner.AndroidJUnitRunner" } buildTypes { release { minifyEnabled false proguardFiles getDefaultProguardFile('proguard-android.txt'), 'proguard-rules.pro' } } } repositories { mavenCentral() google() } dependencies { implementation 'com.github.bumptech.glide:glide:4.8.0' annotationProcessor 'com.github.bumptech.glide:compiler:4.8.0' implementation fileTree(dir: 'libs', include: ['*.jar']) implementation 'com.android.support:appcompat-v7:28.0.0' implementation 'com.android.support.constraint:constraint-layout:1.1.3' implementation 'com.android.support:design:28.0.0' testImplementation 'junit:junit:4.12' androidTestImplementation 'com.android.support.test:runner:1.0.2' androidTestImplementation 'com.android.support.test.espresso:espresso-core:3.0.2' } proj // Top-level build file where you can add configuration options common to all sub-projects/modules. buildscript { repositories { google() maven { url "https://maven.google.com" } jcenter() } dependencies { classpath 'com.android.tools.build:gradle:3.2.0' // NOTE: Do not place your application dependencies here; they belong // in the individual module build.gradle files } } allprojects { repositories { google() jcenter() maven { url "https://maven.google.com" } } } task clean(type: Delete) { delete rootProject.buildDir }
Tomcat启动报错:More than one fragment with the name [javamelody] was found.
eclipse中Tomcat启动报错:More than one fragment with the name [javamelody] was found. This is not legal with relative ordering. See section 8.2.2 2c of the Servlet specification for details. Consider using absolute ordering. at org.apache.catalina.deploy.WebXml.orderWebFragments(WebXml.java:2338) at org.apache.catalina.startup.ContextConfig.webConfig(ContextConfig.java:1268) at org.apache.catalina.startup.ContextConfig.configureStart(ContextConfig.java:881) at org.apache.catalina.startup.ContextConfig.lifecycleEvent(ContextConfig.java:388) at org.apache.catalina.util.LifecycleSupport.fireLifecycleEvent(LifecycleSupport.java:117) at org.apache.catalina.util.LifecycleBase.fireLifecycleEvent(LifecycleBase.java:90) at org.apache.catalina.core.StandardContext.startInternal(StandardContext.java:5590) at org.apache.catalina.util.LifecycleBase.start(LifecycleBase.java:145) ... 6 more Failed to start component [StandardEngine[Catalina].StandardHost[localhost].StandardContext[/fwmh]] at java.util.concurrent.FutureTask.report(FutureTask.java:122) at java.util.concurrent.FutureTask.get(FutureTask.java:192) at org.apache.catalina.core.ContainerBase.startInternal(ContainerBase.java:1243) at org.apache.catalina.core.StandardHost.startInternal(StandardHost.java:819) at org.apache.catalina.util.LifecycleBase.start(LifecycleBase.java:145) at org.apache.catalina.core.ContainerBase$StartChild.call(ContainerBase.java:1707) at org.apache.catalina.core.ContainerBase$StartChild.call(ContainerBase.java:1697) at java.util.concurrent.FutureTask.run(FutureTask.java:266) at java.util.concurrent.ThreadPoolExecutor.runWorker(ThreadPoolExecutor.java:1142) at java.util.concurrent.ThreadPoolExecutor$Worker.run(ThreadPoolExecutor.java:617) at java.lang.Thread.run(Thread.java:745)![图片说明](https://img-ask.csdn.net/upload/201907/05/1562321208_258829.png) 之前我的eclipse中有一个项目fwmh,后来我不小心把它的SVN主元素链接全部删除了,然后我把这个项目删除了(删之前做了备份),重新从SVN下载下来这个项目导入到eclipse,tomcat启动就报这个错误了。但是我如果我导入之前备份的再启动就不报错(猜测原因可能是这两个重复了??),但是备份的这个没有SVN信息了没法用。 所以想请教一下各位,这个错误怎么解决?或者怎么把我之前备份的那个SVN元素(之前SVN元素全删的)重新加上?谢谢! 之前网上查到说在</web-app>里面加<absolute-ordering />,我试过不行,web.xml会报错。
Android Studio 2.1 gradle 2.10报错
Configuration on demand is an incubating feature. Incremental java compilation is an incubating feature. :app:preBuild UP-TO-DATE :app:preDebugBuild UP-TO-DATE :app:checkDebugManifest :app:preReleaseBuild UP-TO-DATE :app:prepareComAndroidSupportAnimatedVectorDrawable2330Library UP-TO-DATE :app:prepareComAndroidSupportAppcompatV72330Library UP-TO-DATE :app:prepareComAndroidSupportSupportV42330Library UP-TO-DATE :app:prepareComAndroidSupportSupportVectorDrawable2330Library UP-TO-DATE :app:prepareDebugDependencies :app:compileDebugAidl UP-TO-DATE :app:compileDebugRenderscript UP-TO-DATE :app:generateDebugBuildConfig UP-TO-DATE :app:mergeDebugShaders UP-TO-DATE :app:compileDebugShaders UP-TO-DATE :app:generateDebugAssets UP-TO-DATE :app:mergeDebugAssets UP-TO-DATE :app:generateDebugResValues UP-TO-DATE :app:generateDebugResources UP-TO-DATE :app:mergeDebugResources UP-TO-DATE :app:processDebugManifest :app:processDebugResources :app:generateDebugSources :app:preDebugAndroidTestBuild UP-TO-DATE :app:prepareDebugAndroidTestDependencies :app:compileDebugAndroidTestAidl UP-TO-DATE :app:processDebugAndroidTestManifest UP-TO-DATE :app:compileDebugAndroidTestRenderscript UP-TO-DATE :app:generateDebugAndroidTestBuildConfig UP-TO-DATE :app:mergeDebugAndroidTestShaders UP-TO-DATE :app:compileDebugAndroidTestShaders UP-TO-DATE :app:generateDebugAndroidTestAssets UP-TO-DATE :app:mergeDebugAndroidTestAssets UP-TO-DATE :app:generateDebugAndroidTestResValues UP-TO-DATE :app:generateDebugAndroidTestResources UP-TO-DATE :app:mergeDebugAndroidTestResources UP-TO-DATE :app:processDebugAndroidTestResources UP-TO-DATE :app:generateDebugAndroidTestSources UP-TO-DATE :app:mockableAndroidJar UP-TO-DATE :app:preDebugUnitTestBuild UP-TO-DATE 求大神帮帮忙。。。。
Android studio打包apk报错Error: [Instantiatable]
报错代码: Information:Gradle tasks [:Android_hdjs:assembleRelease] :Android_hdjs:preBuild UP-TO-DATE :Android_hdjs:preReleaseBuild UP-TO-DATE :Android_hdjs:checkReleaseManifest :Android_hdjs:prepareReleaseDependencies :Android_hdjs:compileReleaseAidl UP-TO-DATE :Android_hdjs:compileReleaseRenderscript UP-TO-DATE :Android_hdjs:generateReleaseBuildConfig UP-TO-DATE :Android_hdjs:generateReleaseAssets UP-TO-DATE :Android_hdjs:mergeReleaseAssets UP-TO-DATE :Android_hdjs:generateReleaseResValues UP-TO-DATE :Android_hdjs:generateReleaseResources UP-TO-DATE :Android_hdjs:mergeReleaseResources UP-TO-DATE :Android_hdjs:processReleaseManifest UP-TO-DATE :Android_hdjs:processReleaseResources UP-TO-DATE :Android_hdjs:generateReleaseSources UP-TO-DATE :Android_hdjs:compileReleaseJavaWithJavac UP-TO-DATE :Android_hdjs:compileReleaseNdk UP-TO-DATE :Android_hdjs:compileReleaseSources UP-TO-DATE :Android_hdjs:lintVitalRelease E:\edxc_yhb_android\hdjs\Android_hdjs\src\main\java\com\wlhy\app\UpdateVersionByDownloadManager.java Error:Error: This inner class should be static (com.wlhy.app.UpdateVersionByDownloadManager.DownloadCompleteReceiver) [Instantiatable]
Flutter开发报错:Error: ADB exited with exit code 1 Performing Streamed Install,一直报这个错,求各位大神帮忙如何解决?
![图片说明](https://img-ask.csdn.net/upload/202001/08/1578444083_268355.png) Error: ADB exited with exit code 1 Performing Streamed Install adb: failed to install E:\20190102\login_app\build\app\outputs\apk\app.apk: Failure [INSTALL_FAILED_INSUFFICIENT_STORAGE] Error launching application on Android SDK built for x86. 在运行简单的HelloWorld的时候出现这个错误,原来是没有这种情况的,突然的就报这个错,很无奈啊,已经网上找了很多方法还是没法解决,现求各位大神帮忙解决一下
微信小程序报错:Uncaught Error: module "pages/test/test.js" is not defined,求大神看看问题出在哪了
已经在APP.json里声明了这个地址,仍然是报错,请大神帮帮忙看看问题出在哪了? VM179 WAService.js:1 Uncaught Error: module "pages/test/test.js" is not defined at require (VM179 WAService.js:1) at <anonymous>:8:7 at HTMLScriptElement.scriptLoaded (appservice?t=1573883127416:1285) at HTMLScriptElement.script.onload (appservice?t=1573883127416:1297) 这是app:json "pages": [ "pages/word/word", "pages/test/test", "pages/settings/settings", "pages/settings/clause/clause", "pages/settings/barn/barn" ],
Kafka实战(三) - Kafka的自我修养与定位
Apache Kafka是消息引擎系统,也是一个分布式流处理平台(Distributed Streaming Platform) Kafka是LinkedIn公司内部孵化的项目。LinkedIn最开始有强烈的数据强实时处理方面的需求,其内部的诸多子系统要执行多种类型的数据处理与分析,主要包括业务系统和应用程序性能监控,以及用户行为数据处理等。 遇到的主要问题: 数据正确性不足 数据的收集主要...
volatile 与 synchronize 详解
Java支持多个线程同时访问一个对象或者对象的成员变量,由于每个线程可以拥有这个变量的拷贝(虽然对象以及成员变量分配的内存是在共享内存中的,但是每个执行的线程还是可以拥有一份拷贝,这样做的目的是加速程序的执行,这是现代多核处理器的一个显著特性),所以程序在执行过程中,一个线程看到的变量并不一定是最新的。 volatile 关键字volatile可以用来修饰字段(成员变量),就是告知程序任何对该变量...
Java学习的正确打开方式
在博主认为,对于入门级学习java的最佳学习方法莫过于视频+博客+书籍+总结,前三者博主将淋漓尽致地挥毫于这篇博客文章中,至于总结在于个人,实际上越到后面你会发现学习的最好方式就是阅读参考官方文档其次就是国内的书籍,博客次之,这又是一个层次了,这里暂时不提后面再谈。博主将为各位入门java保驾护航,各位只管冲鸭!!!上天是公平的,只要不辜负时间,时间自然不会辜负你。 何谓学习?博主所理解的学习,它是一个过程,是一个不断累积、不断沉淀、不断总结、善于传达自己的个人见解以及乐于分享的过程。
程序员必须掌握的核心算法有哪些?
由于我之前一直强调数据结构以及算法学习的重要性,所以就有一些读者经常问我,数据结构与算法应该要学习到哪个程度呢?,说实话,这个问题我不知道要怎么回答你,主要取决于你想学习到哪些程度,不过针对这个问题,我稍微总结一下我学过的算法知识点,以及我觉得值得学习的算法。这些算法与数据结构的学习大多数是零散的,并没有一本把他们全部覆盖的书籍。下面是我觉得值得学习的一些算法以及数据结构,当然,我也会整理一些看过...
有哪些让程序员受益终生的建议
从业五年多,辗转两个大厂,出过书,创过业,从技术小白成长为基层管理,联合几个业内大牛回答下这个问题,希望能帮到大家,记得帮我点赞哦。 敲黑板!!!读了这篇文章,你将知道如何才能进大厂,如何实现财务自由,如何在工作中游刃有余,这篇文章很长,但绝对是精品,记得帮我点赞哦!!!! 一腔肺腑之言,能看进去多少,就看你自己了!!! 目录: 在校生篇: 为什么要尽量进大厂? 如何选择语言及方...
大学四年自学走来,这些私藏的实用工具/学习网站我贡献出来了
大学四年,看课本是不可能一直看课本的了,对于学习,特别是自学,善于搜索网上的一些资源来辅助,还是非常有必要的,下面我就把这几年私藏的各种资源,网站贡献出来给你们。主要有:电子书搜索、实用工具、在线视频学习网站、非视频学习网站、软件下载、面试/求职必备网站。 注意:文中提到的所有资源,文末我都给你整理好了,你们只管拿去,如果觉得不错,转发、分享就是最大的支持了。 一、电子书搜索 对于大部分程序员...
linux系列之常用运维命令整理笔录
本博客记录工作中需要的linux运维命令,大学时候开始接触linux,会一些基本操作,可是都没有整理起来,加上是做开发,不做运维,有些命令忘记了,所以现在整理成博客,当然vi,文件操作等就不介绍了,慢慢积累一些其它拓展的命令,博客不定时更新 free -m 其中:m表示兆,也可以用g,注意都要小写 Men:表示物理内存统计 total:表示物理内存总数(total=used+free) use...
比特币原理详解
一、什么是比特币 比特币是一种电子货币,是一种基于密码学的货币,在2008年11月1日由中本聪发表比特币白皮书,文中提出了一种去中心化的电子记账系统,我们平时的电子现金是银行来记账,因为银行的背后是国家信用。去中心化电子记账系统是参与者共同记账。比特币可以防止主权危机、信用风险。其好处不多做赘述,这一层面介绍的文章很多,本文主要从更深层的技术原理角度进行介绍。 二、问题引入 假设现有4个人...
GitHub开源史上最大规模中文知识图谱
近日,一直致力于知识图谱研究的 OwnThink 平台在 Github 上开源了史上最大规模 1.4 亿中文知识图谱,其中数据是以(实体、属性、值),(实体、关系、实体)混合的形式组织,数据格式采用 csv 格式。 到目前为止,OwnThink 项目开放了对话机器人、知识图谱、语义理解、自然语言处理工具。知识图谱融合了两千五百多万的实体,拥有亿级别的实体属性关系,机器人采用了基于知识图谱的语义感...
程序员接私活怎样防止做完了不给钱?
首先跟大家说明一点,我们做 IT 类的外包开发,是非标品开发,所以很有可能在开发过程中会有这样那样的需求修改,而这种需求修改很容易造成扯皮,进而影响到费用支付,甚至出现做完了项目收不到钱的情况。 那么,怎么保证自己的薪酬安全呢? 我们在开工前,一定要做好一些证据方面的准备(也就是“讨薪”的理论依据),这其中最重要的就是需求文档和验收标准。一定要让需求方提供这两个文档资料作为开发的基础。之后开发...
网页实现一个简单的音乐播放器(大佬别看。(⊙﹏⊙))
今天闲着无事,就想写点东西。然后听了下歌,就打算写个播放器。 于是乎用h5 audio的加上js简单的播放器完工了。 演示地点演示 html代码如下` music 这个年纪 七月的风 音乐 ` 然后就是css`*{ margin: 0; padding: 0; text-decoration: none; list-...
微信支付崩溃了,但是更让马化腾和张小龙崩溃的竟然是……
loonggg读完需要3分钟速读仅需1分钟事件还得还原到昨天晚上,10 月 29 日晚上 20:09-21:14 之间,微信支付发生故障,全国微信支付交易无法正常进行。然...
Python十大装B语法
Python 是一种代表简单思想的语言,其语法相对简单,很容易上手。不过,如果就此小视 Python 语法的精妙和深邃,那就大错特错了。本文精心筛选了最能展现 Python 语法之精妙的十个知识点,并附上详细的实例代码。如能在实战中融会贯通、灵活使用,必将使代码更为精炼、高效,同时也会极大提升代码B格,使之看上去更老练,读起来更优雅。
数据库优化 - SQL优化
以实际SQL入手,带你一步一步走上SQL优化之路!
2019年11月中国大陆编程语言排行榜
2019年11月2日,我统计了某招聘网站,获得有效程序员招聘数据9万条。针对招聘信息,提取编程语言关键字,并统计如下: 编程语言比例 rank pl_ percentage 1 java 33.62% 2 cpp 16.42% 3 c_sharp 12.82% 4 javascript 12.31% 5 python 7.93% 6 go 7.25% 7 p...
通俗易懂地给女朋友讲:线程池的内部原理
餐盘在灯光的照耀下格外晶莹洁白,女朋友拿起红酒杯轻轻地抿了一小口,对我说:“经常听你说线程池,到底线程池到底是个什么原理?”
《奇巧淫技》系列-python!!每天早上八点自动发送天气预报邮件到QQ邮箱
将代码部署服务器,每日早上定时获取到天气数据,并发送到邮箱。 也可以说是一个小型人工智障。 知识可以运用在不同地方,不一定非是天气预报。
经典算法(5)杨辉三角
杨辉三角 是经典算法,这篇博客对它的算法思想进行了讲解,并有完整的代码实现。
英特尔不为人知的 B 面
从 PC 时代至今,众人只知在 CPU、GPU、XPU、制程、工艺等战场中,英特尔在与同行硬件芯片制造商们的竞争中杀出重围,且在不断的成长进化中,成为全球知名的半导体公司。殊不知,在「刚硬」的背后,英特尔「柔性」的软件早已经做到了全方位的支持与支撑,并持续发挥独特的生态价值,推动产业合作共赢。 而对于这一不知人知的 B 面,很多人将其称之为英特尔隐形的翅膀,虽低调,但是影响力却不容小觑。 那么,在...
腾讯算法面试题:64匹马8个跑道需要多少轮才能选出最快的四匹?
昨天,有网友私信我,说去阿里面试,彻底的被打击到了。问了为什么网上大量使用ThreadLocal的源码都会加上private static?他被难住了,因为他从来都没有考虑过这个问题。无独有偶,今天笔者又发现有网友吐槽了一道腾讯的面试题,我们一起来看看。 腾讯算法面试题:64匹马8个跑道需要多少轮才能选出最快的四匹? 在互联网职场论坛,一名程序员发帖求助到。二面腾讯,其中一个算法题:64匹...
面试官:你连RESTful都不知道我怎么敢要你?
干货,2019 RESTful最贱实践
刷了几千道算法题,这些我私藏的刷题网站都在这里了!
遥想当年,机缘巧合入了 ACM 的坑,周边巨擘林立,从此过上了"天天被虐似死狗"的生活… 然而我是谁,我可是死狗中的战斗鸡,智力不够那刷题来凑,开始了夜以继日哼哧哼哧刷题的日子,从此"读题与提交齐飞, AC 与 WA 一色 ",我惊喜的发现被题虐既刺激又有快感,那一刻我泪流满面。这么好的事儿作为一个正直的人绝不能自己独享,经过激烈的颅内斗争,我决定把我私藏的十几个 T 的,阿不,十几个刷题网...
为啥国人偏爱Mybatis,而老外喜欢Hibernate/JPA呢?
关于SQL和ORM的争论,永远都不会终止,我也一直在思考这个问题。昨天又跟群里的小伙伴进行了一番讨论,感触还是有一些,于是就有了今天这篇文。 声明:本文不会下关于Mybatis和JPA两个持久层框架哪个更好这样的结论。只是摆事实,讲道理,所以,请各位看官勿喷。 一、事件起因 关于Mybatis和JPA孰优孰劣的问题,争论已经很多年了。一直也没有结论,毕竟每个人的喜好和习惯是大不相同的。我也看...
白话阿里巴巴Java开发手册高级篇
不久前,阿里巴巴发布了《阿里巴巴Java开发手册》,总结了阿里巴巴内部实际项目开发过程中开发人员应该遵守的研发流程规范,这些流程规范在一定程度上能够保证最终的项目交付质量,通过在时间中总结模式,并推广给广大开发人员,来避免研发人员在实践中容易犯的错误,确保最终在大规模协作的项目中达成既定目标。 无独有偶,笔者去年在公司里负责升级和制定研发流程、设计模板、设计标准、代码标准等规范,并在实际工作中进行...
SQL-小白最佳入门sql查询一
不要偷偷的查询我的个人资料,即使你再喜欢我,也不要这样,真的不好;
项目中的if else太多了,该怎么重构?
介绍 最近跟着公司的大佬开发了一款IM系统,类似QQ和微信哈,就是聊天软件。我们有一部分业务逻辑是这样的 if (msgType = "文本") { // dosomething } else if(msgType = "图片") { // doshomething } else if(msgType = "视频") { // doshomething } else { // doshom...
Nginx 原理和架构
Nginx 是一个免费的,开源的,高性能的 HTTP 服务器和反向代理,以及 IMAP / POP3 代理服务器。Nginx 以其高性能,稳定性,丰富的功能,简单的配置和低资源消耗而闻名。 Nginx 的整体架构 Nginx 里有一个 master 进程和多个 worker 进程。master 进程并不处理网络请求,主要负责调度工作进程:加载配置、启动工作进程及非停升级。worker 进程负责处...
YouTube排名第一的励志英文演讲《Dream(梦想)》
Idon’t know what that dream is that you have, I don't care how disappointing it might have been as you've been working toward that dream,but that dream that you’re holding in your mind, that it’s po...
“狗屁不通文章生成器”登顶GitHub热榜,分分钟写出万字形式主义大作
一、垃圾文字生成器介绍 最近在浏览GitHub的时候,发现了这样一个骨骼清奇的雷人项目,而且热度还特别高。 项目中文名:狗屁不通文章生成器 项目英文名:BullshitGenerator 根据作者的介绍,他是偶尔需要一些中文文字用于GUI开发时测试文本渲染,因此开发了这个废话生成器。但由于生成的废话实在是太过富于哲理,所以最近已经被小伙伴们给玩坏了。 他的文风可能是这样的: 你发现,...
程序员:我终于知道post和get的区别
是一个老生常谈的话题,然而随着不断的学习,对于以前的认识有很多误区,所以还是需要不断地总结的,学而时习之,不亦说乎
相关热词 c#委托 逆变与协变 c#新建一个项目 c#获取dll文件路径 c#子窗体调用主窗体事件 c# 拷贝目录 c# 调用cef 网页填表c#源代码 c#部署端口监听项目、 c#接口中的属性使用方法 c# 昨天
立即提问