npm install 失败 不知道是什么原因

图片说明

没有报错但提示npm不支持node版本
npm是5.5.1,node是9.0.0

npm

1个回答

这个需要网络支持,你先检查网络

Csdn user default icon
上传中...
上传图片
插入图片
抄袭、复制答案,以达到刷声望分或其他目的的行为,在CSDN问答是严格禁止的,一经发现立刻封号。是时候展现真正的技术了!
其他相关推荐
node.js使用npm install -g n更新node失败的问题
想要更新nodejs的版本,使用npm install -g n命令安装n模块的时候失败 ![图片说明](https://img-ask.csdn.net/upload/201606/02/1464839312_110845.jpg) 可是我的操作系统是64位的 ![图片说明](https://img-ask.csdn.net/upload/201606/02/1464839344_565541.jpg) 如何解决这个问题?谢谢各位了
npm install realm --save 失败
![图片说明](https://img-ask.csdn.net/upload/201812/13/1544674435_744344.jpg)![图片说明](https://img-ask.csdn.net/upload/201812/13/1544674443_902084.jpg)![图片说明](https://img-ask.csdn.net/upload/201812/13/1544674455_412613.jpg)
npm安装web-ext总是失败
我用nodejs的npm安装web-ext时总是失败,请帮忙看一下是怎么回事。谢谢!! 安装命令:npm install --global web-ext 提示如下: npm WARN deprecated js-select@0.6.0: Package no longer supported. Contact support@npmjs.com for more info. npm WARN deprecated markdown-to-ast@3.4.0: See https://github.com/textlint/textlint/issues/455 npm WARN deprecated nomnom@1.8.1: Package no longer supported. Contact support@npmjs.com for more info. npm WARN deprecated socks@1.1.10: If using 2.x branch, please upgrade to at least 2.1.6 to avoid a serious bug with socket data flow and an import issue introduced in 2.1.0 /home/ssew/node-v8.11.2-linux-x64/bin/web-ext -> /home/ssew/node-v8.11.2-linux-x64/lib/node_modules/web-ext/bin/web-ext npm WARN ajv-keywords@2.1.1 requires a peer of ajv@^5.0.0 but none is installed. You must install peer dependencies yourself. npm WARN optional SKIPPING OPTIONAL DEPENDENCY: fsevents@1.2.4 (node_modules/web-ext/node_modules/fsevents): npm WARN notsup SKIPPING OPTIONAL DEPENDENCY: Unsupported platform for fsevents@1.2.4: wanted {"os":"darwin","arch":"any"} (current: {"os":"linux","arch":"x64"}) + web-ext@2.7.0 updated 1 package in 96.971s 系统是debian9.1 (stretch),nodejs是8.11.2LTS版。 nodejs我是下载到home目录后把node和npm软连接到/usr/local/bin的。 web-ext我是用于做Firefox扩展用的。
npm安装@vue/cli失败,提示仅支持https
之前装过这些,但因为别的原因,把AppData下相关文件和用户的注册文件删了重装,结果这次安装失败。 先是卡在**fetchmetadata:sill resolvewithnewmodule typescript**不动,然后取消了两次后, 配置了阿里镜像:npm config set registry https://registry.npm.taobao.org,然后再执行就报错误,说仅支持https。 这是dos界面提示 ![图片说明](https://img-ask.csdn.net/upload/201909/20/1568914845_998077.png) cnpm模块的package.json文件: ![图片说明](https://img-ask.csdn.net/upload/201909/20/1568915208_526334.png) debug文件: ``` 0 info it worked if it ends with ok 1 verbose cli [ 1 verbose cli 'D:\\work softs\\web_html\\nodejs\\node.exe', 1 verbose cli 'D:\\work softs\\web_html\\nodejs\\node_modules\\npm\\bin\\npm-cli.js', 1 verbose cli 'install', 1 verbose cli '@vue/cli', 1 verbose cli '-g' 1 verbose cli ] 2 info using npm@6.10.3 3 info using node@v12.10.0 4 verbose npm-session 599580d47326bd14 5 silly install loadCurrentTree 6 silly install readGlobalPackageData 7 silly fetchPackageMetaData error for @vue/cli@latest Only HTTP(S) protocols are supported 8 timing stage:rollbackFailedOptional Completed in 1ms 9 timing stage:runTopLevelLifecycles Completed in 27ms 10 verbose stack TypeError: Only HTTP(S) protocols are supported 10 verbose stack at getNodeRequestOptions (D:\work softs\web_html\nodejs\node_modules\npm\node_modules\node-fetch-npm\src\request.js:135:11) 10 verbose stack at D:\work softs\web_html\nodejs\node_modules\npm\node_modules\node-fetch-npm\src\index.js:44:21 10 verbose stack at new Promise (<anonymous>) 10 verbose stack at fetch (D:\work softs\web_html\nodejs\node_modules\npm\node_modules\node-fetch-npm\src\index.js:41:10) 10 verbose stack at D:\work softs\web_html\nodejs\node_modules\npm\node_modules\make-fetch-happen\index.js:332:14 10 verbose stack at D:\work softs\web_html\nodejs\node_modules\npm\node_modules\promise-retry\index.js:29:24 11 verbose cwd C:\Users\86180 12 verbose Windows_NT 10.0.18362 13 verbose argv "D:\\work softs\\web_html\\nodejs\\node.exe" "D:\\work softs\\web_html\\nodejs\\node_modules\\npm\\bin\\npm-cli.js" "install" "@vue/cli" "-g" 14 verbose node v12.10.0 15 verbose npm v6.10.3 16 error Only HTTP(S) protocols are supported 17 verbose exit [ 1, true ] ```
阿里云CES ubuntu系统的服务器,按照web3失败,求解答:
命令行终端中输入的命令行为: sudo apt-get install nodejs sudo apt-get install npm npm init --yes npm install web3 其中nodejs、npm都可以安装成功,但是web3一步一直安装失败: 由于图片无法上传,我简单粘贴一下失败的信息: > scrypt@6.0.3 install /usr/Geth0/node_modules/scrypt > node-gyp rebuild /bin/sh: 1: node: not found gyp: Call to 'node -e "require('nan')"' returned exit status 127 while in binding.gyp.while tryinging.gyp gyp ERR! configure error gyp ERR! stack Error: 'gyp' failed with exit code: gyp ERR! stack at ChildProcess.onCpExit(/usr/srgre/node-gyp/lib/configure.js:354:16) 后面还有一部分信息,比较多,就省略一下, 辛苦帮忙解答一下为什么安装web3会出现上面的错误,该如何解决,感谢:
cnpm安装antd失败: unknown error, symlink
从cmd改成git-bash,尝试cnpm,npm install antd --save --no-bin-links 都失败,报错: × Install fail! Error: UNKNOWN: unknown error, symlink 'E:\workspace\181104\react1104\node_modules\_enquire.js@2.1.6@enquire.js' -> 'E:\workspace\181104\react1104\node_modules\_antd@3.10.7@antd\node_modules\enquire.js' Error: UNKNOWN: unknown error, symlink 'E:\workspace\181104\react1104\node_modules\_enquire.js@2.1.6@enquire.js' -> 'E:\workspace\181104\react1104\node_modules\_antd@3.10.7@antd\node_modules\enquire.js' npminstall version: 3.15.0 npminstall args: D:\Program Files\nodejs\node.exe D:\Program Files\nodejs\node_global\node_modules\cnpm\node_modules\npminstall\bin\install.js --fix-bug-versions --china --userconfig=C:\Users\wzhu\.cnpmrc --disturl=https://npm.taobao.org/mirrors/node --registry=https://registry.npm.taobao.org --save antd --no-bin-links npm ERR! path E:\workspace\181104\react1104\node_modules\css-animation npm ERR! code ENOENT npm ERR! errno -4058 npm ERR! syscall access npm ERR! enoent ENOENT: no such file or directory, access 'E:\workspace\181104\react1104\node_modules\css-animation' npm ERR! enoent This is related to npm not being able to find a file. npm ERR! enoent 请教有没有高手知道咋解决?多谢!
ubuntu下安装 hexo失败
执行 sudo npm install hexo -g时 报错 贴上报错 ``` npm WARN This failure might be due to the use of legacy binary "node" npm WARN For further explanations, please read /usr/share/doc/nodejs/README.Debian > dtrace-provider@0.6.0 install /usr/local/lib/node_modules/hexo/node_modules/hexo-log/node_modules/bunyan/node_modules/dtrace-provider > node scripts/install.js sh: 1: node: not found npm WARN This failure might be due to the use of legacy binary "node" npm WARN For further explanations, please read /usr/share/doc/nodejs/README.Debian npm WARN optional dep failed, continuing dtrace-provider@0.6.0 npm ERR! error rolling back Error: ENOTEMPTY, rmdir '/usr/local/lib/node_modules/hexo/node_modules/cheerio/node_modules/jsdom/node_modules/cssstyle/lib/properties' npm ERR! error rolling back hexo@3.2.0 { [Error: ENOTEMPTY, rmdir '/usr/local/lib/node_modules/hexo/node_modules/cheerio/node_modules/jsdom/node_modules/cssstyle/lib/properties'] npm ERR! error rolling back errno: 53, npm ERR! error rolling back code: 'ENOTEMPTY', npm ERR! error rolling back path: '/usr/local/lib/node_modules/hexo/node_modules/cheerio/node_modules/jsdom/node_modules/cssstyle/lib/properties' } npm ERR! spawn-sync@1.0.15 postinstall: `node postinstall` npm ERR! Exit status 127 npm ERR! npm ERR! Failed at the spawn-sync@1.0.15 postinstall script. npm ERR! This is most likely a problem with the spawn-sync package, npm ERR! not with npm itself. npm ERR! Tell the author that this fails on your system: npm ERR! node postinstall npm ERR! You can get their info via: npm ERR! npm owner ls spawn-sync npm ERR! There is likely additional logging output above. npm ERR! System Linux 3.19.0-51-generic npm ERR! command "/usr/bin/nodejs" "/usr/bin/npm" "install" "hexo" "-g" npm ERR! cwd /home/sjd/code npm ERR! node -v v0.10.25 npm ERR! npm -v 1.4.21 npm ERR! code ELIFECYCLE npm ERR! Error: ENOENT, open '/usr/local/lib/node_modules/hexo/node_modules/cheerio/node_modules/jsdom/node_modules/request/node_modules/hawk/lib/server.js' npm ERR! If you need help, you may report this *entire* log, npm ERR! including the npm and node versions, at: npm ERR! <http://github.com/npm/npm/issues> npm ERR! System Linux 3.19.0-51-generic npm ERR! command "/usr/bin/nodejs" "/usr/bin/npm" "install" "hexo" "-g" npm ERR! cwd /home/sjd/code npm ERR! node -v v0.10.25 npm ERR! npm -v 1.4.21 npm ERR! path /usr/local/lib/node_modules/hexo/node_modules/cheerio/node_modules/jsdom/node_modules/request/node_modules/hawk/lib/server.js npm ERR! code ENOENT npm ERR! errno 34 npm ERR! EEXIST, mkdir '/usr/local/lib/node_modules/hexo/node_modules/warehouse/node_modules/cuid/node_modules/core-js/library/fn/symbol' File exists: /usr/local/lib/node_modules/hexo/node_modules/warehouse/node_modules/cuid/node_modules/core-js/library/fn/symbol Move it away, and try again. npm ERR! System Linux 3.19.0-51-generic npm ERR! command "/usr/bin/nodejs" "/usr/bin/npm" "install" "hexo" "-g" npm ERR! cwd /home/sjd/code npm ERR! node -v v0.10.25 npm ERR! npm -v 1.4.21 npm ERR! path /usr/local/lib/node_modules/hexo/node_modules/warehouse/node_modules/cuid/node_modules/core-js/library/fn/symbol npm ERR! fstream_path /usr/local/lib/node_modules/hexo/node_modules/warehouse/node_modules/cuid/node_modules/core-js/library/fn/symbol/iterator.js npm ERR! fstream_type File npm ERR! fstream_class FileWriter npm ERR! code EEXIST npm ERR! errno 47 npm ERR! fstream_stack /usr/lib/nodejs/fstream/lib/writer.js:171:23 npm ERR! fstream_stack /usr/lib/nodejs/mkdirp/index.js:46:53 npm ERR! fstream_stack Object.oncomplete (fs.js:107:15) npm ERR! Error: ENOENT, lstat '/usr/local/lib/node_modules/hexo/node_modules/cheerio/node_modules/jsdom/node_modules/request/node_modules/aws4/node_modules/lru-cache/node_modules/yallist/LICENSE' npm ERR! If you need help, you may report this *entire* log, npm ERR! including the npm and node versions, at: npm ERR! <http://github.com/npm/npm/issues> npm ERR! System Linux 3.19.0-51-generic npm ERR! command "/usr/bin/nodejs" "/usr/bin/npm" "install" "hexo" "-g" npm ERR! cwd /home/sjd/code npm ERR! node -v v0.10.25 npm ERR! npm -v 1.4.21 npm ERR! path /usr/local/lib/node_modules/hexo/node_modules/cheerio/node_modules/jsdom/node_modules/request/node_modules/aws4/node_modules/lru-cache/node_modules/yallist/LICENSE npm ERR! fstream_path /usr/local/lib/node_modules/hexo/node_modules/cheerio/node_modules/jsdom/node_modules/request/node_modules/aws4/node_modules/lru-cache/node_modules/yallist/LICENSE npm ERR! fstream_type File npm ERR! fstream_class FileWriter npm ERR! code ENOENT npm ERR! errno 34 npm ERR! fstream_stack /usr/lib/nodejs/fstream/lib/writer.js:284:26 npm ERR! fstream_stack Object.oncomplete (evalmachine.<anonymous>:107:15) npm ERR! Error: ENOENT, lstat '/usr/local/lib/node_modules/hexo/node_modules/cheerio/node_modules/jsdom/node_modules/request/node_modules/form-data/node_modules/async/lib/async.js' npm ERR! If you need help, you may report this *entire* log, npm ERR! including the npm and node versions, at: npm ERR! <http://github.com/npm/npm/issues> npm ERR! System Linux 3.19.0-51-generic npm ERR! command "/usr/bin/nodejs" "/usr/bin/npm" "install" "hexo" "-g" npm ERR! cwd /home/sjd/code npm ERR! node -v v0.10.25 npm ERR! npm -v 1.4.21 npm ERR! path /usr/local/lib/node_modules/hexo/node_modules/cheerio/node_modules/jsdom/node_modules/request/node_modules/form-data/node_modules/async/lib/async.js npm ERR! fstream_path /usr/local/lib/node_modules/hexo/node_modules/cheerio/node_modules/jsdom/node_modules/request/node_modules/form-data/node_modules/async/lib/async.js npm ERR! fstream_type File npm ERR! fstream_class FileWriter npm ERR! code ENOENT npm ERR! errno 34 npm ERR! fstream_stack /usr/lib/nodejs/fstream/lib/writer.js:284:26 npm ERR! fstream_stack Object.oncomplete (evalmachine.<anonymous>:107:15) npm ERR! Error: ENOENT, lstat '/usr/local/lib/node_modules/hexo/node_modules/cheerio/node_modules/jsdom/node_modules/request/node_modules/bl/node_modules/readable-stream/doc/stream.markdown' npm ERR! If you need help, you may report this *entire* log, npm ERR! including the npm and node versions, at: npm ERR! <http://github.com/npm/npm/issues> ```
为什么我新建的RN工程没有index.ios.js和index.android.js两个文件
![图片说明](https://img-ask.csdn.net/upload/201710/12/1507774592_140042.png) 图片是我工程目录,没有index.ios.js和index.android.js两个文件两个文件,所以执行 ``` react-native start ``` 会失败。但是可以执行react-native run-android之后直接运行程序? 请问react-native大神,这是什么原因? 另外用 ``` npm install -g yarn react-native-cli ``` 和 ``` git clone https://github.com/facebook/react-native.git ``` 两种方式安装react-native有什么区别?
npm 下载模块报错。如图
![图片说明](https://img-ask.csdn.net/upload/201612/19/1482114599_215456.png) 无论是install什么,都会报错。网上关于这个的讨论很多,可是都试过还是失败。切换淘宝镜像、本地shadowsocks也退了,vpn也退了,还是报错。求助啊,没法进行下去了。网上说可以用cnpm,可是我cnpm都install不了...求助各位!(抱歉只有一个c币了)
cordova创建工程失败,如何解决?
错误信息如下: $ cordova create demo Creating a new cordova project. Error: Unhandled "error" event. ( Error from Cordova Fetch: Error: cmd: Command npm ERR! code ENOLOCAL npm ERR! Could not install from "..\..\AppData\Roaming\npm\node_modules\cordova\ npm ERR! A complete log of this run can be found in: npm ERR! C:\Users\Corey\AppData\Roaming\npm-cache\_logs\2017-08-16T06_40_41_
koa2搭建nuxt无法正常启动
https://github.com/nuxt-community/koa-template/tree/master/template ```bash npm install 成功 npm run dev 失败 ``` 报错信息:![图片说明](https://img-ask.csdn.net/upload/201901/06/1546789733_314082.png) Cannot find module 'E:\gitRep\nuxt-learn\build\main.js' 看了下他源项目里也没有build这个文件夹啊。看了半天文档也看不出有什么解决办法,求各位大神帮助。
Rap2页面运行失败,Rap2-dolores本地运行报错了
npm run dev运行rap2-dolores,访问页面出现以下错误: ``` Wrote 38 CSS files to D:\WorkSpace\Rap2\rap2-dolores\build\ Starting the development server... Failed to compile. ./src/components/organization/OrganizationRepositoryList.tsx Module not found: Can't resolve '../repository/Repository.css' in 'D:\WorkSpace\Rap2\rap2-dolores\src\components\organization' ``` npm install 没报错,npm build也会报错,下面是npm build的日志文件: ``` 0 info it worked if it ends with ok 1 verbose cli [ 'C:\\Program Files\\nodejs\\node.exe', 1 verbose cli 'C:\\Program Files\\nodejs\\node_modules\\npm\\bin\\npm-cli.js', 1 verbose cli 'run', 1 verbose cli 'build' ] 2 info using npm@6.4.1 3 info using node@v10.15.3 4 verbose run-script [ 'prebuild', 'build', 'postbuild' ] 5 info lifecycle rap2-dolores@1.0.0~prebuild: rap2-dolores@1.0.0 6 info lifecycle rap2-dolores@1.0.0~build: rap2-dolores@1.0.0 7 verbose lifecycle rap2-dolores@1.0.0~build: unsafe-perm in lifecycle true 8 verbose lifecycle rap2-dolores@1.0.0~build: PATH: C:\Program Files\nodejs\node_modules\npm\node_modules\npm-lifecycle\node-gyp-bin;D:\WorkSpace\Rap2\rap2-dolores\node_modules\.bin;D:\WorkSpace\Rap2\rap2-dolores\node_modules\.bin;D:\Matlab\bin;D:\Matlab\bin\win64;C:\Program Files (x86)\Intel\Intel(R) Management Engine Components\iCLS\;C:\Program Files\Intel\Intel(R) Management Engine Components\iCLS\;C:\WINDOWS\system32;C:\WINDOWS;C:\WINDOWS\System32\Wbem;C:\WINDOWS\System32\WindowsPowerShell\v1.0\;C:\Program Files (x86)\Intel\Intel(R) Management Engine Components\DAL;C:\Program Files\Intel\Intel(R) Management Engine Components\DAL;C:\Program Files (x86)\Intel\Intel(R) Management Engine Components\IPT;C:\Program Files\Intel\Intel(R) Management Engine Components\IPT;C:\WINDOWS\System32\OpenSSH\;C:\Java\jdk1.8.0_91\bin;C:\Program Files\TortoiseGit\bin;C:\Program Files\nodejs\;D:\Matlab\bin\win64;D:\matlab\runtime\win64;D:\matlab\bin;D:\oKit\apache\bin\;C:\Users\admin\AppData\Local\Microsoft\WindowsApps;C:\Users\admin\AppData\Roaming\npm 9 verbose lifecycle rap2-dolores@1.0.0~build: CWD: D:\WorkSpace\Rap2\rap2-dolores 10 silly lifecycle rap2-dolores@1.0.0~build: Args: [ '/d /s /c', 10 silly lifecycle 'npm run lint && npm run build-css && react-scripts build' ] 11 silly lifecycle rap2-dolores@1.0.0~build: Returned: code: 1 signal: null 12 info lifecycle rap2-dolores@1.0.0~build: Failed to exec build script 13 verbose stack Error: rap2-dolores@1.0.0 build: `npm run lint && npm run build-css && react-scripts build` 13 verbose stack Exit status 1 13 verbose stack at EventEmitter.<anonymous> (C:\Program Files\nodejs\node_modules\npm\node_modules\npm-lifecycle\index.js:301:16) 13 verbose stack at EventEmitter.emit (events.js:189:13) 13 verbose stack at ChildProcess.<anonymous> (C:\Program Files\nodejs\node_modules\npm\node_modules\npm-lifecycle\lib\spawn.js:55:14) 13 verbose stack at ChildProcess.emit (events.js:189:13) 13 verbose stack at maybeClose (internal/child_process.js:970:16) 13 verbose stack at Process.ChildProcess._handle.onexit (internal/child_process.js:259:5) 14 verbose pkgid rap2-dolores@1.0.0 15 verbose cwd D:\WorkSpace\Rap2\rap2-dolores 16 verbose Windows_NT 10.0.17134 17 verbose argv "C:\\Program Files\\nodejs\\node.exe" "C:\\Program Files\\nodejs\\node_modules\\npm\\bin\\npm-cli.js" "run" "build" 18 verbose node v10.15.3 19 verbose npm v6.4.1 20 error code ELIFECYCLE 21 error errno 1 22 error rap2-dolores@1.0.0 build: `npm run lint && npm run build-css && react-scripts build` 22 error Exit status 1 23 error Failed at the rap2-dolores@1.0.0 build script. 23 error This is probably not a problem with npm. There is likely additional logging output above. 24 verbose exit [ 1, true ] ```
node.js的安装sharp模块失败,编译有问题
系统centos6 ![失败图片](https://img-ask.csdn.net/upload/201706/04/1496582324_324860.png) 使用yarn add sharp会出现如上图报错 gcc已经是4.8.2版本 ``` [root@iZj6c9dop65dq9fi3foeweZ xd-news]# gcc -v Using built-in specs. COLLECT_GCC=gcc COLLECT_LTO_WRAPPER=/usr/local/libexec/gcc/x86_64-unknown-linux-gnu/4.8.2/lto-wrapper Target: x86_64-unknown-linux-gnu Configured with: ../gcc-4.8.2/configure --enable-checking=release --enable-languages=c,c++ --disable-multilib Thread model: posix gcc version 4.8.2 (GCC) ``` http://www.cnblogs.com/jhj117/p/6117204.html 根据这个链接验证了c++11正常 不知道为何仍然会出现error GCC version 4.6+ is required for C++11 features - see sharp.dimens.io/page/install#prerequisites 百度后得知gcc编译需要加上 -std=c++11 是不是和这个有关系? ps:npm安装sharp也会失败
create-react-app 报错无法创建项目,Extracting tar content of undefined failed
使用create-react-app脚手架创建项目一直报错失败, ![图片说明](https://img-ask.csdn.net/upload/201904/02/1554189480_580034.png) 百度,Google都找过,网上说的解决办法如下: 1. yarn.lock(新建项目目录下没有这个文件) 2. ``` yarn cache clean yarn install --network-concurrency 1 ``` 试过了也没用。 npm 和yarn也都是最新的了,几个月前还能创建项目,现在是怎么都没法创建react项目了,不知道怎么搞,求助,或者还有不用create-react-app来创建react项目的方便方法吗 我没有C币,尴尬
为什么nuxt.js无法安装node-sass?
1.npm 不管怎么样都安装不了 淘宝镜像也没用 2.每次安装后都卡在Downloading binary from https://github.com/sass/node-sass/releases/download/v4.12.0/win32-x64-64这里然后就报错 3.T.T小白求教 ``` PS E:\Users\FuYuHao\Desktop\sb\a\aaa> npm i node-sass > node-sass@4.12.0 install E:\Users\FuYuHao\Desktop\sb\a\aaa\node_modules\node-sass > node scripts/install.js Downloading binary from https://github.com/sass/node-sass/releases/download/v4.12.0/win32-x64-64_binding.node Cannot download "https://github.com/sass/node-sass/releases/download/v4.12.0/win32-x64-64_binding.node": connect ETIMEDOUT 52.216.135.19:443 Timed out whilst downloading the prebuilt binary Hint: If github.com is not accessible in your location try setting a proxy via HTTP_PROXY, e.g. export HTTP_PROXY=http://example.com:1234 or configure npm proxy via npm config set proxy http://example.com:8080 > node-sass@4.12.0 postinstall E:\Users\FuYuHao\Desktop\sb\a\aaa\node_modules\node-sass > node scripts/build.js Building: C:\Program Files\nodejs\node.exe E:\Users\FuYuHao\Desktop\sb\a\aaa\node_modules\node-gyp\bin\node-gyp.js rebuild --verbose --libsass_ext= --libsass_cflags= --libsass_ldflags= --libsass_library= gyp info it worked if it ends with ok gyp verb cli [ 'C:\\Program Files\\nodejs\\node.exe', gyp verb cli 'E:\\Users\\FuYuHao\\Desktop\\sb\\a\\aaa\\node_modules\\node-gyp\\bin\\node-gyp.js', gyp verb cli 'rebuild', gyp verb cli '--verbose', gyp verb cli '--libsass_ext=', gyp verb cli '--libsass_cflags=', gyp verb cli '--libsass_ldflags=', gyp verb cli '--libsass_library=' ] gyp info using node-gyp@3.8.0 gyp info using node@10.14.1 | win32 | x64 gyp verb command rebuild [] gyp verb command clean [] gyp verb clean removing "build" directory gyp verb command configure [] gyp verb check python checking for Python executable "python2" in the PATH gyp verb `which` failed Error: not found: python2 gyp verb `which` failed at getNotFoundError (E:\Users\FuYuHao\Desktop\sb\a\aaa\node_modules\which\which.js:13:12) gyp verb `which` failed at F (E:\Users\FuYuHao\Desktop\sb\a\aaa\node_modules\which\which.js:68:19) gyp verb `which` failed at E (E:\Users\FuYuHao\Desktop\sb\a\aaa\node_modules\which\which.js:80:29) gyp verb `which` failed at E:\Users\FuYuHao\Desktop\sb\a\aaa\node_modules\which\which.js:89:16 gyp verb `which` failed at E:\Users\FuYuHao\Desktop\sb\a\aaa\node_modules\isexe\index.js:42:5 gyp verb `which` failed at E:\Users\FuYuHao\Desktop\sb\a\aaa\node_modules\isexe\windows.js:36:5 gyp verb `which` failed at FSReqWrap.oncomplete (fs.js:154:21) gyp verb `which` failed python2 { Error: not found: python2 gyp verb `which` failed at getNotFoundError (E:\Users\FuYuHao\Desktop\sb\a\aaa\node_modules\which\which.js:13:12) gyp verb `which` failed at F (E:\Users\FuYuHao\Desktop\sb\a\aaa\node_modules\which\which.js:68:19) gyp verb `which` failed at E (E:\Users\FuYuHao\Desktop\sb\a\aaa\node_modules\which\which.js:80:29) gyp verb `which` failed at E:\Users\FuYuHao\Desktop\sb\a\aaa\node_modules\which\which.js:89:16 gyp verb `which` failed at E:\Users\FuYuHao\Desktop\sb\a\aaa\node_modules\isexe\index.js:42:5 gyp verb `which` failed at E:\Users\FuYuHao\Desktop\sb\a\aaa\node_modules\isexe\windows.js:36:5 gyp verb `which` failed at FSReqWrap.oncomplete (fs.js:154:21) gyp verb `which` failed stack: gyp verb `which` failed 'Error: not found: python2\n at getNotFoundError (E:\\Users\\FuYuHao\\Desktop\\sb\\a\\aaa\\node_modules\\which\\which.js:13:12)\n at F (E:\\Users\\FuYuHao\\Desktop\\sb\\a\\aaa\\node_modules\\which\\which.js:68:19)\n at E (E:\\Users\\FuYuHao\\Desktop\\sb\\a\\aaa\\node_modules\\which\\which.js:80:29)\n at E:\\Users\\FuYuHao\\Desktop\\sb\\a\\aaa\\node_modules\\which\\which.js:89:16\n at E:\\Users\\FuYuHao\\Desktop\\sb\\a\\aaa\\node_modules\\isexe\\index.js:42:5\n at E:\\Users\\FuYuHao\\Desktop\\sb\\a\\aaa\\node_modules\\isexe\\windows.js:36:5\n at FSReqWrap.oncomplete (fs.js:154:21)', gyp verb `which` failed code: 'ENOENT' } gyp verb check python checking for Python executable "python" in the PATH gyp verb `which` succeeded python C:\Python27\python.EXE gyp verb check python version `C:\Python27\python.EXE -c "import sys; print "2.7.15 gyp verb check python version .%s.%s" % sys.version_info[:3];"` returned: %j gyp verb get node dir no --target version specified, falling back to host node version: 10.14.1 gyp verb command install [ '10.14.1' ] gyp verb install input version string "10.14.1" gyp verb install installing version: 10.14.1 gyp verb install --ensure was passed, so won't reinstall if already installed gyp verb install version is already installed, need to check "installVersion" gyp verb got "installVersion" 9 gyp verb needs "installVersion" 9 gyp verb install version is good gyp verb get node dir target node version installed: 10.14.1 gyp verb build dir attempting to create "build" dir: E:\Users\FuYuHao\Desktop\sb\a\aaa\node_modules\node-sass\build gyp verb build dir "build" dir needed to be created? E:\Users\FuYuHao\Desktop\sb\a\aaa\node_modules\node-sass\build gyp verb find vs2017 Found installation at: C:\Program Files (x86)\Microsoft Visual Studio\2017\BuildTools gyp verb find vs2017 - Found Microsoft.VisualStudio.Component.Windows10SDK.17763 gyp verb find vs2017 - Found Microsoft.VisualStudio.Component.VC.Tools.x86.x64 gyp verb find vs2017 - Found Microsoft.VisualStudio.VC.MSBuild.Base gyp verb find vs2017 - Using this installation with Windows 10 SDK gyp verb find vs2017 using installation: C:\Program Files (x86)\Microsoft Visual Studio\2017\BuildTools gyp verb build/config.gypi creating config file gyp verb build/config.gypi writing out config file: E:\Users\FuYuHao\Desktop\sb\a\aaa\node_modules\node-sass\build\config.gypi gyp verb config.gypi checking for gypi file: E:\Users\FuYuHao\Desktop\sb\a\aaa\node_modules\node-sass\config.gypi gyp verb common.gypi checking for gypi file: E:\Users\FuYuHao\Desktop\sb\a\aaa\node_modules\node-sass\common.gypi gyp verb gyp gyp format was not specified; forcing "msvs" gyp info spawn C:\Python27\python.EXE gyp info spawn args [ 'E:\\Users\\FuYuHao\\Desktop\\sb\\a\\aaa\\node_modules\\node-gyp\\gyp\\gyp_main.py', gyp info spawn args 'binding.gyp', gyp info spawn args '-f', gyp info spawn args 'msvs', gyp info spawn args '-G', gyp info spawn args 'msvs_version=2015', gyp info spawn args '-I', gyp info spawn args 'E:\\Users\\FuYuHao\\Desktop\\sb\\a\\aaa\\node_modules\\node-sass\\build\\config.gypi', gyp info spawn args '-I', gyp info spawn args 'E:\\Users\\FuYuHao\\Desktop\\sb\\a\\aaa\\node_modules\\node-gyp\\addon.gypi', gyp info spawn args '-I', gyp info spawn args 'C:\\Users\\FuYuHao\\.node-gyp\\10.14.1\\include\\node\\common.gypi', gyp info spawn args '-Dlibrary=shared_library', gyp info spawn args '-Dvisibility=default', gyp info spawn args '-Dnode_root_dir=C:\\Users\\FuYuHao\\.node-gyp\\10.14.1', gyp info spawn args '-Dnode_gyp_dir=E:\\Users\\FuYuHao\\Desktop\\sb\\a\\aaa\\node_modules\\node-gyp', gyp info spawn args '-Dnode_lib_file=C:\\Users\\FuYuHao\\.node-gyp\\10.14.1\\<(target_arch)\\node.lib', gyp info spawn args '-Dmodule_root_dir=E:\\Users\\FuYuHao\\Desktop\\sb\\a\\aaa\\node_modules\\node-sass', gyp info spawn args '-Dnode_engine=v8', gyp info spawn args '--depth=.', gyp info spawn args '--no-parallel', gyp info spawn args '--generator-output', gyp info spawn args 'E:\\Users\\FuYuHao\\Desktop\\sb\\a\\aaa\\node_modules\\node-sass\\build', gyp info spawn args '-Goutput_dir=.' ] gyp verb command build [] gyp verb build type Release gyp verb architecture x64 gyp verb node dev dir C:\Users\FuYuHao\.node-gyp\10.14.1 gyp verb found first Solution file build/binding.sln gyp verb using MSBuild: C:\Program Files (x86)\Microsoft Visual Studio\2017\BuildTools\MSBuild\15.0\Bin\MSBuild.exe gyp info spawn C:\Program Files (x86)\Microsoft Visual Studio\2017\BuildTools\MSBuild\15.0\Bin\MSBuild.exe gyp info spawn args [ 'build/binding.sln', gyp info spawn args '/nologo', gyp info spawn args '/p:Configuration=Release;Platform=x64' ] 在此解决方案中一次生成一个项目。若要启用并行生成,请添加“/m”开关。 生成启动时间为 2019/5/29 22:01:12。 节点 1 上的项目“E:\Users\FuYuHao\Desktop\sb\a\aaa\node_modules\node-sass\build\binding.sln”(默认目标)。 ValidateSolutionConfiguration: 正在生成解决方案配置“Release|x64”。 项目“E:\Users\FuYuHao\Desktop\sb\a\aaa\node_modules\node-sass\build\binding.sln”(1)正在节点 1 上生成“E:\Users\FuYuHao\Desktop\sb\a\aaa\node_modules\node-sass\build\binding.vcxproj.metaproj”(2) (默认目标)。 项目“E:\Users\FuYuHao\Desktop\sb\a\aaa\node_modules\node-sass\build\binding.vcxproj.metaproj”(2)正在节点 1 上生成“E:\Users\FuYuHao\Desktop\sb\a\aaa\node_modules\node-sass\build\src\libsass.vcxproj”(3) (默认目标)。 PrepareForBuild: 正在创建目录“Release\obj\libsass\”。 正在创建目录“E:\Users\FuYuHao\Desktop\sb\a\aaa\node_modules\node-sass\build\Release\”。 正在创建目录“Release\obj\libsass\libsass.tlog\”。 InitializeBuildStatus: 正在创建“Release\obj\libsass\libsass.tlog\unsuccessfulbuild”,因为已指定“AlwaysCreate”。 ClCompile: C:\Program Files (x86)\Microsoft Visual Studio\2017\BuildTools\VC\Tools\MSVC\14.16.27023\bin\HostX64\x64\CL.exe /c /I"C:\Users\FuYuHao\.node-gyp\10.14.1\include\node" /I"C:\Users\FuYuHao\.node-gyp\10.14.1\src" /I"C:\Use rs\FuYuHao\.node-gyp\10.14.1\deps\openssl\config" /I"C:\Users\FuYuHao\.node-gyp\10.14.1\deps\openssl\openssl\include" /I"C:\Users\FuYuHao\.node-gyp\10.14.1\deps\uv\include" /I"C:\Users\FuYuHao\.node-gyp\10.14.1\deps\zli b" /I"C:\Users\FuYuHao\.node-gyp\10.14.1\deps\v8\include" /I..\..\src\libsass\include /Z7 /nologo /W3 /WX- /diagnostics:classic /MP /Ox /Ob2 /Oi /Ot /Oy /GL /D NODE_GYP_MODULE_NAME=libsass /D USING_UV_SHARED=1 /D USING_ V8_SHARED=1 /D V8_DEPRECATION_WARNINGS=1 /D WIN32 /D _CRT_SECURE_NO_DEPRECATE /D _CRT_NONSTDC_NO_DEPRECATE /D _HAS_EXCEPTIONS=0 /D "LIBSASS_VERSION=\"3.5.4\"" /GF /Gm- /MT /GS /Gy /fp:precise /Zc:wchar_t /Zc:forScope /Z c:inline /GR- /Fo"Release\obj\libsass\\" /Fd"Release\obj\libsass\libsass.pdb" /Gd /TP /wd4351 /wd4355 /wd4800 /wd4251 /wd4275 /wd4244 /wd4267 /FC /errorReport:queue /GR /EHsc ..\..\src\libsass\src\ast.cpp ..\..\src\libs ass\src\ast_fwd_decl.cpp ..\..\src\libsass\src\backtrace.cpp ..\..\src\libsass\src\base64vlq.cpp ..\..\src\libsass\src\bind.cpp ..\..\src\libsass\src\check_nesting.cpp ..\..\src\libsass\src\color_maps.cpp ..\..\src\libs ass\src\constants.cpp ..\..\src\libsass\src\context.cpp ..\..\src\libsass\src\cssize.cpp ..\..\src\libsass\src\emitter.cpp ..\..\src\libsass\src\environment.cpp ..\..\src\libsass\src\error_handling.cpp ..\..\src\libsass \src\eval.cpp ..\..\src\libsass\src\expand.cpp ..\..\src\libsass\src\extend.cpp ..\..\src\libsass\src\file.cpp ..\..\src\libsass\src\functions.cpp ..\..\src\libsass\src\inspect.cpp ..\..\src\libsass\src\json.cpp ..\..\s rc\libsass\src\lexer.cpp ..\..\src\libsass\src\listize.cpp ..\..\src\libsass\src\memory\SharedPtr.cpp ..\..\src\libsass\src\node.cpp ..\..\src\libsass\src\operators.cpp ..\..\src\libsass\src\output.cpp ..\..\src\libsass \src\parser.cpp ..\..\src\libsass\src\plugins.cpp ..\..\src\libsass\src\position.cpp ..\..\src\libsass\src\prelexer.cpp ..\..\src\libsass\src\remove_placeholders.cpp ..\..\src\libsass\src\sass.cpp ..\..\src\libsass\src\ sass2scss.cpp ..\..\src\libsass\src\sass_context.cpp ..\..\src\libsass\src\sass_functions.cpp ..\..\src\libsass\src\sass_util.cpp ..\..\src\libsass\src\sass_values.cpp ..\..\src\libsass\src\source_map.cpp ..\..\src\libs ass\src\subset_map.cpp ..\..\src\libsass\src\to_c.cpp ..\..\src\libsass\src\to_value.cpp ..\..\src\libsass\src\units.cpp ..\..\src\libsass\src\utf8_string.cpp ..\..\src\libsass\src\util.cpp ..\..\src\libsass\src\values. cpp cl : 命令行 warning D9025: 正在重写“/GR-”(用“/GR”) [E:\Users\FuYuHao\Desktop\sb\a\aaa\node_modules\node-sass\build\src\libsass.vcxproj] cl : 命令行 warning D9025: 正在重写“/GR-”(用“/GR”) [E:\Users\FuYuHao\Desktop\sb\a\aaa\node_modules\node-sass\build\src\libsass.vcxproj] ast.cpp cl : 命令行 warning D9025: 正在重写“/GR-”(用“/GR”) [E:\Users\FuYuHao\Desktop\sb\a\aaa\node_modules\node-sass\build\src\libsass.vcxproj] ast_fwd_decl.cpp cl : 命令行 warning D9025: 正在重写“/GR-”(用“/GR”) [E:\Users\FuYuHao\Desktop\sb\a\aaa\node_modules\node-sass\build\src\libsass.vcxproj] backtrace.cpp cl : 命令行 warning D9025: 正在重写“/GR-”(用“/GR”) [E:\Users\FuYuHao\Desktop\sb\a\aaa\node_modules\node-sass\build\src\libsass.vcxproj] base64vlq.cpp bind.cpp check_nesting.cpp color_maps.cpp constants.cpp context.cpp cssize.cpp emitter.cpp environment.cpp error_handling.cpp eval.cpp expand.cpp extend.cpp file.cpp functions.cpp inspect.cpp json.cpp e:\users\fuyuhao\desktop\sb\a\aaa\node_modules\node-sass\src\libsass\src\json.cpp(26): warning C4005: “_CRT_NONSTDC_NO_DEPRECATE”: 宏重定义 [E:\Users\FuYuHao\Desktop\sb\a\aaa\node_modules\node-sass\build\src\libsass.vcxp roj] e:\users\fuyuhao\desktop\sb\a\aaa\node_modules\node-sass\src\libsass\src\json.cpp: note: 参见“_CRT_NONSTDC_NO_DEPRECATE”的前一个定义 lexer.cpp listize.cpp SharedPtr.cpp node.cpp operators.cpp output.cpp parser.cpp plugins.cpp position.cpp prelexer.cpp remove_placeholders.cpp sass.cpp sass2scss.cpp e:\users\fuyuhao\desktop\sb\a\aaa\node_modules\node-sass\src\libsass\src\sass2scss.cpp(9): warning C4005: “_CRT_NONSTDC_NO_DEPRECATE”: 宏重定义 [E:\Users\FuYuHao\Desktop\sb\a\aaa\node_modules\node-sass\build\src\libsass. vcxpr oj] e:\users\fuyuhao\desktop\sb\a\aaa\node_modules\node-sass\src\libsass\src\sass2scss.cpp: note: 参见“_CRT_NONSTDC_NO_DEPRECATE”的前一个定义 sass_context.cpp sass_functions.cpp sass_util.cpp sass_values.cpp source_map.cpp subset_map.cpp to_c.cpp to_value.cpp units.cpp utf8_string.cpp util.cpp values.cpp C:\Program Files (x86)\Microsoft Visual Studio\2017\BuildTools\VC\Tools\MSVC\14.16.27023\bin\HostX64\x64\CL.exe /c /I"C:\Users\FuYuHao\.node-gyp\10.14.1\include\node" /I"C:\Users\FuYuHao\.node-gyp\10.14.1\src" /I"C:\Use rs\FuYuHao\.node-gyp\10.14.1\deps\openssl\config" /I"C:\Users\FuYuHao\.node-gyp\10.14.1\deps\openssl\openssl\include" /I"C:\Users\FuYuHao\.node-gyp\10.14.1\deps\uv\include" /I"C:\Users\FuYuHao\.node-gyp\10.14.1\deps\zli b" /I"C:\Users\FuYuHao\.node-gyp\10.14.1\deps\v8\include" /I..\..\src\libsass\include /Z7 /nologo /W3 /WX- /diagnostics:classic /MP /Ox /Ob2 /Oi /Ot /Oy /GL /D NODE_GYP_MODULE_NAME=libsass /D USING_UV_SHARED=1 /D USING_ V8_SHARED=1 /D V8_DEPRECATION_WARNINGS=1 /D WIN32 /D _CRT_SECURE_NO_DEPRECATE /D _CRT_NONSTDC_NO_DEPRECATE /D _HAS_EXCEPTIONS=0 /D "LIBSASS_VERSION=\"3.5.4\"" /GF /Gm- /MT /GS /Gy /fp:precise /Zc:wchar_t /Zc:forScope /Z c:inline /GR- /Fo"Release\obj\libsass\\" /Fd"Release\obj\libsass\libsass.pdb" /Gd /TC /wd4351 /wd4355 /wd4800 /wd4251 /wd4275 /wd4244 /wd4267 /FC /errorReport:queue /GR /EHsc ..\..\src\libsass\src\cencode.c cl : 命令行 warning D9025: 正在重写“/GR-”(用“/GR”) [E:\Users\FuYuHao\Desktop\sb\a\aaa\node_modules\node-sass\build\src\libsass.vcxproj] cencode.c Lib: C:\Program Files (x86)\Microsoft Visual Studio\2017\BuildTools\VC\Tools\MSVC\14.16.27023\bin\HostX64\x64\Lib.exe /OUT:"E:\Users\FuYuHao\Desktop\sb\a\aaa\node_modules\node-sass\build\Release\libsass.lib" /NOLOGO /MACHINE :X64 /LTCG:INCREMENTAL Release\obj\libsass\ast.obj Release\obj\libsass\ast_fwd_decl.obj Release\obj\libsass\backtrace.obj Release\obj\libsass\base64vlq.obj Release\obj\libsass\bind.obj Release\obj\libsass\cencode.obj Release\obj\libsass\check_nesting.obj Release\obj\libsass\color_maps.obj Release\obj\libsass\constants.obj Release\obj\libsass\context.obj Release\obj\libsass\cssize.obj Release\obj\libsass\emitter.obj Release\obj\libsass\environment.obj Release\obj\libsass\error_handling.obj Release\obj\libsass\eval.obj Release\obj\libsass\expand.obj Release\obj\libsass\extend.obj Release\obj\libsass\file.obj Release\obj\libsass\functions.obj Release\obj\libsass\inspect.obj Release\obj\libsass\json.obj Release\obj\libsass\lexer.obj Release\obj\libsass\listize.obj Release\obj\libsass\SharedPtr.obj Release\obj\libsass\node.obj Release\obj\libsass\operators.obj Release\obj\libsass\output.obj Release\obj\libsass\parser.obj Release\obj\libsass\plugins.obj Release\obj\libsass\position.obj Release\obj\libsass\prelexer.obj Release\obj\libsass\remove_placeholders.obj Release\obj\libsass\sass.obj Release\obj\libsass\sass2scss.obj Release\obj\libsass\sass_context.obj Release\obj\libsass\sass_functions.obj Release\obj\libsass\sass_util.obj Release\obj\libsass\sass_values.obj Release\obj\libsass\source_map.obj Release\obj\libsass\subset_map.obj Release\obj\libsass\to_c.obj Release\obj\libsass\to_value.obj Release\obj\libsass\units.obj Release\obj\libsass\utf8_string.obj Release\obj\libsass\util.obj Release\obj\libsass\values.obj libsass.vcxproj -> E:\Users\FuYuHao\Desktop\sb\a\aaa\node_modules\node-sass\build\Release\\libsass.lib FinalizeBuildStatus: 正在删除文件“Release\obj\libsass\libsass.tlog\unsuccessfulbuild”。 正在对“Release\obj\libsass\libsass.tlog\libsass.lastbuildstate”执行 Touch 任务。 已完成生成项目“E:\Users\FuYuHao\Desktop\sb\a\aaa\node_modules\node-sass\build\src\libsass.vcxproj”(默认目标)的操作。 项目“E:\Users\FuYuHao\Desktop\sb\a\aaa\node_modules\node-sass\build\binding.vcxproj.metaproj”(2)正在节点 1 上生成“E:\Users\FuYuHao\Desktop\sb\a\aaa\node_modules\node-sass\build\binding.vcxproj”(4) (默认目标)。 PrepareForBuild: 正在创建目录“Release\obj\binding\”。 正在创建目录“Release\obj\binding\binding.tlog\”。 InitializeBuildStatus: 正在创建“Release\obj\binding\binding.tlog\unsuccessfulbuild”,因为已指定“AlwaysCreate”。 ClCompile: C:\Program Files (x86)\Microsoft Visual Studio\2017\BuildTools\VC\Tools\MSVC\14.16.27023\bin\HostX64\x64\CL.exe /c /I"C:\Users\FuYuHao\.node-gyp\10.14.1\include\node" /I"C:\Users\FuYuHao\.node-gyp\10.14.1\src" /I"C:\Use rs\FuYuHao\.node-gyp\10.14.1\deps\openssl\config" /I"C:\Users\FuYuHao\.node-gyp\10.14.1\deps\openssl\openssl\include" /I"C:\Users\FuYuHao\.node-gyp\10.14.1\deps\uv\include" /I"C:\Users\FuYuHao\.node-gyp\10.14.1\deps\zli b" /I"C:\Users\FuYuHao\.node-gyp\10.14.1\deps\v8\include" /I..\..\nan /I..\src\libsass\include /Z7 /nologo /W3 /WX- /diagnostics:classic /MP /Ox /Ob2 /Oi /Ot /Oy /GL /D NODE_GYP_MODULE_NAME=binding /D USING_UV_SHARED=1 /D USING_V8_SHARED=1 /D V8_DEPRECATION_WARNINGS=1 /D WIN32 /D _CRT_SECURE_NO_DEPRECATE /D _CRT_NONSTDC_NO_DEPRECATE /D _HAS_EXCEPTIONS=0 /D BUILDING_NODE_EXTENSION /D _WINDLL /GF /Gm- /MT /GS /Gy /fp:precise /Zc:wchar_t /Zc:forScope /Zc:inline /GR- /Fo"Release\obj\binding\\" /Fd"Release\obj\binding\vc141.pdb" /Gd /TP /wd4351 /wd4355 /wd4800 /wd4251 /wd4275 /wd4244 /wd4267 /FC /errorReport:queue /Zc:threadSafeInit- ..\src\binding.cpp . .\src\create_string.cpp ..\src\custom_function_bridge.cpp ..\src\custom_importer_bridge.cpp ..\src\sass_context_wrapper.cpp ..\src\sass_types\boolean.cpp ..\src\sass_types\color.cpp ..\src\sass_types\error.cpp ..\src\sa ss_types\factory.cpp ..\src\sass_types\list.cpp ..\src\sass_types\map.cpp ..\src\sass_types\null.cpp ..\src\sass_types\number.cpp ..\src\sass_types\string.cpp "E:\Users\FuYuHao\Desktop\sb\a\aaa\node_modules\node-gyp\src \win_delay_load_hook.cc" binding.cpp create_string.cpp custom_function_bridge.cpp custom_importer_bridge.cpp sass_context_wrapper.cpp boolean.cpp color.cpp error.cpp factory.cpp list.cpp map.cpp null.cpp number.cpp string.cpp win_delay_load_hook.cc Link: C:\Program Files (x86)\Microsoft Visual Studio\2017\BuildTools\VC\Tools\MSVC\14.16.27023\bin\HostX64\x64\link.exe /ERRORREPORT:QUEUE /OUT:"E:\Users\FuYuHao\Desktop\sb\a\aaa\node_modules\node-sass\build\Release\binding.n ode" /INCREMENTAL:NO /NOLOGO kernel32.lib user32.lib gdi32.lib winspool.lib comdlg32.lib advapi32.lib shell32.lib ole32.lib oleaut32.lib uuid.lib odbc32.lib DelayImp.lib "C:\Users\FuYuHao\.node-gyp\10.14.1\x64\node.lib" Delayimp.lib /DELAYLOAD:iojs.exe /DELAYLOAD:node.exe /MANIFEST /MANIFESTUAC:"level='asInvoker' uiAccess='false'" /manifest:embed /DEBUG /PDB:"E:\Users\FuYuHao\Desktop\sb\a\aaa\node_modules\node-sass\build\Release\bindi ng.pdb" /MAP /MAPINFO:EXPORTS /OPT:REF /OPT:ICF /TLBID:1 /RELEASE /DYNAMICBASE /NXCOMPAT /MACHINE:X64 /ignore:4199 /LTCG:INCREMENTAL /DLL Release\obj\binding\binding.obj Release\obj\binding\create_string.obj Release\obj\binding\custom_function_bridge.obj Release\obj\binding\custom_importer_bridge.obj Release\obj\binding\sass_context_wrapper.obj Release\obj\binding\boolean.obj Release\obj\binding\color.obj Release\obj\binding\error.obj Release\obj\binding\factory.obj Release\obj\binding\list.obj Release\obj\binding\map.obj Release\obj\binding\null.obj Release\obj\binding\number.obj Release\obj\binding\string.obj Release\obj\binding\win_delay_load_hook.obj "E:\Users\FuYuHao\Desktop\sb\a\aaa\node_modules\node-sass\build\Release\libsass.lib" C:\Users\FuYuHao\.node-gyp\10.14.1\x64\node.lib : fatal error LNK1107: 文件无效或损坏: 无法在 0x39F993 处读取 [E:\Users\FuYuHao\Desktop\sb\a\aaa\node_modules\node-sass\build\binding.vcxproj] 已完成生成项目“E:\Users\FuYuHao\Desktop\sb\a\aaa\node_modules\node-sass\build\binding.vcxproj”(默认目标)的操作 - 失败。 已完成生成项目“E:\Users\FuYuHao\Desktop\sb\a\aaa\node_modules\node-sass\build\binding.vcxproj.metaproj”(默认目标)的操作 - 失败。 已完成生成项目“E:\Users\FuYuHao\Desktop\sb\a\aaa\node_modules\node-sass\build\binding.sln”(默认目标)的操作 - 失败。 生成失败。 “E:\Users\FuYuHao\Desktop\sb\a\aaa\node_modules\node-sass\build\binding.sln”(默认目标) (1) -> “E:\Users\FuYuHao\Desktop\sb\a\aaa\node_modules\node-sass\build\binding.vcxproj.metaproj”(默认目标) (2) -> “E:\Users\FuYuHao\Desktop\sb\a\aaa\node_modules\node-sass\build\src\libsass.vcxproj”(默认目标) (3) -> (ClCompile 目标) -> cl : 命令行 warning D9025: 正在重写“/GR-”(用“/GR”) [E:\Users\FuYuHao\Desktop\sb\a\aaa\node_modules\node-sass\build\src\libsass.vcxproj] cl : 命令行 warning D9025: 正在重写“/GR-”(用“/GR”) [E:\Users\FuYuHao\Desktop\sb\a\aaa\node_modules\node-sass\build\src\libsass.vcxproj] cl : 命令行 warning D9025: 正在重写“/GR-”(用“/GR”) [E:\Users\FuYuHao\Desktop\sb\a\aaa\node_modules\node-sass\build\src\libsass.vcxproj] cl : 命令行 warning D9025: 正在重写“/GR-”(用“/GR”) [E:\Users\FuYuHao\Desktop\sb\a\aaa\node_modules\node-sass\build\src\libsass.vcxproj] cl : 命令行 warning D9025: 正在重写“/GR-”(用“/GR”) [E:\Users\FuYuHao\Desktop\sb\a\aaa\node_modules\node-sass\build\src\libsass.vcxproj] e:\users\fuyuhao\desktop\sb\a\aaa\node_modules\node-sass\src\libsass\src\json.cpp(26): warning C4005: “_CRT_NONSTDC_NO_DEPRECATE”: 宏重定义 [E:\Users\FuYuHao\Desktop\sb\a\aaa\node_modules\node-sass\build\src\libsass.vc xproj ] e:\users\fuyuhao\desktop\sb\a\aaa\node_modules\node-sass\src\libsass\src\sass2scss.cpp(9): warning C4005: “_CRT_NONSTDC_NO_DEPRECATE”: 宏重定义 [E:\Users\FuYuHao\Desktop\sb\a\aaa\node_modules\node-sass\build\src\libsas s.vcx proj] “E:\Users\FuYuHao\Desktop\sb\a\aaa\node_modules\node-sass\build\binding.sln”(默认目标) (1) -> “E:\Users\FuYuHao\Desktop\sb\a\aaa\node_modules\node-sass\build\binding.vcxproj.metaproj”(默认目标) (2) -> “E:\Users\FuYuHao\Desktop\sb\a\aaa\node_modules\node-sass\build\src\libsass.vcxproj”(默认目标) (3) -> cl : 命令行 warning D9025: 正在重写“/GR-”(用“/GR”) [E:\Users\FuYuHao\Desktop\sb\a\aaa\node_modules\node-sass\build\src\libsass.vcxproj] “E:\Users\FuYuHao\Desktop\sb\a\aaa\node_modules\node-sass\build\binding.sln”(默认目标) (1) -> “E:\Users\FuYuHao\Desktop\sb\a\aaa\node_modules\node-sass\build\binding.vcxproj.metaproj”(默认目标) (2) -> “E:\Users\FuYuHao\Desktop\sb\a\aaa\node_modules\node-sass\build\binding.vcxproj”(默认目标) (4) -> (Link 目标) -> C:\Users\FuYuHao\.node-gyp\10.14.1\x64\node.lib : fatal error LNK1107: 文件无效或损坏: 无法在 0x39F993 处读取 [E:\Users\FuYuHao\Desktop\sb\a\aaa\node_modules\node-sass\build\binding.vcxproj] 8 个警告 1 个错误 已用时间 00:00:24.13 gyp ERR! build error gyp ERR! stack Error: `C:\Program Files (x86)\Microsoft Visual Studio\2017\BuildTools\MSBuild\15.0\Bin\MSBuild.exe` failed with exit code: 1 gyp ERR! stack at ChildProcess.onExit (E:\Users\FuYuHao\Desktop\sb\a\aaa\node_modules\node-gyp\lib\build.js:262:23) gyp ERR! stack at ChildProcess.emit (events.js:182:13) gyp ERR! stack at Process.ChildProcess._handle.onexit (internal/child_process.js:240:12) gyp ERR! System Windows_NT 10.0.17763 gyp ERR! command "C:\\Program Files\\nodejs\\node.exe" "E:\\Users\\FuYuHao\\Desktop\\sb\\a\\aaa\\node_modules\\node-gyp\\bin\\node-gyp.js" "rebuild" "--verbose" "--libsass_ext=" "--libsass_cflags=" "--libsass_ldflags=" "--libsass_library=" gyp ERR! cwd E:\Users\FuYuHao\Desktop\sb\a\aaa\node_modules\node-sass gyp ERR! node -v v10.14.1 gyp ERR! node-gyp -v v3.8.0 gyp ERR! not ok Build failed with error code: 1 npm WARN optional SKIPPING OPTIONAL DEPENDENCY: fsevents@2.0.7 (node_modules\fsevents): npm WARN notsup SKIPPING OPTIONAL DEPENDENCY: Unsupported platform for fsevents@2.0.7: wanted {"os":"darwin","arch":"any"} (current: {"os":"win32","arch":"x64"}) npm WARN optional SKIPPING OPTIONAL DEPENDENCY: fsevents@1.2.9 (node_modules\watchpack\node_modules\fsevents): npm WARN notsup SKIPPING OPTIONAL DEPENDENCY: Unsupported platform for fsevents@1.2.9: wanted {"os":"darwin","arch":"any"} (current: {"os":"win32","arch":"x64"}) npm WARN optional SKIPPING OPTIONAL DEPENDENCY: fsevents@1.2.9 (node_modules\nodemon\node_modules\fsevents): npm WARN notsup SKIPPING OPTIONAL DEPENDENCY: Unsupported platform for fsevents@1.2.9: wanted {"os":"darwin","arch":"any"} (current: {"os":"win32","arch":"x64"}) npm ERR! code ELIFECYCLE npm ERR! errno 1 npm ERR! node-sass@4.12.0 postinstall: `node scripts/build.js` npm ERR! Exit status 1 npm ERR! npm ERR! Failed at the node-sass@4.12.0 postinstall script. npm ERR! This is probably not a problem with npm. There is likely additional logging output above. npm ERR! A complete log of this run can be found in: npm ERR! C:\Users\FuYuHao\AppData\Roaming\npm-cache\_logs\2019-05-29T14_01_39_903Z-debug.log PS E:\Users\FuYuHao\Desktop\sb\a\aaa> ```
大学四年自学走来,这些私藏的实用工具/学习网站我贡献出来了
大学四年,看课本是不可能一直看课本的了,对于学习,特别是自学,善于搜索网上的一些资源来辅助,还是非常有必要的,下面我就把这几年私藏的各种资源,网站贡献出来给你们。主要有:电子书搜索、实用工具、在线视频学习网站、非视频学习网站、软件下载、面试/求职必备网站。 注意:文中提到的所有资源,文末我都给你整理好了,你们只管拿去,如果觉得不错,转发、分享就是最大的支持了。 一、电子书搜索 对于大部分程序员...
在中国程序员是青春饭吗?
今年,我也32了 ,为了不给大家误导,咨询了猎头、圈内好友,以及年过35岁的几位老程序员……舍了老脸去揭人家伤疤……希望能给大家以帮助,记得帮我点赞哦。 目录: 你以为的人生 一次又一次的伤害 猎头界的真相 如何应对互联网行业的「中年危机」 一、你以为的人生 刚入行时,拿着傲人的工资,想着好好干,以为我们的人生是这样的: 等真到了那一天,你会发现,你的人生很可能是这样的: ...
《MySQL 性能优化》之理解 MySQL 体系结构
本文介绍 MySQL 的体系结构,包括物理结构、逻辑结构以及插件式存储引擎。
python自动下载图片
近日闲来无事,总有一种无形的力量萦绕在朕身边,让朕精神涣散,昏昏欲睡。 可是,像朕这么有职业操守的社畜怎么能在上班期间睡瞌睡呢,我不禁陷入了沉思。。。。 突然旁边的IOS同事问:‘嘿,兄弟,我发现一个网站的图片很有意思啊,能不能帮我保存下来提升我的开发灵感?’ 作为一个坚强的社畜怎么能说自己不行呢,当时朕就不假思索的答应:‘oh, It’s simple. Wait for me for a ...
一名大专同学的四个问题
【前言】   收到一封来信,赶上各种事情拖了几日,利用今天要放下工作的时机,做个回复。   2020年到了,就以这一封信,作为开年标志吧。 【正文】   您好,我是一名现在有很多困惑的大二学生。有一些问题想要向您请教。   先说一下我的基本情况,高考失利,不想复读,来到广州一所大专读计算机应用技术专业。学校是偏艺术类的,计算机专业没有实验室更不用说工作室了。而且学校的学风也不好。但我很想在计算机领...
复习一周,京东+百度一面,不小心都拿了Offer
京东和百度一面都问了啥,面试官百般刁难,可惜我全会。
达摩院十大科技趋势发布:2020 非同小可!
【CSDN编者按】1月2日,阿里巴巴发布《达摩院2020十大科技趋势》,十大科技趋势分别是:人工智能从感知智能向认知智能演进;计算存储一体化突破AI算力瓶颈;工业互联网的超融合;机器间大规模协作成为可能;模块化降低芯片设计门槛;规模化生产级区块链应用将走入大众;量子计算进入攻坚期;新材料推动半导体器件革新;保护数据隐私的AI技术将加速落地;云成为IT技术创新的中心 。 新的画卷,正在徐徐展开。...
轻松搭建基于 SpringBoot + Vue 的 Web 商城应用
首先介绍下在本文出现的几个比较重要的概念: 函数计算(Function Compute): 函数计算是一个事件驱动的服务,通过函数计算,用户无需管理服务器等运行情况,只需编写代码并上传。函数计算准备计算资源,并以弹性伸缩的方式运行用户代码,而用户只需根据实际代码运行所消耗的资源进行付费。Fun: Fun 是一个用于支持 Serverless 应用部署的工具,能帮助您便捷地管理函数计算、API ...
Python+OpenCV实时图像处理
目录 1、导入库文件 2、设计GUI 3、调用摄像头 4、实时图像处理 4.1、阈值二值化 4.2、边缘检测 4.3、轮廓检测 4.4、高斯滤波 4.5、色彩转换 4.6、调节对比度 5、退出系统 初学OpenCV图像处理的小伙伴肯定对什么高斯函数、滤波处理、阈值二值化等特性非常头疼,这里给各位分享一个小项目,可通过摄像头实时动态查看各类图像处理的特点,也可对各位调参、测试...
2020年一线城市程序员工资大调查
人才需求 一线城市共发布岗位38115个,招聘120827人。 其中 beijing 22805 guangzhou 25081 shanghai 39614 shenzhen 33327 工资分布 2020年中国一线城市程序员的平均工资为16285元,工资中位数为14583元,其中95%的人的工资位于5000到20000元之间。 和往年数据比较: yea...
为什么猝死的都是程序员,基本上不见产品经理猝死呢?
相信大家时不时听到程序员猝死的消息,但是基本上听不到产品经理猝死的消息,这是为什么呢? 我们先百度搜一下:程序员猝死,出现将近700多万条搜索结果: 搜索一下:产品经理猝死,只有400万条的搜索结果,从搜索结果数量上来看,程序员猝死的搜索结果就比产品经理猝死的搜索结果高了一倍,而且从下图可以看到,首页里面的五条搜索结果,其实只有两条才是符合条件。 所以程序员猝死的概率真的比产品经理大,并不是错...
害怕面试被问HashMap?这一篇就搞定了!
声明:本文以jdk1.8为主! 搞定HashMap 作为一个Java从业者,面试的时候肯定会被问到过HashMap,因为对于HashMap来说,可以说是Java集合中的精髓了,如果你觉得自己对它掌握的还不够好,我想今天这篇文章会非常适合你,至少,看了今天这篇文章,以后不怕面试被问HashMap了 其实在我学习HashMap的过程中,我个人觉得HashMap还是挺复杂的,如果真的想把它搞得明明白...
毕业5年,我问遍了身边的大佬,总结了他们的学习方法
我问了身边10个大佬,总结了他们的学习方法,原来成功都是有迹可循的。
python爬取百部电影数据,我分析出了一个残酷的真相
2019年就这么匆匆过去了,就在前几天国家电影局发布了2019年中国电影市场数据,数据显示去年总票房为642.66亿元,同比增长5.4%;国产电影总票房411.75亿元,同比增长8.65%,市场占比 64.07%;城市院线观影人次17.27亿,同比增长0.64%。 看上去似乎是一片大好对不对?不过作为一名严谨求实的数据分析师,我从官方数据中看出了一点端倪:国产票房增幅都已经高达8.65%了,为什...
推荐10个堪称神器的学习网站
每天都会收到很多读者的私信,问我:“二哥,有什么推荐的学习网站吗?最近很浮躁,手头的一些网站都看烦了,想看看二哥这里有什么新鲜货。” 今天一早做了个恶梦,梦到被老板辞退了。虽然说在我们公司,只有我辞退老板的份,没有老板辞退我这一说,但是还是被吓得 4 点多都起来了。(主要是因为我掌握着公司所有的核心源码,哈哈哈) 既然 4 点多起来,就得好好利用起来。于是我就挑选了 10 个堪称神器的学习网站,推...
这些软件太强了,Windows必装!尤其程序员!
Windows可谓是大多数人的生产力工具,集娱乐办公于一体,虽然在程序员这个群体中都说苹果是信仰,但是大部分不都是从Windows过来的,而且现在依然有很多的程序员用Windows。 所以,今天我就把我私藏的Windows必装的软件分享给大家,如果有一个你没有用过甚至没有听过,那你就赚了????,这可都是提升你幸福感的高效率生产力工具哦! 走起!???? NO、1 ScreenToGif 屏幕,摄像头和白板...
阿里面试,面试官没想到一个ArrayList,我都能跟他扯半小时
我是真的没想到,面试官会这样问我ArrayList。
曾经优秀的人,怎么就突然不优秀了。
职场上有很多辛酸事,很多合伙人出局的故事,很多技术骨干被裁员的故事。说来模板都类似,曾经是名校毕业,曾经是优秀员工,曾经被领导表扬,曾经业绩突出,然而突然有一天,因为种种原因,被裁员了,...
大学四年因为知道了这32个网站,我成了别人眼中的大神!
依稀记得,毕业那天,我们导员发给我毕业证的时候对我说“你可是咱们系的风云人物啊”,哎呀,别提当时多开心啦????,嗯,我们导员是所有导员中最帅的一个,真的???? 不过,导员说的是实话,很多人都叫我大神的,为啥,因为我知道这32个网站啊,你说强不强????,这次是绝对的干货,看好啦,走起来! PS:每个网站都是学计算机混互联网必须知道的,真的牛杯,我就不过多介绍了,大家自行探索,觉得没用的,尽管留言吐槽吧???? 社...
良心推荐,我珍藏的一些Chrome插件
上次搬家的时候,发了一个朋友圈,附带的照片中不小心暴露了自己的 Chrome 浏览器插件之多,于是就有小伙伴评论说分享一下我觉得还不错的浏览器插件。 我下面就把我日常工作和学习中经常用到的一些 Chrome 浏览器插件分享给大家,随便一个都能提高你的“生活品质”和工作效率。 Markdown Here Markdown Here 可以让你更愉快的写邮件,由于支持 Markdown 直接转电子邮...
看完这篇HTTP,跟面试官扯皮就没问题了
我是一名程序员,我的主要编程语言是 Java,我更是一名 Web 开发人员,所以我必须要了解 HTTP,所以本篇文章就来带你从 HTTP 入门到进阶,看完让你有一种恍然大悟、醍醐灌顶的感觉。 最初在有网络之前,我们的电脑都是单机的,单机系统是孤立的,我还记得 05 年前那会儿家里有个电脑,想打电脑游戏还得两个人在一个电脑上玩儿,及其不方便。我就想为什么家里人不让上网,我的同学 xxx 家里有网,每...
史上最全的IDEA快捷键总结
现在Idea成了主流开发工具,这篇博客对其使用的快捷键做了总结,希望对大家的开发工作有所帮助。
C++(数据结构与算法):62---搜索树(二叉搜索树、索引二叉搜索树)
一、搜索树的复杂度分析 本文考察二叉搜索树和索引二叉搜索树 二叉搜索树的渐进性能可以和跳表媲美: 查找、插入、删除操作所需的平均时间为Θ(logn) 查找、插入、删除操作的最坏情况的时间为Θ(n) 元素按升序输出时所需时间为Θ(n) 虽然在最坏情况下的查找、插入、删除操作,散列表和二叉搜索树的时间性能相同,但是散列表在最好的情况下具有超级性能Θ(1) 不过,对于一个指定的关键...
阿里程序员写了一个新手都写不出的低级bug,被骂惨了。
这种新手都不会范的错,居然被一个工作好几年的小伙子写出来,差点被当场开除了。
谁是华为扫地僧?
是的,华为也有扫地僧!2020年2月11-12日,“养在深闺人不知”的华为2012实验室扫地僧们,将在华为开发者大会2020(Cloud)上,和大家见面。到时,你可以和扫地僧们,吃一个洋...
AI 没让人类失业,搞 AI 的人先失业了
最近和几个 AI 领域的大佬闲聊 根据他们讲的消息和段子 改编出下面这个故事 如有雷同 都是巧合 1. 老王创业失败,被限制高消费 “这里写我跑路的消息实在太夸张了。” 王葱葱哼笑一下,把消息分享给群里。 阿杰也看了消息,笑了笑。在座几位也都笑了。 王葱葱是个有名的人物,21岁那年以全额奖学金进入 KMU 攻读人工智能博士,累计发表论文 40 余篇,个人技术博客更是成为深度学习领域内风向标。 ...
2020年,冯唐49岁:我给20、30岁IT职场年轻人的建议
点击“技术领导力”关注∆每天早上8:30推送 作者|Mr.K 编辑| Emma 来源|技术领导力(ID:jishulingdaoli) 前天的推文《冯唐:职场人35岁以后,方法论比经验重要》,收到了不少读者的反馈,觉得挺受启发。其实,冯唐写了不少关于职场方面的文章,都挺不错的。可惜大家只记住了“春风十里不如你”、“如何避免成为油腻腻的中年人”等不那么正经的文章。 本文整理了冯...
最全最强!世界大学计算机专业排名总结!
我正在参与CSDN200进20,希望得到您的支持,扫码续投票5次。感谢您! (为表示感谢,您投票后私信我,我把我总结的人工智能手推笔记和思维导图发送给您,感谢!) 目录 泰晤士高等教育世界大学排名 QS 世界大学排名 US News 世界大学排名 世界大学学术排名(Academic Ranking of World Universities) 泰晤士高等教育世界大学排名 中国共...
作为一名大学生,如何在B站上快乐的学习?
B站是个宝,谁用谁知道???? 作为一名大学生,你必须掌握的一项能力就是自学能力,很多看起来很牛X的人,你可以了解下,人家私底下一定是花大量的时间自学的,你可能会说,我也想学习啊,可是嘞,该学习啥嘞,不怕告诉你,互联网时代,最不缺的就是学习资源,最宝贵的是啥? 你可能会说是时间,不,不是时间,而是你的注意力,懂了吧! 那么,你说学习资源多,我咋不知道,那今天我就告诉你一个你必须知道的学习的地方,人称...
那些年,我们信了课本里的那些鬼话
教材永远都是有错误的,从小学到大学,我们不断的学习了很多错误知识。 斑羚飞渡 在我们学习的很多小学课文里,有很多是错误文章,或者说是假课文。像《斑羚飞渡》: 随着镰刀头羊的那声吼叫,整个斑羚群迅速分成两拨,老年斑羚为一拨,年轻斑羚为一拨。 就在这时,我看见,从那拨老斑羚里走出一只公斑羚来。公斑羚朝那拨年轻斑羚示意性地咩了一声,一只半大的斑羚应声走了出来。一老一少走到伤心崖,后退了几步,突...
一个程序在计算机中是如何运行的?超级干货!!!
强烈声明:本文很干,请自备茶水!???? 开门见山,咱不说废话! 你有没有想过,你写的程序,是如何在计算机中运行的吗?比如我们搞Java的,肯定写过这段代码 public class HelloWorld { public static void main(String[] args) { System.out.println("Hello World!"); } ...
那个在阿里养猪的工程师,5年了……
简介: 在阿里,走过1825天,没有趴下,依旧斗志满满,被称为“五年陈”。他们会被授予一枚戒指,过程就叫做“授戒仪式”。今天,咱们听听阿里的那些“五年陈”们的故事。 下一个五年,猪圈见! 我就是那个在养猪场里敲代码的工程师,一年多前我和20位工程师去了四川的猪场,出发前总架构师慷慨激昂的说:同学们,中国的养猪产业将因为我们而改变。但到了猪场,发现根本不是那么回事:要个WIFI,没有;...
为什么程序猿都不愿意去外包?
分享外包的组织架构,盈利模式,亲身经历,以及根据一些外包朋友的反馈,写了这篇文章 ,希望对正在找工作的老铁有所帮助
leetcode88. 合并两个有序数组
给定两个有序整数数组nums1 和 nums2,将 nums2 合并到nums1中,使得num1 成为一个有序数组。 说明: 初始化nums1 和 nums2 的元素数量分别为m 和 n。 你可以假设nums1有足够的空间(空间大小大于或等于m + n)来保存 nums2 中的元素。 示例: 输入: nums1 = [1,2,3,0,0,0], m = 3 nums2 = ...
立即提问