IDEA maven build 问题

我使用的是idea。现在有一个web项目,所有组件的父pom是root组件的pom。
但是,打包所用的是total组件的pom。现在使用idea make artifact发现在war组件的
target下的war包 和文件都不正确。
大家有没有遇到过这个问题?如果有的话,还请告诉一下解决办法。。。。没有C币了。。。

1个回答

补充一下:
total的pom文件大致如下:

../root
../root-webbox
../langpack
../bulletin-api
../bulletin
../bulletin-mail
../theme-webbox
../utils
../utils-webbox
../system
../system-api
../system-webbox
../bulletin-webbox

Csdn user default icon
上传中...
上传图片
插入图片
抄袭、复制答案,以达到刷声望分或其他目的的行为,在CSDN问答是严格禁止的,一经发现立刻封号。是时候展现真正的技术了!
其他相关推荐
IDEA 的maven出错 Unable to import maven project
maven也自己下了,配置也都照着网上配了,环境变量什么的都弄了,IDEA的maven也照着网上配了 这是错误日志 java.lang.RuntimeException: Cannot reconnect. at org.jetbrains.idea.maven.server.RemoteObjectWrapper.perform(RemoteObjectWrapper.java:82) at org.jetbrains.idea.maven.server.MavenServerManager.applyProfiles(MavenServerManager.java:550) at org.jetbrains.idea.maven.project.MavenProjectReader.applyProfiles(MavenProjectReader.java:397) at org.jetbrains.idea.maven.project.MavenProjectReader.doReadProjectModel(MavenProjectReader.java:103) at org.jetbrains.idea.maven.project.MavenProjectReader.readProject(MavenProjectReader.java:62) at org.jetbrains.idea.maven.project.MavenProject.read(MavenProject.java:639) at org.jetbrains.idea.maven.project.MavenProjectsTree.doUpdate(MavenProjectsTree.java:554) at org.jetbrains.idea.maven.project.MavenProjectsTree.doAdd(MavenProjectsTree.java:499) at org.jetbrains.idea.maven.project.MavenProjectsTree.update(MavenProjectsTree.java:460) at org.jetbrains.idea.maven.project.MavenProjectsTree.updateAll(MavenProjectsTree.java:431) at org.jetbrains.idea.maven.project.MavenProjectsProcessorReadingTask.perform(MavenProjectsProcessorReadingTask.java:60) at org.jetbrains.idea.maven.project.MavenProjectsProcessor.doProcessPendingTasks(MavenProjectsProcessor.java:132) at org.jetbrains.idea.maven.project.MavenProjectsProcessor.access$000(MavenProjectsProcessor.java:32) at org.jetbrains.idea.maven.project.MavenProjectsProcessor$2.run(MavenProjectsProcessor.java:107) at org.jetbrains.idea.maven.utils.MavenUtil.lambda$runInBackground$5(MavenUtil.java:460) at com.intellij.openapi.application.impl.ApplicationImpl$1.run(ApplicationImpl.java:330) at java.util.concurrent.Executors$RunnableAdapter.call(Executors.java:511) at java.util.concurrent.FutureTask.run(FutureTask.java:266) at java.util.concurrent.ThreadPoolExecutor.runWorker(ThreadPoolExecutor.java:1142) at java.util.concurrent.ThreadPoolExecutor$Worker.run(ThreadPoolExecutor.java:617) at java.lang.Thread.run(Thread.java:745) Caused by: java.rmi.RemoteException: Cannot start maven service; nested exception is: com.intellij.execution.ExecutionException: at org.jetbrains.idea.maven.server.MavenServerManager.create(MavenServerManager.java:175) at org.jetbrains.idea.maven.server.MavenServerManager.create(MavenServerManager.java:80) at org.jetbrains.idea.maven.server.RemoteObjectWrapper.getOrCreateWrappee(RemoteObjectWrapper.java:41) at org.jetbrains.idea.maven.server.MavenServerManager$7.execute(MavenServerManager.java:553) at org.jetbrains.idea.maven.server.MavenServerManager$7.execute(MavenServerManager.java:550) at org.jetbrains.idea.maven.server.RemoteObjectWrapper.perform(RemoteObjectWrapper.java:76) ... 20 more Caused by: com.intellij.execution.ExecutionException: at com.intellij.execution.rmi.RemoteProcessSupport.acquire(RemoteProcessSupport.java:166) at org.jetbrains.idea.maven.server.MavenServerManager.create(MavenServerManager.java:172) ... 25 more 2017-10-27 13:52:43,319 [ 628599] ERROR - #org.jetbrains.idea.maven - IntelliJ IDEA 2017.2.5 Build #IU-172.4343.14 2017-10-27 13:52:43,319 [ 628599] ERROR - #org.jetbrains.idea.maven - JDK: 1.8.0_152-release 2017-10-27 13:52:43,319 [ 628599] ERROR - #org.jetbrains.idea.maven - VM: OpenJDK 64-Bit Server VM 2017-10-27 13:52:43,319 [ 628599] ERROR - #org.jetbrains.idea.maven - Vendor: JetBrains s.r.o 2017-10-27 13:52:43,319 [ 628599] ERROR - #org.jetbrains.idea.maven - OS: Windows 10 2017-10-27 13:52:43,319 [ 628599] ERROR - #org.jetbrains.idea.maven - Last Action: ShowSettings
idea maven install时报错
``` [INFO] Scanning for projects... [WARNING] [WARNING] Some problems were encountered while building the effective model for com.zcwl:fireAlarm:war:0.0.1-SNAPSHOT [WARNING] 'build.plugins.plugin.version' for org.apache.felix:maven-bundle-plugin is missing. @ line 272, column 12 [WARNING] [WARNING] It is highly recommended to fix these problems because they threaten the stability of your build. [WARNING] [WARNING] For this reason, future Maven versions might no longer support building such malformed projects. [WARNING] [INFO] [INFO] ------------------------------------------------------------------------ [INFO] Building fireAlarm 0.0.1-SNAPSHOT [INFO] ------------------------------------------------------------------------ [WARNING] The POM for com.danga:java-memcached:jar:2.6.3 is missing, no dependency information available [INFO] ------------------------------------------------------------------------ [INFO] BUILD FAILURE [INFO] ------------------------------------------------------------------------ [INFO] Total time: 0.947 s [INFO] Finished at: 2019-08-30T17:04:58+08:00 [INFO] Final Memory: 15M/225M [INFO] ------------------------------------------------------------------------ [ERROR] Failed to execute goal on project fireAlarm: Could not resolve dependencies for project com.zcwl:fireAlarm:war:0.0.1-SNAPSHOT: Failure to find com.danga:java-memcached:jar:2.6.3 in https://repo1.maven.org/maven2/ was cached in the local repository, resolution will not be reattempted until the update interval of repo2 has elapsed or updates are forced -> [Help 1] [ERROR] [ERROR] To see the full stack trace of the errors, re-run Maven with the -e switch. [ERROR] Re-run Maven using the -X switch to enable full debug logging. [ERROR] [ERROR] For more information about the errors and possible solutions, please read the following articles: [ERROR] [Help 1] http://cwiki.apache.org/confluence/display/MAVEN/DependencyResolutionException Process finished with exit code 1 ------------------------------------------------------------------------------ ``` 自己在电脑里搭建了nexus私服 jar包也上传到私服了 但是每次install 都好像忽略了自己搭建的私服!![图片说明](https://img-ask.csdn.net/upload/201909/05/1567671571_17204.jpg) ![图片说明](https://img-ask.csdn.net/upload/201909/05/1567671860_217688.jpg)![图片说明](https://img-ask.csdn.net/upload/201909/05/1567671865_712315.jpg)
IDEA创建Maven项目Build报错,Plugins处爆红.Run处也出错.
![图片说明](https://img-ask.csdn.net/upload/201911/03/1572762368_418000.png)![图片说明](https://img-ask.csdn.net/upload/201911/03/1572762376_502146.png)![图片说明](https://img-ask.csdn.net/upload/201911/03/1572762383_129513.png) ![图片说明](https://img-ask.csdn.net/upload/201911/03/1572762562_476934.png)![图片说明](https://img-ask.csdn.net/upload/201911/03/1572762567_105839.png) 在网上找的解决方案也没有用,本地maven的配置文件和仓库地址也一致。 难道是我用手机热点的问题?手机是联通的. 有没有大佬帮忙看下..实在不知道是哪里出了问题.
idea创建Maven项目没有src目录 Run有错误
![图片说明](https://img-ask.csdn.net/upload/201911/02/1572702296_122439.png) ``` "C:\Program Files\Java\jdk1.8.0_202\bin\java.exe" -Dmaven.multiModuleProjectDirectory=C:\Users\dx\AppData\Local\Temp\archetype1tmp -Xms128m -Xmx512m -Duser.language=zh -Dfile.encoding=UTF-8 -Dmaven.home=E:\server\apache-maven-3.6.1 -Dclassworlds.conf=E:\server\apache-maven-3.6.1\bin\m2.conf "-Dmaven.ext.class.path=E:\IntelliJ IDEA 2019.2\plugins\maven\lib\maven-event-listener.jar" -classpath E:\server\apache-maven-3.6.1\boot\plexus-classworlds-2.6.0.jar org.codehaus.classworlds.Launcher -Didea.version2019.2 --offline -s E:\server\apache-maven-3.6.1\conf\settings.xml -Dmaven.repo.local=E:\server\Repository -DinteractiveMode=false -DgroupId=com -DartifactId=demo33333333 -Dversion=1.0-SNAPSHOT -DarchetypeGroupId=org.apache.maven.archetypes -DarchetypeArtifactId=maven-archetype-webapp -DarchetypeVersion=RELEASE org.apache.maven.plugins:maven-archetype-plugin:RELEASE:generate [INFO] Scanning for projects... [INFO] ------------------------------------------------------------------------ [INFO] BUILD FAILURE [INFO] ------------------------------------------------------------------------ [INFO] Total time: 0.140 s [INFO] Finished at: 2019-11-02T21:41:10+08:00 [INFO] ------------------------------------------------------------------------ [ERROR] Plugin org.apache.maven.plugins:maven-archetype-plugin:RELEASE or one of its dependencies could not be resolved: Failed to read artifact descriptor for org.apache.maven.plugins:maven-archetype-plugin:jar:RELEASE: Failed to resolve version for org.apache.maven.plugins:maven-archetype-plugin:jar:RELEASE: Could not find metadata org.apache.maven.plugins:maven-archetype-plugin/maven-metadata.xml in local (E:\server\Repository) -> [Help 1] [ERROR] [ERROR] To see the full stack trace of the errors, re-run Maven with the -e switch. [ERROR] Re-run Maven using the -X switch to enable full debug logging. [ERROR] [ERROR] For more information about the errors and possible solutions, please read the following articles: [ERROR] [Help 1] http://cwiki.apache.org/confluence/display/MAVEN/PluginResolutionException 网上的解决方法我都试过了还是报错,有大佬帮忙看下吗? ```
关于ideal2019版本配置maven问题
![图片说明](https://img-ask.csdn.net/upload/201909/13/1568352987_566484.png) 今天配置idea时候,我是用的是idea2019版本以及maven3.6的版本,以前用的是老版本没有问题,但是我觉得这不是版本的问题存在,我在cmd里面输入命令mvn -v是没有任何问题的系统可以看见![图片说明](https://img-ask.csdn.net/upload/201909/13/1568353130_795335.png) 但是一创建maven项目以后就报这个错误,我真的很无助,昨晚已经搞了好久,今天又重新安装了一遍maven还是不行,能给各位大佬提供解决思路的唯有我的错误日志,![图片说明](https://img-ask.csdn.net/upload/201909/13/1568353190_197996.png) 而且我确定一定以及肯定是,我的maven的本地仓库配置以及ideal里面maven版本的地址没有一点的问题。 1) No implementation for org.apache.maven.model.path.PathTranslator was bound. while locating org.apache.maven.model.path.PathTranslator for field at org.apache.maven.model.interpolation.AbstractStringBasedModelInterpolator.pathTranslator(Unknown Source) at org.codehaus.plexus.DefaultPlexusContainer$1.configure(DefaultPlexusContainer.java:350) 2) No implementation for org.apache.maven.model.path.UrlNormalizer was bound. while locating org.apache.maven.model.path.UrlNormalizer for field at org.apache.maven.model.interpolation.AbstractStringBasedModelInterpolator.urlNormalizer(Unknown Source) at org.codehaus.plexus.DefaultPlexusContainer$1.configure(DefaultPlexusContainer.java:350) 2 errors java.lang.RuntimeException: com.google.inject.CreationException: Unable to create injector, see the following errors: 1) No implementation for org.apache.maven.model.path.PathTranslator was bound. while locating org.apache.maven.model.path.PathTranslator for field at org.apache.maven.model.interpolation.AbstractStringBasedModelInterpolator.pathTranslator(Unknown Source) at org.codehaus.plexus.DefaultPlexusContainer$1.configure(DefaultPlexusContainer.java:350) 2) No implementation for org.apache.maven.model.path.UrlNormalizer was bound. while locating org.apache.maven.model.path.UrlNormalizer for field at org.apache.maven.model.interpolation.AbstractStringBasedModelInterpolator.urlNormalizer(Unknown Source) at org.codehaus.plexus.DefaultPlexusContainer$1.configure(DefaultPlexusContainer.java:350) 2 errors at com.google.inject.internal.Errors.throwCreationExceptionIfErrorsExist(Errors.java:543) at com.google.inject.internal.InternalInjectorCreator.initializeStatically(InternalInjectorCreator.java:159) at com.google.inject.internal.InternalInjectorCreator.build(InternalInjectorCreator.java:106) at com.google.inject.Guice.createInjector(Guice.java:87) at com.google.inject.Guice.createInjector(Guice.java:69) at com.google.inject.Guice.createInjector(Guice.java:59) at org.codehaus.plexus.DefaultPlexusContainer.addComponent(DefaultPlexusContainer.java:344) at org.codehaus.plexus.DefaultPlexusContainer.addComponent(DefaultPlexusContainer.java:332) at org.jetbrains.idea.maven.server.Maven3XServerEmbedder.customizeComponents(Maven3XServerEmbedder.java:573) at org.jetbrains.idea.maven.server.Maven3XServerEmbedder.customize(Maven3XServerEmbedder.java:542) at java.base/jdk.internal.reflect.NativeMethodAccessorImpl.invoke0(Native Method) at java.base/jdk.internal.reflect.NativeMethodAccessorImpl.invoke(NativeMethodAccessorImpl.java:62) at java.base/jdk.internal.reflect.DelegatingMethodAccessorImpl.invoke(DelegatingMethodAccessorImpl.java:43) at java.base/java.lang.reflect.Method.invoke(Method.java:566) at java.rmi/sun.rmi.server.UnicastServerRef.dispatch(UnicastServerRef.java:359) at java.rmi/sun.rmi.transport.Transport$1.run(Transport.java:200) at java.rmi/sun.rmi.transport.Transport$1.run(Transport.java:197) at java.base/java.security.AccessController.doPrivileged(Native Method) at java.rmi/sun.rmi.transport.Transport.serviceCall(Transport.java:196) at java.rmi/sun.rmi.transport.tcp.TCPTransport.handleMessages(TCPTransport.java:562) at java.rmi/sun.rmi.transport.tcp.TCPTransport$ConnectionHandler.run0(TCPTransport.java:796) at java.rmi/sun.rmi.transport.tcp.TCPTransport$ConnectionHandler.lambda$run$0(TCPTransport.java:677) at java.base/java.security.AccessController.doPrivileged(Native Method) at java.rmi/sun.rmi.transport.tcp.TCPTransport$ConnectionHandler.run(TCPTransport.java:676) at java.base/java.util.concurrent.ThreadPoolExecutor.runWorker(ThreadPoolExecutor.java:1128) at java.base/java.util.concurrent.ThreadPoolExecutor$Worker.run(ThreadPoolExecutor.java:628) at java.base/java.lang.Thread.run(Thread.java:834) at java.rmi/sun.rmi.transport.StreamRemoteCall.exceptionReceivedFromServer(StreamRemoteCall.java:283) at java.rmi/sun.rmi.transport.StreamRemoteCall.executeCall(StreamRemoteCall.java:260) at java.rmi/sun.rmi.server.UnicastRef.invoke(UnicastRef.java:161) at java.rmi/java.rmi.server.RemoteObjectInvocationHandler.invokeRemoteMethod(RemoteObjectInvocationHandler.java:209) at java.rmi/java.rmi.server.RemoteObjectInvocationHandler.invoke(RemoteObjectInvocationHandler.java:161) at com.sun.proxy.$Proxy135.customize(Unknown Source) at java.base/jdk.internal.reflect.NativeMethodAccessorImpl.invoke0(Native Method) at java.base/jdk.internal.reflect.NativeMethodAccessorImpl.invoke(NativeMethodAccessorImpl.java:62) at java.base/jdk.internal.reflect.DelegatingMethodAccessorImpl.invoke(DelegatingMethodAccessorImpl.java:43) at java.base/java.lang.reflect.Method.invoke(Method.java:566) at com.intellij.execution.rmi.RemoteUtil.invokeRemote(RemoteUtil.java:175) at com.intellij.execution.rmi.RemoteUtil.access$200(RemoteUtil.java:38) at com.intellij.execution.rmi.RemoteUtil$1$1$1.compute(RemoteUtil.java:156) at com.intellij.openapi.util.ClassLoaderUtil.computeWithClassLoader(ClassLoaderUtil.java:45) at com.intellij.execution.rmi.RemoteUtil.executeWithClassLoader(RemoteUtil.java:227) at com.intellij.execution.rmi.RemoteUtil$1$1.invoke(RemoteUtil.java:153) at com.sun.proxy.$Proxy135.customize(Unknown Source) at org.jetbrains.idea.maven.server.MavenEmbedderWrapper.doCustomize(MavenEmbedderWrapper.java:92) at org.jetbrains.idea.maven.server.MavenEmbedderWrapper.lambda$customizeForResolve$1(MavenEmbedderWrapper.java:65) at org.jetbrains.idea.maven.server.RemoteObjectWrapper.perform(RemoteObjectWrapper.java:76) at org.jetbrains.idea.maven.server.MavenEmbedderWrapper.customizeForResolve(MavenEmbedderWrapper.java:64) at org.jetbrains.idea.maven.project.MavenProjectsTree.resolve(MavenProjectsTree.java:1261) at org.jetbrains.idea.maven.project.MavenProjectsProcessorResolvingTask.perform(MavenProjectsProcessorResolvingTask.java:45) at org.jetbrains.idea.maven.project.MavenProjectsProcessor.doProcessPendingTasks(MavenProjectsProcessor.java:140) at org.jetbrains.idea.maven.project.MavenProjectsProcessor.access$000(MavenProjectsProcessor.java:33) at org.jetbrains.idea.maven.project.MavenProjectsProcessor$2.run(MavenProjectsProcessor.java:114) at org.jetbrains.idea.maven.utils.MavenUtil.lambda$runInBackground$5(MavenUtil.java:468) at com.intellij.openapi.application.impl.ApplicationImpl$1.run(ApplicationImpl.java:294) at java.base/java.util.concurrent.Executors$RunnableAdapter.call(Executors.java:515) at java.base/java.util.concurrent.FutureTask.run(FutureTask.java:264) at java.base/java.util.concurrent.ThreadPoolExecutor.runWorker(ThreadPoolExecutor.java:1128) at java.base/java.util.concurrent.ThreadPoolExecutor$Worker.run(ThreadPoolExecutor.java:628) at java.base/java.lang.Thread.run(Thread.java:834) 这么说吧,如若帮我解决了这个问题,微信加我 我给你发个红包算是我的心意了,求求大佬们,好无助,解决了好久没
maven项目创建失败,有IDEA错误日志但还是找不到问题根源
``` 2019-10-08 10:51:50,509 [1021249] INFO - ide.actions.ShowFilePathAction - Exit code 1 2019-10-08 10:51:51,396 [1022136] INFO - mponents.impl.stores.StoreUtil - saveProjectsAndApp took 254 ms 2019-10-08 10:53:28,265 [1119005] INFO - mponents.impl.stores.StoreUtil - saveProjectsAndApp took 142 ms 2019-10-08 10:53:47,104 [1137844] WARN - .impl.LineStatusTrackerManager - Tracker for is being held on dispose by com.intellij.openapi.editor.impl.EditorImpl@5d5743a 2019-10-08 10:53:47,104 [1137844] WARN - .impl.LineStatusTrackerManager - Tracker for is being held on dispose by com.intellij.openapi.editor.impl.EditorImpl@40247cea 2019-10-08 10:53:47,712 [1138452] INFO - mponents.impl.stores.StoreUtil - saveProjectsAndApp took 103 ms 2019-10-08 10:53:49,229 [1139969] INFO - pl.projectlevelman.NewMappings - VCS Root: [svn] - [<Project>] 2019-10-08 10:53:49,396 [1140136] INFO - PerformancePlugin - Performance Plugin is in silent mode 2019-10-08 10:53:49,401 [1140141] INFO - odeStyleSettingsInferComponent - settings inference skipped: already done 2019-10-08 10:53:49,402 [1140142] INFO - .ScalaCompilerReferenceService - Initialized ScalaCompilerReferenceService in clinic_hospital, current compiler mode = JPS 2019-10-08 10:53:49,449 [1140189] INFO - ution.rmi.RemoteProcessSupport - Terminating: 63844/Maven36ServerImpl9b210999 2019-10-08 10:53:49,665 [1140405] INFO - ge.ExternalProjectsDataStorage - Load external projects data in 1 millis (read time: 0) 2019-10-08 10:53:49,691 [1140431] INFO - j.ide.ui.OptionsTopHitProvider - 42 ms spent to cache options in project 2019-10-08 10:53:49,725 [1140465] INFO - .diagnostic.PerformanceWatcher - Post-startup activities under progress took 167ms; general responsiveness: ok; EDT responsiveness: ok 2019-10-08 10:53:49,732 [1140472] INFO - .diagnostic.PerformanceWatcher - Pushing properties took 140ms; general responsiveness: ok; EDT responsiveness: ok 2019-10-08 10:53:49,768 [1140508] INFO - tartup.impl.StartupManagerImpl - D:/clinic_hospital/.idea case-sensitivity: expected=false actual=false 2019-10-08 10:53:49,877 [1140617] INFO - tor.impl.FileEditorManagerImpl - Project opening took 680 ms 2019-10-08 10:53:49,914 [1140654] INFO - .diagnostic.PerformanceWatcher - Indexable file iteration took 182ms; general responsiveness: ok; EDT responsiveness: ok 2019-10-08 10:53:49,934 [1140674] INFO - cloudConfig.CloudConfigManager - === StatusBar ignored === 2019-10-08 10:53:50,028 [1140768] INFO - Json.PackageJsonUpdateNotifier - processPackageJsonFiles [] 2019-10-08 10:53:50,289 [1141029] INFO - j.compiler.server.BuildManager - BUILDER_PROCESS [stdout]: Build process started. Classpath: C:/Program Files/JetBrains/IntelliJ IDEA 2019.2.2/plugins/java/lib/jps-launcher.jar;C:/Program Files/Java/jdk1.8.0_221/lib/tools.jar 2019-10-08 10:53:50,372 [1141112] INFO - pl.projectlevelman.NewMappings - Mapped Roots: 1 2019-10-08 10:53:50,411 [1141151] INFO - j.compiler.server.BuildManager - BUILDER_PROCESS [stderr]: SLF4J: Failed to load class "org.slf4j.impl.StaticLoggerBinder". 2019-10-08 10:53:50,411 [1141151] INFO - j.compiler.server.BuildManager - BUILDER_PROCESS [stderr]: SLF4J: Defaulting to no-operation (NOP) logger implementation 2019-10-08 10:53:50,411 [1141151] INFO - j.compiler.server.BuildManager - BUILDER_PROCESS [stderr]: SLF4J: See http://www.slf4j.org/codes.html#StaticLoggerBinder for further details. 2019-10-08 10:53:51,086 [1141826] INFO - .ScalaCompilerReferenceService - [compiler indices] onCompilationStart. active indexing phases: 1 2019-10-08 10:53:52,381 [1143121] INFO - .ScalaCompilerReferenceService - [compiler indices] onCompilationFinish. success: true, active indexing phases: 0 2019-10-08 10:53:52,867 [1143607] INFO - j.compiler.server.BuildManager - BUILDER_PROCESS [stdout]: Build process started. Classpath: C:/Program Files/JetBrains/IntelliJ IDEA 2019.2.2/plugins/java/lib/jps-launcher.jar;C:/Program Files/Java/jdk1.8.0_221/lib/tools.jar 2019-10-08 10:53:52,924 [1143664] INFO - j.compiler.server.BuildManager - BUILDER_PROCESS [stderr]: SLF4J: Failed to load class "org.slf4j.impl.StaticLoggerBinder". 2019-10-08 10:53:52,924 [1143664] INFO - j.compiler.server.BuildManager - BUILDER_PROCESS [stderr]: SLF4J: Defaulting to no-operation (NOP) logger implementation 2019-10-08 10:53:52,924 [1143664] INFO - j.compiler.server.BuildManager - BUILDER_PROCESS [stderr]: SLF4J: See http://www.slf4j.org/codes.html#StaticLoggerBinder for further details. 2019-10-08 10:53:54,965 [1145705] INFO - ings.impl.UpdateCheckerService - channel: release 2019-10-08 10:54:23,804 [1174544] ERROR - #org.jetbrains.idea.maven - com.google.inject.CreationException: Unable to create injector, see the following errors: 1) No implementation for org.apache.maven.model.path.PathTranslator was bound. while locating org.apache.maven.model.path.PathTranslator for field at org.apache.maven.model.interpolation.AbstractStringBasedModelInterpolator.pathTranslator(Unknown Source) at org.codehaus.plexus.DefaultPlexusContainer$1.configure(DefaultPlexusContainer.java:350) 2) No implementation for org.apache.maven.model.path.UrlNormalizer was bound. while locating org.apache.maven.model.path.UrlNormalizer for field at org.apache.maven.model.interpolation.AbstractStringBasedModelInterpolator.urlNormalizer(Unknown Source) at org.codehaus.plexus.DefaultPlexusContainer$1.configure(DefaultPlexusContainer.java:350) 2 errors java.lang.RuntimeException: com.google.inject.CreationException: Unable to create injector, see the following errors: 1) No implementation for org.apache.maven.model.path.PathTranslator was bound. while locating org.apache.maven.model.path.PathTranslator for field at org.apache.maven.model.interpolation.AbstractStringBasedModelInterpolator.pathTranslator(Unknown Source) at org.codehaus.plexus.DefaultPlexusContainer$1.configure(DefaultPlexusContainer.java:350) 2) No implementation for org.apache.maven.model.path.UrlNormalizer was bound. while locating org.apache.maven.model.path.UrlNormalizer for field at org.apache.maven.model.interpolation.AbstractStringBasedModelInterpolator.urlNormalizer(Unknown Source) at org.codehaus.plexus.DefaultPlexusContainer$1.configure(DefaultPlexusContainer.java:350) 2 errors at com.google.inject.internal.Errors.throwCreationExceptionIfErrorsExist(Errors.java:543) at com.google.inject.internal.InternalInjectorCreator.initializeStatically(InternalInjectorCreator.java:159) at com.google.inject.internal.InternalInjectorCreator.build(InternalInjectorCreator.java:106) at com.google.inject.Guice.createInjector(Guice.java:87) at com.google.inject.Guice.createInjector(Guice.java:69) at com.google.inject.Guice.createInjector(Guice.java:59) at org.codehaus.plexus.DefaultPlexusContainer.addComponent(DefaultPlexusContainer.java:344) at org.codehaus.plexus.DefaultPlexusContainer.addComponent(DefaultPlexusContainer.java:332) at org.jetbrains.idea.maven.server.Maven3XServerEmbedder.customizeComponents(Maven3XServerEmbedder.java:573) at org.jetbrains.idea.maven.server.Maven3XServerEmbedder.customize(Maven3XServerEmbedder.java:542) at java.base/jdk.internal.reflect.NativeMethodAccessorImpl.invoke0(Native Method) at java.base/jdk.internal.reflect.NativeMethodAccessorImpl.invoke(NativeMethodAccessorImpl.java:62) at java.base/jdk.internal.reflect.DelegatingMethodAccessorImpl.invoke(DelegatingMethodAccessorImpl.java:43) at java.base/java.lang.reflect.Method.invoke(Method.java:566) at java.rmi/sun.rmi.server.UnicastServerRef.dispatch(UnicastServerRef.java:359) at java.rmi/sun.rmi.transport.Transport$1.run(Transport.java:200) at java.rmi/sun.rmi.transport.Transport$1.run(Transport.java:197) at java.base/java.security.AccessController.doPrivileged(Native Method) at java.rmi/sun.rmi.transport.Transport.serviceCall(Transport.java:196) at java.rmi/sun.rmi.transport.tcp.TCPTransport.handleMessages(TCPTransport.java:562) at java.rmi/sun.rmi.transport.tcp.TCPTransport$ConnectionHandler.run0(TCPTransport.java:796) at java.rmi/sun.rmi.transport.tcp.TCPTransport$ConnectionHandler.lambda$run$0(TCPTransport.java:677) at java.base/java.security.AccessController.doPrivileged(Native Method) at java.rmi/sun.rmi.transport.tcp.TCPTransport$ConnectionHandler.run(TCPTransport.java:676) at java.base/java.util.concurrent.ThreadPoolExecutor.runWorker(ThreadPoolExecutor.java:1128) at java.base/java.util.concurrent.ThreadPoolExecutor$Worker.run(ThreadPoolExecutor.java:628) at java.base/java.lang.Thread.run(Thread.java:834) at java.rmi/sun.rmi.transport.StreamRemoteCall.exceptionReceivedFromServer(StreamRemoteCall.java:283) at java.rmi/sun.rmi.transport.StreamRemoteCall.executeCall(StreamRemoteCall.java:260) at java.rmi/sun.rmi.server.UnicastRef.invoke(UnicastRef.java:161) at java.rmi/java.rmi.server.RemoteObjectInvocationHandler.invokeRemoteMethod(RemoteObjectInvocationHandler.java:209) at java.rmi/java.rmi.server.RemoteObjectInvocationHandler.invoke(RemoteObjectInvocationHandler.java:161) at com.sun.proxy.$Proxy185.customize(Unknown Source) at java.base/jdk.internal.reflect.NativeMethodAccessorImpl.invoke0(Native Method) at java.base/jdk.internal.reflect.NativeMethodAccessorImpl.invoke(NativeMethodAccessorImpl.java:62) at java.base/jdk.internal.reflect.DelegatingMethodAccessorImpl.invoke(DelegatingMethodAccessorImpl.java:43) at java.base/java.lang.reflect.Method.invoke(Method.java:566) at com.intellij.execution.rmi.RemoteUtil.invokeRemote(RemoteUtil.java:175) at com.intellij.execution.rmi.RemoteUtil.access$200(RemoteUtil.java:38) at com.intellij.execution.rmi.RemoteUtil$1$1$1.compute(RemoteUtil.java:156) at com.intellij.openapi.util.ClassLoaderUtil.computeWithClassLoader(ClassLoaderUtil.java:45) at com.intellij.execution.rmi.RemoteUtil.executeWithClassLoader(RemoteUtil.java:227) at com.intellij.execution.rmi.RemoteUtil$1$1.invoke(RemoteUtil.java:153) at com.sun.proxy.$Proxy185.customize(Unknown Source) at org.jetbrains.idea.maven.server.MavenEmbedderWrapper.doCustomize(MavenEmbedderWrapper.java:92) at org.jetbrains.idea.maven.server.MavenEmbedderWrapper.onWrappeeCreated(MavenEmbedderWrapper.java:45) at org.jetbrains.idea.maven.server.RemoteObjectWrapper.getOrCreateWrappee(RemoteObjectWrapper.java:42) at org.jetbrains.idea.maven.server.MavenEmbedderWrapper.doCustomize(MavenEmbedderWrapper.java:92) at org.jetbrains.idea.maven.server.MavenEmbedderWrapper.lambda$customizeForResolve$1(MavenEmbedderWrapper.java:65) at org.jetbrains.idea.maven.server.RemoteObjectWrapper.perform(RemoteObjectWrapper.java:76) at org.jetbrains.idea.maven.server.MavenEmbedderWrapper.customizeForResolve(MavenEmbedderWrapper.java:64) at org.jetbrains.idea.maven.project.MavenProjectsTree.resolve(MavenProjectsTree.java:1261) at org.jetbrains.idea.maven.project.MavenProjectsProcessorResolvingTask.perform(MavenProjectsProcessorResolvingTask.java:45) at org.jetbrains.idea.maven.project.MavenProjectsProcessor.doProcessPendingTasks(MavenProjectsProcessor.java:140) at org.jetbrains.idea.maven.project.MavenProjectsProcessor.access$000(MavenProjectsProcessor.java:33) at org.jetbrains.idea.maven.project.MavenProjectsProcessor$2.run(MavenProjectsProcessor.java:114) at org.jetbrains.idea.maven.utils.MavenUtil.lambda$runInBackground$5(MavenUtil.java:468) at com.intellij.openapi.application.impl.ApplicationImpl$1.run(ApplicationImpl.java:294) at java.base/java.util.concurrent.Executors$RunnableAdapter.call(Executors.java:515) at java.base/java.util.concurrent.FutureTask.run(FutureTask.java:264) at java.base/java.util.concurrent.ThreadPoolExecutor.runWorker(ThreadPoolExecutor.java:1128) at java.base/java.util.concurrent.ThreadPoolExecutor$Worker.run(ThreadPoolExecutor.java:628) at java.base/java.lang.Thread.run(Thread.java:834) 2019-10-08 10:54:23,805 [1174545] ERROR - #org.jetbrains.idea.maven - IntelliJ IDEA 2019.2.2 Build #IU-192.6603.28 2019-10-08 10:54:23,805 [1174545] ERROR - #org.jetbrains.idea.maven - JDK: 11.0.3; VM: OpenJDK 64-Bit Server VM; Vendor: JetBrains s.r.o 2019-10-08 10:54:23,805 [1174545] ERROR - #org.jetbrains.idea.maven - OS: Windows 8.1 2019-10-08 10:54:23,810 [1174550] ERROR - #org.jetbrains.idea.maven - Last Action: Maven.Reimport 2019-10-08 10:54:26,474 [1177214] INFO - ide.actions.ShowFilePathAction - Exit code 1 2019-10-08 10:54:27,591 [1178331] INFO - mponents.impl.stores.StoreUtil - saveProjectsAndApp took 301 ms ``` 这是从IDEA错误日志上显示的,求个大神帮我找到根源
idea的maven创建分布式项目问题
![图片说明](https://img-ask.csdn.net/upload/201703/14/1489468196_181464.png) **请问这些都是什么意思呀?不选择的话 能否 创建分布式项目。我要写的是分布式项目。结构如下。** ![图片说明](https://img-ask.csdn.net/upload/201703/14/1489468112_398943.png) **刚用idea,有很多不知道的东西,我已经创建2遍工程了,都有问题。 崩溃了,所以来求助一下,希望大神们帮我解答一下。 还是我是利用tomcat插件运行的项目,一直报错:错误如下** ![图片说明](https://img-ask.csdn.net/upload/201703/14/1489468568_944095.png) **我已经安装到本地仓库了,就是不行,愁死了。应该是创建项目的时候选错了吧?** ``` D:\wan\Java\jdk1.8.0_92\bin\java -Dmaven.multiModuleProjectDirectory=C:\Users\Administrator\IdeaProjects\taotao\taotao-manager-web -Dmaven.home=E:\工具\alymaven\apache-maven-3.3.9 -Dclassworlds.conf=E:\工具\alymaven\apache-maven-3.3.9\bin\m2.conf -Didea.launcher.port=7534 "-Didea.launcher.bin.path=D:\Program Files (x86)\JetBrains\IntelliJ IDEA 2016.3.5\bin" -Dfile.encoding=UTF-8 -classpath "E:\工具\alymaven\apache-maven-3.3.9\boot\plexus-classworlds-2.5.2.jar;D:\Program Files (x86)\JetBrains\IntelliJ IDEA 2016.3.5\lib\idea_rt.jar" com.intellij.rt.execution.application.AppMain org.codehaus.classworlds.Launcher -Didea.version=2016.3.5 -s E:\工具\alymaven\apache-maven-3.3.9\conf\settings.xml clean tomcat7:run [INFO] Scanning for projects... [ERROR] [ERROR] Some problems were encountered while processing the POMs: [ERROR] Invalid packaging for parent POM com.taotao:taotao-parent:1.0-SNAPSHOT (C:\Users\Administrator\IdeaProjects\taotao\taotao-parent\pom.xml), must be "pom" but is "jar" @ com.taotao:taotao-parent:1.0-SNAPSHOT, C:\Users\Administrator\IdeaProjects\taotao\taotao-parent\pom.xml @ [ERROR] The build could not read 1 project -> [Help 1] [ERROR] [ERROR] The project com.taotao:taotao-manager-web:1.0-SNAPSHOT (C:\Users\Administrator\IdeaProjects\taotao\taotao-manager-web\pom.xml) has 1 error [ERROR] Invalid packaging for parent POM com.taotao:taotao-parent:1.0-SNAPSHOT (C:\Users\Administrator\IdeaProjects\taotao\taotao-parent\pom.xml), must be "pom" but is "jar" @ com.taotao:taotao-parent:1.0-SNAPSHOT, C:\Users\Administrator\IdeaProjects\taotao\taotao-parent\pom.xml [ERROR] [ERROR] To see the full stack trace of the errors, re-run Maven with the -e switch. [ERROR] Re-run Maven using the -X switch to enable full debug logging. [ERROR] [ERROR] For more information about the errors and possible solutions, please read the following articles: [ERROR] [Help 1] http://cwiki.apache.org/confluence/display/MAVEN/ProjectBuildingException Process finished with exit code 1 ```
idea如何创建maven项目,怎么总是build failure
![图片说明](https://img-ask.csdn.net/upload/201707/07/1499413227_755365.png) 我在C盘下建了一个setting文件,下面是主要配置 ``` <localRepository>E:\repositorys</localRepository> <proxy> <id>optional</id> <active>true</active> <protocol>http</protocol> <username>**</username> <password>****</password> <host>**</host> <port>80</port> <nonProxyHosts>local.net|some.host.com</nonProxyHosts> </proxy> <mirror> <id>alimaven</id> <name>aliyun maven</name> <url>http://maven.aliyun.com/nexus/content/groups/public/</url> <mirrorOf>central</mirrorOf> </mirror> ```
docker-maven-plugin build 出现的一些问题,欢迎各位大佬前来解决
1. com.spotify:docker-maven-plugin:0.4.13:build (default-cli) on project springboot-nacos-register: Exception caught: Request error: POST http://192.168.120.134:2375/build?t=nacos: 500: HTTP 500 Internal Server Error -> [Help 1] 这个问题我百度了下往上说的都是repository name 不符合要求,但是我改成nacos去build 还是不行 2. 使用intellij idea docker 插件的时候 add * app.jar 提示 add 后面没有内容 这个错误
idea导入maven项目,将pom.xml更新,但是看不到jar包
把maven项目导入idea,pom更新jar之后看不到,刚开始是以为是pom未把jar下载完整,于是把 仓库里的jar包全部删除了,然后又重新刷新了下,可以看到在下载jar包,但是在idea仍然看不到jar包,在build的时候还是报jar包找不到这该是怎么办![图片说明](https://img-ask.csdn.net/upload/201905/28/1558974156_980018.png)
使用idea构建Maven项目的时候有个错误,求解决
![图片说明](https://img-ask.csdn.net/upload/201612/28/1482936324_550040.png) ![图片说明](https://img-ask.csdn.net/upload/201612/28/1482936336_5318.png) Error:Maven Resources Compiler: Maven project configuration required for module 'wechat' isn't available. Compilation of Maven projects is supported only if external build is started from an IDE. 错误:Maven资源编译器:Maven项目所需配置模块不能使用“wechat”。支持编译的Maven项目只有在外部构建从IDE。
idea 创建maven web项目出错
"D:\Program Files\Java\jdk1.8.0_66\bin\java" -Dmaven.multiModuleProjectDirectory=C:\Users\zs\AppData\Local\Temp\archetype2tmp -Dmaven.home=E:\apache-maven-3.3.9 -Dclassworlds.conf=E:\apache-maven-3.3.9\bin\m2.conf -Dfile.encoding=UTF-8 -classpath E:\apache-maven-3.3.9\boot\plexus-classworlds-2.5.2.jar org.codehaus.classworlds.Launcher -Didea.version=2017.1.4 -s E:\apache-maven-3.3.9\conf\settings.xml -DinteractiveMode=false -DgroupId=com.zs.webapp -DartifactId=com.zs.webapp -Dversion=1.0-SNAPSHOT -DarchetypeGroupId=org.apache.maven.archetypes -DarchetypeArtifactId=maven-archetype-webapp -DarchetypeVersion=RELEASE org.apache.maven.plugins:maven-archetype-plugin:RELEASE:generate [INFO] Scanning for projects... [INFO] ------------------------------------------------------------------------ [INFO] BUILD FAILURE [INFO] ------------------------------------------------------------------------ [INFO] Total time: 0.216 s [INFO] Finished at: 2017-06-14T17:00:24+08:00 [INFO] Final Memory: 5M/121M [INFO] ------------------------------------------------------------------------ [ERROR] Failed to parse plugin descriptor for org.apache.maven.plugins:maven-archetype-plugin:RELEASE (C:\Users\zs\.m2\repository\org\apache\maven\plugins\maven-archetype-plugin\3.0.1\maven-archetype-plugin-3.0.1.jar): error in opening zip file -> [Help 1] [ERROR] [ERROR] To see the full stack trace of the errors, re-run Maven with the -e switch. [ERROR] Re-run Maven using the -X switch to enable full debug logging. [ERROR] [ERROR] For more information about the errors and possible solutions, please read the following articles: [ERROR] [Help 1] http://cwiki.apache.org/confluence/display/MAVEN/PluginDescriptorParsingException [ERROR] Maven execution terminated abnormally (exit code 1)
使用IDEA和maven做注册时候遇到如下问题:
"E:\IntelliJ IDEA 2016.2.1\jdk1.8.0_91\bin\java" "-Dmaven.home=E:\IntelliJ IDEA 2016.2.1\plugins\maven\lib\maven3" "-Dclassworlds.conf=E:\IntelliJ IDEA 2016.2.1\plugins\maven\lib\maven3\bin\m2.conf" -Didea.launcher.port=7533 "-Didea.launcher.bin.path=E:\IntelliJ IDEA 2016.2.1\bin" -Dfile.encoding=UTF-8 -classpath "E:\IntelliJ IDEA 2016.2.1\plugins\maven\lib\maven3\boot\plexus-classworlds-2.4.jar;E:\IntelliJ IDEA 2016.2.1\lib\idea_rt.jar" com.intellij.rt.execution.application.AppMain org.codehaus.classworlds.Launcher -Didea.version=2016.2.1 tomcat:run [INFO] Scanning for projects... [INFO] [INFO] ------------------------------------------------------------------------ [INFO] Building zhuce Maven Webapp 1.0-SNAPSHOT [INFO] ------------------------------------------------------------------------ [INFO] [INFO] >>> tomcat-maven-plugin:1.1:run (default-cli) @ zhuce >>> [WARNING] The POM for com.google.guava:guava:jar:15.0 is invalid, transitive dependencies (if any) will not be available, enable debug logging for more details [WARNING] The POM for javax.servlet:javax.servlet-api:jar:3.1.0 is invalid, transitive dependencies (if any) will not be available, enable debug logging for more details [WARNING] The POM for org.glassfish.jersey.containers:jersey-container-grizzly2-servlet:jar:2.13 is invalid, transitive dependencies (if any) will not be available, enable debug logging for more details [WARNING] The POM for org.glassfish.jersey.containers:jersey-container-servlet-core:jar:2.13 is invalid, transitive dependencies (if any) will not be available, enable debug logging for more details [WARNING] The POM for commons-io:commons-io:jar:2.4 is invalid, transitive dependencies (if any) will not be available, enable debug logging for more details [WARNING] The POM for org.glassfish.jersey.core:jersey-client:jar:2.13 is invalid, transitive dependencies (if any) will not be available, enable debug logging for more details [WARNING] The POM for org.apache.bval:bval-jsr303:jar:0.5 is invalid, transitive dependencies (if any) will not be available, enable debug logging for more details [WARNING] The POM for log4j:log4j:jar:1.2.14 is invalid, transitive dependencies (if any) will not be available, enable debug logging for more details [WARNING] The POM for org.apache.httpcomponents:httpclient:jar:4.1 is invalid, transitive dependencies (if any) will not be available, enable debug logging for more details [WARNING] The POM for com.tustcs.java:base:jar:1.0 is invalid, transitive dependencies (if any) will not be available, enable debug logging for more details [WARNING] The POM for org.json:json:jar:20140107 is invalid, transitive dependencies (if any) will not be available, enable debug logging for more details [INFO] [INFO] --- maven-resources-plugin:2.5:resources (default-resources) @ zhuce --- [debug] execute contextualize [WARNING] Using platform encoding (UTF-8 actually) to copy filtered resources, i.e. build is platform dependent! [INFO] Copying 0 resource [INFO] [INFO] --- maven-compiler-plugin:2.3.2:compile (default-compile) @ zhuce --- [WARNING] File encoding has not been set, using platform encoding UTF-8, i.e. build is platform dependent! [INFO] Compiling 2 source files to F:\zhuce\target\classes [INFO] ------------------------------------------------------------- [ERROR] COMPILATION ERROR : [INFO] ------------------------------------------------------------- [ERROR] Failure executing javac, but could not parse the error: 错误: 读取C:\Users\ZILI\.m2\repository\com\google\guava\guava\15.0\guava-15.0.jar时出错; error in opening zip file 错误: 读取C:\Users\ZILI\.m2\repository\javax\servlet\javax.servlet-api\3.1.0\javax.servlet-api-3.1.0.jar时出错; error in opening zip file 错误: 读取C:\Users\ZILI\.m2\repository\org\glassfish\jersey\containers\jersey-container-grizzly2-servlet\2.13\jersey-container-grizzly2-servlet-2.13.jar时出错; error in opening zip file 错误: 读取C:\Users\ZILI\.m2\repository\org\glassfish\jersey\containers\jersey-container-servlet-core\2.13\jersey-container-servlet-core-2.13.jar时出错; error in opening zip file 错误: 读取C:\Users\ZILI\.m2\repository\commons-io\commons-io\2.4\commons-io-2.4.jar时出错; error in opening zip file 错误: 读取C:\Users\ZILI\.m2\repository\org\glassfish\jersey\core\jersey-client\2.13\jersey-client-2.13.jar时出错; error in opening zip file 错误: 读取C:\Users\ZILI\.m2\repository\org\apache\bval\bval-jsr303\0.5\bval-jsr303-0.5.jar时出错; error in opening zip file 错误: 读取C:\Users\ZILI\.m2\repository\log4j\log4j\1.2.14\log4j-1.2.14.jar时出错; error in opening zip file 错误: 读取C:\Users\ZILI\.m2\repository\org\apache\httpcomponents\httpclient\4.1\httpclient-4.1.jar时出错; error in opening zip file 错误: 读取C:\Users\ZILI\.m2\repository\com\tustcs\java\base\1.0\base-1.0.jar时出错; error in opening zip file 错误: 读取C:\Users\ZILI\.m2\repository\org\json\json\20140107\json-20140107.jar时出错; error in opening zip file 11 个错误 [INFO] 1 error [INFO] ------------------------------------------------------------- [INFO] ------------------------------------------------------------------------ [INFO] BUILD FAILURE [INFO] ------------------------------------------------------------------------ [INFO] Total time: 13.436s [INFO] Finished at: Mon Oct 10 10:44:37 CST 2016 [INFO] Final Memory: 10M/77M [INFO] ------------------------------------------------------------------------ [ERROR] Failed to execute goal org.apache.maven.plugins:maven-compiler-plugin:2.3.2:compile (default-compile) on project zhuce: Compilation failure [ERROR] Failure executing javac, but could not parse the error: [ERROR] 错误: 读取C:\Users\ZILI\.m2\repository\com\google\guava\guava\15.0\guava-15.0.jar时出错; error in opening zip file [ERROR] 错误: 读取C:\Users\ZILI\.m2\repository\javax\servlet\javax.servlet-api\3.1.0\javax.servlet-api-3.1.0.jar时出错; error in opening zip file [ERROR] 错误: 读取C:\Users\ZILI\.m2\repository\org\glassfish\jersey\containers\jersey-container-grizzly2-servlet\2.13\jersey-container-grizzly2-servlet-2.13.jar时出错; error in opening zip file [ERROR] 错误: 读取C:\Users\ZILI\.m2\repository\org\glassfish\jersey\containers\jersey-container-servlet-core\2.13\jersey-container-servlet-core-2.13.jar时出错; error in opening zip file [ERROR] 错误: 读取C:\Users\ZILI\.m2\repository\commons-io\commons-io\2.4\commons-io-2.4.jar时出错; error in opening zip file [ERROR] 错误: 读取C:\Users\ZILI\.m2\repository\org\glassfish\jersey\core\jersey-client\2.13\jersey-client-2.13.jar时出错; error in opening zip file [ERROR] 错误: 读取C:\Users\ZILI\.m2\repository\org\apache\bval\bval-jsr303\0.5\bval-jsr303-0.5.jar时出错; error in opening zip file [ERROR] 错误: 读取C:\Users\ZILI\.m2\repository\log4j\log4j\1.2.14\log4j-1.2.14.jar时出错; error in opening zip file [ERROR] 错误: 读取C:\Users\ZILI\.m2\repository\org\apache\httpcomponents\httpclient\4.1\httpclient-4.1.jar时出错; error in opening zip file [ERROR] 错误: 读取C:\Users\ZILI\.m2\repository\com\tustcs\java\base\1.0\base-1.0.jar时出错; error in opening zip file [ERROR] 错误: 读取C:\Users\ZILI\.m2\repository\org\json\json\20140107\json-20140107.jar时出错; error in opening zip file [ERROR] 11 个错误 [ERROR] -> [Help 1] [ERROR] [ERROR] To see the full stack trace of the errors, re-run Maven with the -e switch. [ERROR] Re-run Maven using the -X switch to enable full debug logging. [ERROR] [ERROR] For more information about the errors and possible solutions, please read the following articles: [ERROR] [Help 1] http://cwiki.apache.org/confluence/display/MAVEN/MojoFailureException Process finished with exit code 1 ``` ```
maven配置私服打包报错Failed to execute goal org.apache.maven.plugins:maven-compiler-plugin:3.5:compile
直接使用阿里云镜像仓库打包没问题,替换为私服镜像仓库后报错: 就是pom.xml中的plugin报错 ``` <plugin> <groupId>org.apache.maven.plugins</groupId> <artifactId>maven-compiler-plugin</artifactId> <version>3.5</version> <configuration> <source>1.8</source> <target>1.8</target> <encoding>UTF-8</encoding> </configuration> </plugin> ``` 网上找了半天说这个指定的jdk版本的问题,查了一下版本没问题都是1.8 报错内容: [ERROR] Failed to execute goal org.apache.maven.plugins:maven-compiler-plugin:3.5:compile (default-compile) on project mytest-web: Execution default-compile of goal org.apache.maven.plugins:maven-compiler-plugin:3.5:compile failed: Plugin org.apache.maven.plugins:maven-compiler-plugin:3.5 or one of its dependencies could not be resolved: Failed to collect dependencies at org.apache.maven.plugins:maven-compiler-plugin:jar:3.5 -> org.apache.maven:maven-toolchain:jar:2.2.1 -> org.apache.maven:maven-core:jar:2.2.1 -> commons-cli:commons-cli:jar:1.2: Failed to read artifact descriptor for commons-cli:commons-cli:jar:1.2: Failure to find org.apache:apache:pom:4 in http://localhost:8081/nexus/content/groups/public/ was cached in the local repository, resolution will not be reattempted until the update interval of public has elapsed or updates are forced -> [Help 1] org.apache.maven.lifecycle.LifecycleExecutionException: Failed to execute goal org.apache.maven.plugins:maven-compiler-plugin:3.5:compile (default-compile) on project mytest-web: Execution default-compile of goal org.apache.maven.plugins:maven-compiler-plugin:3.5:compile failed: Plugin org.apache.maven.plugins:maven-compiler-plugin:3.5 or one of its dependencies could not be resolved: Failed to collect dependencies at org.apache.maven.plugins:maven-compiler-plugin:jar:3.5 -> org.apache.maven:maven-toolchain:jar:2.2.1 -> org.apache.maven:maven-core:jar:2.2.1 -> commons-cli:commons-cli:jar:1.2 at org.apache.maven.lifecycle.internal.MojoExecutor.execute(MojoExecutor.java:213) at org.apache.maven.lifecycle.internal.MojoExecutor.execute(MojoExecutor.java:154) at org.apache.maven.lifecycle.internal.MojoExecutor.execute(MojoExecutor.java:146) at org.apache.maven.lifecycle.internal.LifecycleModuleBuilder.buildProject(LifecycleModuleBuilder.java:117) at org.apache.maven.lifecycle.internal.LifecycleModuleBuilder.buildProject(LifecycleModuleBuilder.java:81) at org.apache.maven.lifecycle.internal.builder.singlethreaded.SingleThreadedBuilder.build(SingleThreadedBuilder.java:51) at org.apache.maven.lifecycle.internal.LifecycleStarter.execute(LifecycleStarter.java:128) at org.apache.maven.DefaultMaven.doExecute(DefaultMaven.java:309) at org.apache.maven.DefaultMaven.doExecute(DefaultMaven.java:194) at org.apache.maven.DefaultMaven.execute(DefaultMaven.java:107) at org.apache.maven.cli.MavenCli.execute(MavenCli.java:993) at org.apache.maven.cli.MavenCli.doMain(MavenCli.java:345) at org.apache.maven.cli.MavenCli.main(MavenCli.java:191) at sun.reflect.NativeMethodAccessorImpl.invoke0(Native Method) at sun.reflect.NativeMethodAccessorImpl.invoke(NativeMethodAccessorImpl.java:62) at sun.reflect.DelegatingMethodAccessorImpl.invoke(DelegatingMethodAccessorImpl.java:43) at java.lang.reflect.Method.invoke(Method.java:498) at org.codehaus.plexus.classworlds.launcher.Launcher.launchEnhanced(Launcher.java:289) at org.codehaus.plexus.classworlds.launcher.Launcher.launch(Launcher.java:229) at org.codehaus.plexus.classworlds.launcher.Launcher.mainWithExitCode(Launcher.java:415) at org.codehaus.plexus.classworlds.launcher.Launcher.main(Launcher.java:356) Caused by: org.apache.maven.plugin.PluginExecutionException: Execution default-compile of goal org.apache.maven.plugins:maven-compiler-plugin:3.5:compile failed: Plugin org.apache.maven.plugins:maven-compiler-plugin:3.5 or one of its dependencies could not be resolved: Failed to collect dependencies at org.apache.maven.plugins:maven-compiler-plugin:jar:3.5 -> org.apache.maven:maven-toolchain:jar:2.2.1 -> org.apache.maven:maven-core:jar:2.2.1 -> commons-cli:commons-cli:jar:1.2 at org.apache.maven.plugin.DefaultBuildPluginManager.executeMojo(DefaultBuildPluginManager.java:106) at org.apache.maven.lifecycle.internal.MojoExecutor.execute(MojoExecutor.java:208) ... 20 more Caused by: org.apache.maven.plugin.PluginResolutionException: Plugin org.apache.maven.plugins:maven-compiler-plugin:3.5 or one of its dependencies could not be resolved: Failed to collect dependencies at org.apache.maven.plugins:maven-compiler-plugin:jar:3.5 -> org.apache.maven:maven-toolchain:jar:2.2.1 -> org.apache.maven:maven-core:jar:2.2.1 -> commons-cli:commons-cli:jar:1.2 at org.apache.maven.plugin.internal.DefaultPluginDependenciesResolver.resolveInternal(DefaultPluginDependenciesResolver.java:214) at org.apache.maven.plugin.internal.DefaultPluginDependenciesResolver.resolve(DefaultPluginDependenciesResolver.java:149) at org.apache.maven.plugin.internal.DefaultMavenPluginManager.createPluginRealm(DefaultMavenPluginManager.java:402) at org.apache.maven.plugin.internal.DefaultMavenPluginManager.setupPluginRealm(DefaultMavenPluginManager.java:374) at org.apache.maven.plugin.DefaultBuildPluginManager.getPluginRealm(DefaultBuildPluginManager.java:231) at org.apache.maven.plugin.DefaultBuildPluginManager.executeMojo(DefaultBuildPluginManager.java:102) ... 21 more Caused by: org.eclipse.aether.collection.DependencyCollectionException: Failed to collect dependencies at org.apache.maven.plugins:maven-compiler-plugin:jar:3.5 -> org.apache.maven:maven-toolchain:jar:2.2.1 -> org.apache.maven:maven-core:jar:2.2.1 -> commons-cli:commons-cli:jar:1.2 at org.eclipse.aether.internal.impl.DefaultDependencyCollector.collectDependencies(DefaultDependencyCollector.java:300) at org.eclipse.aether.internal.impl.DefaultRepositorySystem.collectDependencies(DefaultRepositorySystem.java:325) at org.apache.maven.plugin.internal.DefaultPluginDependenciesResolver.resolveInternal(DefaultPluginDependenciesResolver.java:202) ... 26 more Caused by: org.eclipse.aether.resolution.ArtifactDescriptorException: Failed to read artifact descriptor for commons-cli:commons-cli:jar:1.2 at org.apache.maven.repository.internal.DefaultArtifactDescriptorReader.loadPom(DefaultArtifactDescriptorReader.java:330) at org.apache.maven.repository.internal.DefaultArtifactDescriptorReader.readArtifactDescriptor(DefaultArtifactDescriptorReader.java:199) at org.eclipse.aether.internal.impl.DefaultDependencyCollector.resolveCachedArtifactDescriptor(DefaultDependencyCollector.java:544) at org.eclipse.aether.internal.impl.DefaultDependencyCollector.getArtifactDescriptorResult(DefaultDependencyCollector.java:528) at org.eclipse.aether.internal.impl.DefaultDependencyCollector.processDependency(DefaultDependencyCollector.java:418) at org.eclipse.aether.internal.impl.DefaultDependencyCollector.processDependency(DefaultDependencyCollector.java:372) at org.eclipse.aether.internal.impl.DefaultDependencyCollector.process(DefaultDependencyCollector.java:360) at org.eclipse.aether.internal.impl.DefaultDependencyCollector.doRecurse(DefaultDependencyCollector.java:513) at org.eclipse.aether.internal.impl.DefaultDependencyCollector.processDependency(DefaultDependencyCollector.java:467) at org.eclipse.aether.internal.impl.DefaultDependencyCollector.processDependency(DefaultDependencyCollector.java:372) at org.eclipse.aether.internal.impl.DefaultDependencyCollector.process(DefaultDependencyCollector.java:360) at org.eclipse.aether.internal.impl.DefaultDependencyCollector.doRecurse(DefaultDependencyCollector.java:513) at org.eclipse.aether.internal.impl.DefaultDependencyCollector.processDependency(DefaultDependencyCollector.java:467) at org.eclipse.aether.internal.impl.DefaultDependencyCollector.processDependency(DefaultDependencyCollector.java:372) at org.eclipse.aether.internal.impl.DefaultDependencyCollector.process(DefaultDependencyCollector.java:360) at org.eclipse.aether.internal.impl.DefaultDependencyCollector.collectDependencies(DefaultDependencyCollector.java:263) ... 28 more Caused by: org.apache.maven.model.resolution.UnresolvableModelException: Failure to find org.apache:apache:pom:4 in http://localhost:8081/nexus/content/groups/public/ was cached in the local repository, resolution will not be reattempted until the update interval of public has elapsed or updates are forced at org.apache.maven.repository.internal.DefaultModelResolver.resolveModel(DefaultModelResolver.java:178) at org.apache.maven.repository.internal.DefaultModelResolver.resolveModel(DefaultModelResolver.java:224) at org.apache.maven.model.building.DefaultModelBuilder.readParentExternally(DefaultModelBuilder.java:1051) at org.apache.maven.model.building.DefaultModelBuilder.readParent(DefaultModelBuilder.java:829) at org.apache.maven.model.building.DefaultModelBuilder.build(DefaultModelBuilder.java:331) at org.apache.maven.repository.internal.DefaultArtifactDescriptorReader.loadPom(DefaultArtifactDescriptorReader.java:321) ... 43 more Caused by: org.eclipse.aether.resolution.ArtifactResolutionException: Failure to find org.apache:apache:pom:4 in http://localhost:8081/nexus/content/groups/public/ was cached in the local repository, resolution will not be reattempted until the update interval of public has elapsed or updates are forced at org.eclipse.aether.internal.impl.DefaultArtifactResolver.resolve(DefaultArtifactResolver.java:453) at org.eclipse.aether.internal.impl.DefaultArtifactResolver.resolveArtifacts(DefaultArtifactResolver.java:255) at org.eclipse.aether.internal.impl.DefaultArtifactResolver.resolveArtifact(DefaultArtifactResolver.java:232) at org.apache.maven.repository.internal.DefaultModelResolver.resolveModel(DefaultModelResolver.java:174) ... 48 more Caused by: org.eclipse.aether.transfer.ArtifactNotFoundException: Failure to find org.apache:apache:pom:4 in http://localhost:8081/nexus/content/groups/public/ was cached in the local repository, resolution will not be reattempted until the update interval of public has elapsed or updates are forced at org.eclipse.aether.internal.impl.DefaultUpdateCheckManager.newException(DefaultUpdateCheckManager.java:240) at org.eclipse.aether.internal.impl.DefaultUpdateCheckManager.checkArtifact(DefaultUpdateCheckManager.java:215) at org.eclipse.aether.internal.impl.DefaultArtifactResolver.gatherDownloads(DefaultArtifactResolver.java:594) at org.eclipse.aether.internal.impl.DefaultArtifactResolver.performDownloads(DefaultArtifactResolver.java:512) at org.eclipse.aether.internal.impl.DefaultArtifactResolver.resolve(DefaultArtifactResolver.java:430) ... 51 more [ERROR] [ERROR] Re-run Maven using the -X switch to enable full debug logging. [ERROR] [ERROR] For more information about the errors and possible solutions, please read the following articles: [ERROR] [Help 1] http://cwiki.apache.org/confluence/display/MAVEN/PluginResolutionException
maven 工程 install 安装时
# 报错 Exception in thread "main" java.lang.AssertionError at jdk.compiler/com.sun.tools.javac.util.Assert.error(Assert.java:155) at jdk.compiler/com.sun.tools.javac.util.Assert.check(Assert.java:46) at jdk.compiler/com.sun.tools.javac.comp.Modules.enter(Modules.java:247) at jdk.compiler/com.sun.tools.javac.main.JavaCompiler.readSourceFile(JavaCompiler.java:837) at jdk.compiler/com.sun.tools.javac.processing.JavacProcessingEnvironment$ImplicitCompleter.complete(JavacProcessingEnvironment.java:1534) at jdk.compiler/com.sun.tools.javac.code.Symbol.complete(Symbol.java:642) at jdk.compiler/com.sun.tools.javac.code.Symbol$ClassSymbol.complete(Symbol.java:1326) at jdk.compiler/com.sun.tools.javac.code.Type$ClassType.complete(Type.java:1140) at jdk.compiler/com.sun.tools.javac.code.Type$ClassType.getTypeArguments(Type.java:1066) at jdk.compiler/com.sun.tools.javac.code.Printer.visitClassType(Printer.java:237) at jdk.compiler/com.sun.tools.javac.code.Printer.visitClassType(Printer.java:52) at jdk.compiler/com.sun.tools.javac.code.Type$ClassType.accept(Type.java:993) at jdk.compiler/com.sun.tools.javac.code.Printer.visit(Printer.java:136) at jdk.compiler/com.sun.tools.javac.util.AbstractDiagnosticFormatter.formatArgument(AbstractDiagnosticFormatter.java:199) at jdk.compiler/com.sun.tools.javac.util.AbstractDiagnosticFormatter.formatArguments(AbstractDiagnosticFormatter.java:167) at jdk.compiler/com.sun.tools.javac.util.BasicDiagnosticFormatter.formatMessage(BasicDiagnosticFormatter.java:111) at jdk.compiler/com.sun.tools.javac.util.BasicDiagnosticFormatter.formatMessage(BasicDiagnosticFormatter.java:67) at jdk.compiler/com.sun.tools.javac.util.AbstractDiagnosticFormatter.formatArgument(AbstractDiagnosticFormatter.java:185) at jdk.compiler/com.sun.tools.javac.util.AbstractDiagnosticFormatter.formatArguments(AbstractDiagnosticFormatter.java:167) at jdk.compiler/com.sun.tools.javac.util.BasicDiagnosticFormatter.formatMessage(BasicDiagnosticFormatter.java:111) at jdk.compiler/com.sun.tools.javac.util.BasicDiagnosticFormatter.formatMessage(BasicDiagnosticFormatter.java:67) at jdk.compiler/com.sun.tools.javac.util.JCDiagnostic.getMessage(JCDiagnostic.java:788) at jdk.compiler/com.sun.tools.javac.api.ClientCodeWrapper$DiagnosticSourceUnwrapper.getMessage(ClientCodeWrapper.java:799) at org.codehaus.plexus.compiler.javac.JavaxToolsCompiler.compileInProcess(JavaxToolsCompiler.java:131) at org.codehaus.plexus.compiler.javac.JavacCompiler.performCompile(JavacCompiler.java:174) at org.apache.maven.plugin.compiler.AbstractCompilerMojo.execute(AbstractCompilerMojo.java:1075) at org.apache.maven.plugin.compiler.TestCompilerMojo.execute(TestCompilerMojo.java:176) at org.apache.maven.plugin.DefaultBuildPluginManager.executeMojo(DefaultBuildPluginManager.java:137) at org.apache.maven.lifecycle.internal.MojoExecutor.execute(MojoExecutor.java:210) at org.apache.maven.lifecycle.internal.MojoExecutor.execute(MojoExecutor.java:156) at org.apache.maven.lifecycle.internal.MojoExecutor.execute(MojoExecutor.java:148) at org.apache.maven.lifecycle.internal.LifecycleModuleBuilder.buildProject(LifecycleModuleBuilder.java:117) at org.apache.maven.lifecycle.internal.LifecycleModuleBuilder.buildProject(LifecycleModuleBuilder.java:81) at org.apache.maven.lifecycle.internal.builder.singlethreaded.SingleThreadedBuilder.build(SingleThreadedBuilder.java:56) at org.apache.maven.lifecycle.internal.LifecycleStarter.execute(LifecycleStarter.java:128) at org.apache.maven.DefaultMaven.doExecute(DefaultMaven.java:305) at org.apache.maven.DefaultMaven.doExecute(DefaultMaven.java:192) at org.apache.maven.DefaultMaven.execute(DefaultMaven.java:105) at org.apache.maven.cli.MavenCli.execute(MavenCli.java:956) at org.apache.maven.cli.MavenCli.doMain(MavenCli.java:288) at org.apache.maven.cli.MavenCli.main(MavenCli.java:192) at java.base/jdk.internal.reflect.NativeMethodAccessorImpl.invoke0(Native Method) at java.base/jdk.internal.reflect.NativeMethodAccessorImpl.invoke(NativeMethodAccessorImpl.java:62) at java.base/jdk.internal.reflect.DelegatingMethodAccessorImpl.invoke(DelegatingMethodAccessorImpl.java:43) at java.base/java.lang.reflect.Method.invoke(Method.java:567) at org.codehaus.plexus.classworlds.launcher.Launcher.launchEnhanced(Launcher.java:282) at org.codehaus.plexus.classworlds.launcher.Launcher.launch(Launcher.java:225) at org.codehaus.plexus.classworlds.launcher.Launcher.mainWithExitCode(Launcher.java:406) at org.codehaus.plexus.classworlds.launcher.Launcher.main(Launcher.java:347) at org.codehaus.classworlds.Launcher.main(Launcher.java:47) at java.base/jdk.internal.reflect.NativeMethodAccessorImpl.invoke0(Native Method) at java.base/jdk.internal.reflect.NativeMethodAccessorImpl.invoke(NativeMethodAccessorImpl.java:62) at java.base/jdk.internal.reflect.DelegatingMethodAccessorImpl.invoke(DelegatingMethodAccessorImpl.java:43) at java.base/java.lang.reflect.Method.invoke(Method.java:567) at com.intellij.rt.execution.application.AppMainV2.main(AppMainV2.java:131) ![图片说明](https://img-ask.csdn.net/upload/201912/23/1577110867_869124.png)
idea的maven项目的jsp页面导入jstl标签
一直报错The absolute uri: http://java.sun.com/jsp/jstl/core cannot be resolved in either web.xml or the jar files deployed with this application。 pom文件配置: <?xml version="1.0" encoding="UTF-8"?> <project xmlns="http://maven.apache.org/POM/4.0.0" xmlns:xsi="http://www.w3.org/2001/XMLSchema-instance" xsi:schemaLocation="http://maven.apache.org/POM/4.0.0 http://maven.apache.org/xsd/maven-4.0.0.xsd"> <modelVersion>4.0.0</modelVersion> <groupId>com.cc</groupId> <artifactId>chat</artifactId> <version>1.0-SNAPSHOT</version> <!-- 配置固定信息--> <properties> <project.build.sourceEncoding>UTF-8</project.build.sourceEncoding> <project.reporting.outputEncoding>UTF-8</project.reporting.outputEncoding> <maven.compiler.encoding>UTF-8</maven.compiler.encoding> <org.springframework.version>4.0.0.RELEASE</org.springframework.version> <org.mybatis.version>3.4.1</org.mybatis.version> <org.mybatis.spring.version>1.3.0</org.mybatis.spring.version> </properties> <!--依赖导入--> <dependencies> <dependency> <groupId>org.apache.tomcat</groupId> <artifactId>tomcat-servlet-api</artifactId> <version>7.0.64</version> </dependency> <dependency> <groupId>org.springframework</groupId> <artifactId>spring-webmvc</artifactId> <version>${org.springframework.version}</version> </dependency> <dependency> <groupId>org.springframework</groupId> <artifactId>spring-oxm</artifactId> <version>${org.springframework.version}</version> </dependency> <dependency> <groupId>org.springframework</groupId> <artifactId>spring-jdbc</artifactId> <version>${org.springframework.version}</version> </dependency> <dependency> <groupId>org.springframework</groupId> <artifactId>spring-tx</artifactId> <version>${org.springframework.version}</version> </dependency> <dependency> <groupId>org.springframework</groupId> <artifactId>spring-test</artifactId> <version>${org.springframework.version}</version> </dependency> <dependency> <groupId>org.aspectj</groupId> <artifactId>aspectjweaver</artifactId> <version>1.7.3</version> </dependency> <dependency> <groupId>org.mybatis</groupId> <artifactId>mybatis-spring</artifactId> <version>${org.mybatis.spring.version}</version> </dependency> <dependency> <groupId>org.mybatis</groupId> <artifactId>mybatis</artifactId> <version>${org.mybatis.version}</version> </dependency> <dependency> <groupId>org.aspectj</groupId> <artifactId>aspectjrt</artifactId> <version>1.6.11</version> </dependency> <dependency> <groupId>org.codehaus.jackson</groupId> <artifactId>jackson-mapper-asl</artifactId> <version>1.9.12</version> </dependency> <dependency> <groupId>commons-dbcp</groupId> <artifactId>commons-dbcp</artifactId> <version>1.4</version> <!--<scope>runtime</scope>--> </dependency> <dependency> <groupId>ch.qos.logback</groupId> <artifactId>logback-classic</artifactId> <version>1.1.2</version> <scope>compile</scope> </dependency> <dependency> <groupId>ch.qos.logback</groupId> <artifactId>logback-core</artifactId> <version>1.1.2</version> <scope>compile</scope> </dependency> <dependency> <groupId>mysql</groupId> <artifactId>mysql-connector-java</artifactId> <version>5.1.6</version> </dependency> <dependency> <groupId>com.google.guava</groupId> <artifactId>guava</artifactId> <version>20.0</version> </dependency> <dependency> <groupId>org.apache.commons</groupId> <artifactId>commons-lang3</artifactId> <version>3.5</version> </dependency> <dependency> <groupId>commons-collections</groupId> <artifactId>commons-collections</artifactId> <version>3.2.1</version> </dependency> <dependency> <groupId>junit</groupId> <artifactId>junit</artifactId> <version>4.12</version> <!--<scope>test</scope>--> </dependency> <dependency> <groupId>joda-time</groupId> <artifactId>joda-time</artifactId> <version>2.3</version> </dependency> <!-- id加密解密 --> <dependency> <groupId>org.hashids</groupId> <artifactId>hashids</artifactId> <version>1.0.1</version> </dependency> <!-- ftpclient --> <dependency> <groupId>commons-net</groupId> <artifactId>commons-net</artifactId> <version>3.1</version> </dependency> <!-- file upload --> <!-- https://mvnrepository.com/artifact/commons-fileupload/commons-fileupload --> <dependency> <groupId>commons-fileupload</groupId> <artifactId>commons-fileupload</artifactId> <version>1.2.2</version> </dependency> <dependency> <groupId>commons-io</groupId> <artifactId>commons-io</artifactId> <version>2.0.1</version> </dependency> <!-- mybatis pager --> <dependency> <groupId>com.github.pagehelper</groupId> <artifactId>pagehelper</artifactId> <version>4.1.0</version> </dependency> <dependency> <groupId>com.github.miemiedev</groupId> <artifactId>mybatis-paginator</artifactId> <version>1.2.17</version> </dependency> <dependency> <groupId>com.github.jsqlparser</groupId> <artifactId>jsqlparser</artifactId> <version>0.9.4</version> </dependency> <!-- alipay --> <dependency> <groupId>commons-codec</groupId> <artifactId>commons-codec</artifactId> <version>1.10</version> </dependency> <dependency> <groupId>commons-configuration</groupId> <artifactId>commons-configuration</artifactId> <version>1.10</version> </dependency> <dependency> <groupId>commons-lang</groupId> <artifactId>commons-lang</artifactId> <version>2.6</version> </dependency> <dependency> <groupId>commons-logging</groupId> <artifactId>commons-logging</artifactId> <version>1.1.1</version> </dependency> <dependency> <groupId>com.google.zxing</groupId> <artifactId>core</artifactId> <version>2.1</version> </dependency> <dependency> <groupId>com.google.code.gson</groupId> <artifactId>gson</artifactId> <version>2.3.1</version> </dependency> <dependency> <groupId>org.hamcrest</groupId> <artifactId>hamcrest-core</artifactId> <version>1.3</version> </dependency> <dependency> <groupId>redis.clients</groupId> <artifactId>jedis</artifactId> <version>2.9.0</version> </dependency> <!--jstl--> <dependency> <groupId>javax.servlet</groupId> <artifactId>jstl</artifactId> <version>1.2</version> </dependency> <dependency> <groupId>javax.servlet</groupId> <artifactId>jsp-api</artifactId> <version>2.0</version> <scope>provided</scope> </dependency> <dependency> <groupId>taglibs</groupId> <artifactId>standard</artifactId> <version>1.1.2</version> </dependency> </dependencies> <build> <finalName>chat</finalName> <plugins> <plugin> <groupId>org.mybatis.generator</groupId> <artifactId>mybatis-generator-maven-plugin</artifactId> <version>1.3.2</version> <configuration> <verbose>true</verbose> <overwrite>true</overwrite> </configuration> </plugin> <!-- geelynote maven的核心插件之-complier插件默认只支持编译Java 1.4,因此需要加上支持高版本jre的配置,在pom.xml里面加上 增加编译插件 --> <plugin> <groupId>org.apache.maven.plugins</groupId> <artifactId>maven-compiler-plugin</artifactId> <configuration> <source>1.7</source> <target>1.7</target> <encoding>UTF-8</encoding> <compilerArguments> <extdirs>${project.basedir}/src/main/webapp/WEB-INF/lib</extdirs> </compilerArguments> </configuration> </plugin> </plugins> </build> </project> jsp页面taglib: <%@ taglib prefix="c" uri="http://java.sun.com/jsp/jstl/core" %> <%@ page isELIgnored="false" %> 求助:怎么才会不报错啊,网上好多方法都尝试了,
用IDEA新建的Maven项目,无法运行
按照网上的教程,新建了一个Maven项目,并在pom.xml添加了依赖和插件, <?xml version="1.0" encoding="UTF-8"?> <project xmlns="http://maven.apache.org/POM/4.0.0" xmlns:xsi="http://www.w3.org/2001/XMLSchema-instance" xsi:schemaLocation="http://maven.apache.org/POM/4.0.0 http://maven.apache.org/xsd/maven-4.0.0.xsd"> <modelVersion>4.0.0</modelVersion> <groupId>outman</groupId> <artifactId>chen</artifactId> <version>1.0-SNAPSHOT</version> <parent> <groupId>org.springframework.boot</groupId> <artifactId>spring-boot-starter-parent</artifactId> <version>1.5.9.RELEASE</version> </parent> <!-- Add typical dependencies for a web application --> <dependencies> <dependency> <groupId>org.springframework.boot</groupId> <artifactId>spring-boot-starter-web</artifactId> </dependency> </dependencies> <!-- Package as an executable jar --> <build> <plugins> <plugin> <groupId>org.springframework.boot</groupId> <artifactId>spring-boot-maven-plugin</artifactId> </plugin> </plugins> </build> </project> 之后编写了一个简单的java程序, package outman; import org.springframework.boot.SpringApplication; import org.springframework.boot.autoconfigure.SpringBootApplication; @SpringBootApplication public class HelloWorldMainApplication { public static void main(String[] args) { SpringBootApplication.run(HelloWorldMainApplication.class,args); } } ![图片说明](https://img-ask.csdn.net/upload/201904/21/1555855918_161454.png) 发现run是红色的,无法运行,请各位大佬解决一下。
idea中配置tomcat7-maven-plugin
我新建了一个项目,在pom.xml中也配置了<build> <plugins> <plugin> <groupId>org.apache.tomcat.maven</groupId> <artifactId>tomcat7-maven-plugin</artifactId> <version>2.1</version> <configuration> <port>80</port> <path>/</path> </configuration> </plugin> </plugins> </build> 可是为什么双击右面的tomcat7:run ![图片说明](https://img-ask.csdn.net/upload/201507/27/1437977970_648204.jpg) 却不运行tomcat ![图片说明](https://img-ask.csdn.net/upload/201507/27/1437977909_127299.png)
idea右边没有gradle窗口
idea右边有maven project , 也可以找到ant build ,但是没有gradle project那个工具窗口
相见恨晚的超实用网站
搞学习 知乎:www.zhihu.com 简答题:http://www.jiandati.com/ 网易公开课:https://open.163.com/ted/ 网易云课堂:https://study.163.com/ 中国大学MOOC:www.icourse163.org 网易云课堂:study.163.com 哔哩哔哩弹幕网:www.bilibili.com 我要自学网:www.51zxw
爬虫福利二 之 妹子图网MM批量下载
爬虫福利一:27报网MM批量下载    点击 看了本文,相信大家对爬虫一定会产生强烈的兴趣,激励自己去学习爬虫,在这里提前祝:大家学有所成! 目标网站:妹子图网 环境:Python3.x 相关第三方模块:requests、beautifulsoup4 Re:各位在测试时只需要将代码里的变量 path 指定为你当前系统要保存的路径,使用 python xxx.py 或IDE运行即可。
字节跳动视频编解码面经
引言 本文主要是记录一下面试字节跳动的经历。 三四月份投了字节跳动的实习(图形图像岗位),然后hr打电话过来问了一下会不会opengl,c++,shador,当时只会一点c++,其他两个都不会,也就直接被拒了。 七月初内推了字节跳动的提前批,因为内推没有具体的岗位,hr又打电话问要不要考虑一下图形图像岗,我说实习投过这个岗位不合适,不会opengl和shador,然后hr就说秋招更看重基础。我当时
开源一个功能完整的SpringBoot项目框架
福利来了,给大家带来一个福利。 最近想了解一下有关Spring Boot的开源项目,看了很多开源的框架,大多是一些demo或者是一个未成形的项目,基本功能都不完整,尤其是用户权限和菜单方面几乎没有完整的。 想到我之前做的框架,里面通用模块有:用户模块,权限模块,菜单模块,功能模块也齐全了,每一个功能都是完整的。 打算把这个框架分享出来,供大家使用和学习。 为什么用框架? 框架可以学习整体
源码阅读(19):Java中主要的Map结构——HashMap容器(下1)
(接上文《源码阅读(18):Java中主要的Map结构——HashMap容器(中)》) 3.4.4、HashMap添加K-V键值对(红黑树方式) 上文我们介绍了在HashMap中table数组的某个索引位上,基于单向链表添加新的K-V键值对对象(HashMap.Node&lt;K, V&gt;类的实例),但是我们同时知道在某些的场景下,HashMap中table数据的某个索引位上,数据是按照红黑树
c++制作的植物大战僵尸,开源,一代二代结合游戏
    此游戏全部由本人自己制作完成。游戏大部分的素材来源于原版游戏素材,少部分搜集于网络,以及自己制作。 此游戏为同人游戏而且仅供学习交流使用,任何人未经授权,不得对本游戏进行更改、盗用等,否则后果自负。 目前有六种僵尸和六种植物,植物和僵尸的动画都是本人做的。qq:2117610943 开源代码下载 提取码:3vzm 点击下载--&gt; 11月28日 新增四种植物 统一植物画风,全部修
Java学习的正确打开方式
在博主认为,对于入门级学习java的最佳学习方法莫过于视频+博客+书籍+总结,前三者博主将淋漓尽致地挥毫于这篇博客文章中,至于总结在于个人,实际上越到后面你会发现学习的最好方式就是阅读参考官方文档其次就是国内的书籍,博客次之,这又是一个层次了,这里暂时不提后面再谈。博主将为各位入门java保驾护航,各位只管冲鸭!!!上天是公平的,只要不辜负时间,时间自然不会辜负你。 何谓学习?博主所理解的学习,它
程序员必须掌握的核心算法有哪些?
由于我之前一直强调数据结构以及算法学习的重要性,所以就有一些读者经常问我,数据结构与算法应该要学习到哪个程度呢?,说实话,这个问题我不知道要怎么回答你,主要取决于你想学习到哪些程度,不过针对这个问题,我稍微总结一下我学过的算法知识点,以及我觉得值得学习的算法。这些算法与数据结构的学习大多数是零散的,并没有一本把他们全部覆盖的书籍。下面是我觉得值得学习的一些算法以及数据结构,当然,我也会整理一些看过
Python——画一棵漂亮的樱花树(不同种樱花+玫瑰+圣诞树喔)
最近翻到一篇知乎,上面有不少用Python(大多是turtle库)绘制的树图,感觉很漂亮,我整理了一下,挑了一些我觉得不错的代码分享给大家(这些我都测试过,确实可以生成喔~) one 樱花树 动态生成樱花 效果图(这个是动态的): 实现代码 import turtle as T import random import time # 画樱花的躯干(60,t) def Tree(branch
linux系列之常用运维命令整理笔录
本博客记录工作中需要的linux运维命令,大学时候开始接触linux,会一些基本操作,可是都没有整理起来,加上是做开发,不做运维,有些命令忘记了,所以现在整理成博客,当然vi,文件操作等就不介绍了,慢慢积累一些其它拓展的命令,博客不定时更新 顺便拉下票,我在参加csdn博客之星竞选,欢迎投票支持,每个QQ或者微信每天都可以投5票,扫二维码即可,http://m234140.nofollow.ax.
Python 基础(一):入门必备知识
目录1 标识符2 关键字3 引号4 编码5 输入输出6 缩进7 多行8 注释9 数据类型10 运算符10.1 常用运算符10.2 运算符优先级 1 标识符 标识符是编程时使用的名字,用于给变量、函数、语句块等命名,Python 中标识符由字母、数字、下划线组成,不能以数字开头,区分大小写。 以下划线开头的标识符有特殊含义,单下划线开头的标识符,如:_xxx ,表示不能直接访问的类属性,需通过类提供
深度学习图像算法在内容安全领域的应用
互联网给人们生活带来便利的同时也隐含了大量不良信息,防范互联网平台有害内容传播引起了多方面的高度关注。本次演讲从技术层面分享网易易盾在内容安全领域的算法实践经验,包括深度学习图
程序员接私活怎样防止做完了不给钱?
首先跟大家说明一点,我们做 IT 类的外包开发,是非标品开发,所以很有可能在开发过程中会有这样那样的需求修改,而这种需求修改很容易造成扯皮,进而影响到费用支付,甚至出现做完了项目收不到钱的情况。 那么,怎么保证自己的薪酬安全呢? 我们在开工前,一定要做好一些证据方面的准备(也就是“讨薪”的理论依据),这其中最重要的就是需求文档和验收标准。一定要让需求方提供这两个文档资料作为开发的基础。之后开发
网页实现一个简单的音乐播放器(大佬别看。(⊙﹏⊙))
今天闲着无事,就想写点东西。然后听了下歌,就打算写个播放器。 于是乎用h5 audio的加上js简单的播放器完工了。 欢迎 改进 留言。 演示地点跳到演示地点 html代码如下`&lt;!DOCTYPE html&gt; &lt;html&gt; &lt;head&gt; &lt;title&gt;music&lt;/title&gt; &lt;meta charset="utf-8"&gt
Python十大装B语法
Python 是一种代表简单思想的语言,其语法相对简单,很容易上手。不过,如果就此小视 Python 语法的精妙和深邃,那就大错特错了。本文精心筛选了最能展现 Python 语法之精妙的十个知识点,并附上详细的实例代码。如能在实战中融会贯通、灵活使用,必将使代码更为精炼、高效,同时也会极大提升代码B格,使之看上去更老练,读起来更优雅。 1. for - else 什么?不是 if 和 else 才
数据库优化 - SQL优化
前面一篇文章从实例的角度进行数据库优化,通过配置一些参数让数据库性能达到最优。但是一些“不好”的SQL也会导致数据库查询变慢,影响业务流程。本文从SQL角度进行数据库优化,提升SQL运行效率。 判断问题SQL 判断SQL是否有问题时可以通过两个表象进行判断: 系统级别表象 CPU消耗严重 IO等待严重 页面响应时间过长
2019年11月中国大陆编程语言排行榜
2019年11月2日,我统计了某招聘网站,获得有效程序员招聘数据9万条。针对招聘信息,提取编程语言关键字,并统计如下: 编程语言比例 rank pl_ percentage 1 java 33.62% 2 c/c++ 16.42% 3 c_sharp 12.82% 4 javascript 12.31% 5 python 7.93% 6 go 7.25% 7
通俗易懂地给女朋友讲:线程池的内部原理
餐厅的约会 餐盘在灯光的照耀下格外晶莹洁白,女朋友拿起红酒杯轻轻地抿了一小口,对我说:“经常听你说线程池,到底线程池到底是个什么原理?”我楞了一下,心里想女朋友今天是怎么了,怎么突然问出这么专业的问题,但做为一个专业人士在女朋友面前也不能露怯啊,想了一下便说:“我先给你讲讲我前同事老王的故事吧!” 大龄程序员老王 老王是一个已经北漂十多年的程序员,岁数大了,加班加不动了,升迁也无望,于是拿着手里
经典算法(5)杨辉三角
杨辉三角 是经典算法,这篇博客对它的算法思想进行了讲解,并有完整的代码实现。
腾讯算法面试题:64匹马8个跑道需要多少轮才能选出最快的四匹?
昨天,有网友私信我,说去阿里面试,彻底的被打击到了。问了为什么网上大量使用ThreadLocal的源码都会加上private static?他被难住了,因为他从来都没有考虑过这个问题。无独有偶,今天笔者又发现有网友吐槽了一道腾讯的面试题,我们一起来看看。 腾讯算法面试题:64匹马8个跑道需要多少轮才能选出最快的四匹? 在互联网职场论坛,一名程序员发帖求助到。二面腾讯,其中一个算法题:64匹
面试官:你连RESTful都不知道我怎么敢要你?
面试官:了解RESTful吗? 我:听说过。 面试官:那什么是RESTful? 我:就是用起来很规范,挺好的 面试官:是RESTful挺好的,还是自我感觉挺好的 我:都挺好的。 面试官:… 把门关上。 我:… 要干嘛?先关上再说。 面试官:我说出去把门关上。 我:what ?,夺门而去 文章目录01 前言02 RESTful的来源03 RESTful6大原则1. C-S架构2. 无状态3.统一的接
为啥国人偏爱Mybatis,而老外喜欢Hibernate/JPA呢?
关于SQL和ORM的争论,永远都不会终止,我也一直在思考这个问题。昨天又跟群里的小伙伴进行了一番讨论,感触还是有一些,于是就有了今天这篇文。 声明:本文不会下关于Mybatis和JPA两个持久层框架哪个更好这样的结论。只是摆事实,讲道理,所以,请各位看官勿喷。 一、事件起因 关于Mybatis和JPA孰优孰劣的问题,争论已经很多年了。一直也没有结论,毕竟每个人的喜好和习惯是大不相同的。我也看
项目中的if else太多了,该怎么重构?
介绍 最近跟着公司的大佬开发了一款IM系统,类似QQ和微信哈,就是聊天软件。我们有一部分业务逻辑是这样的 if (msgType = "文本") { // dosomething } else if(msgType = "图片") { // doshomething } else if(msgType = "视频") { // doshomething } else { // doshom...
致 Python 初学者
欢迎来到“Python进阶”专栏!来到这里的每一位同学,应该大致上学习了很多 Python 的基础知识,正在努力成长的过程中。在此期间,一定遇到了很多的困惑,对未来的学习方向感到迷茫。我非常理解你们所面临的处境。我从2007年开始接触 python 这门编程语言,从2009年开始单一使用 python 应对所有的开发工作,直至今天。回顾自己的学习过程,也曾经遇到过无数的困难,也曾经迷茫过、困惑过。开办这个专栏,正是为了帮助像我当年一样困惑的 Python 初学者走出困境、快速成长。希望我的经验能真正帮到你
Python 编程实用技巧
Python是一门很灵活的语言,也有很多实用的方法,有时候实现一个功能可以用多种方法实现,我这里总结了一些常用的方法,并会持续更新。
“狗屁不通文章生成器”登顶GitHub热榜,分分钟写出万字形式主义大作
一、垃圾文字生成器介绍 最近在浏览GitHub的时候,发现了这样一个骨骼清奇的雷人项目,而且热度还特别高。 项目中文名:狗屁不通文章生成器 项目英文名:BullshitGenerator 根据作者的介绍,他是偶尔需要一些中文文字用于GUI开发时测试文本渲染,因此开发了这个废话生成器。但由于生成的废话实在是太过富于哲理,所以最近已经被小伙伴们给玩坏了。 他的文风可能是这样的: 你发现,...
程序员:我终于知道post和get的区别
是一个老生常谈的话题,然而随着不断的学习,对于以前的认识有很多误区,所以还是需要不断地总结的,学而时习之,不亦说乎
"狗屁不通文章生成器"登顶GitHub热榜,分分钟写出万字形式主义大作
GitHub 被誉为全球最大的同性交友网站,……,陪伴我们已经走过 10+ 年时间,它托管了大量的软件代码,同时也承载了程序员无尽的欢乐。 万字申请,废话报告,魔幻形式主义大作怎么写?兄dei,狗屁不通文章生成器了解一下。这个富有灵魂的项目名吸引了众人的目光。项目仅仅诞生一周,便冲上了GitHub趋势榜榜首(Js中文网 -前端进阶资源教程)、是榜首哦
推荐几款比较实用的工具,网站
1.盘百度PanDownload 这个云盘工具是免费的,可以进行资源搜索,提速(偶尔会抽风????) 不要去某站买付费的???? PanDownload下载地址 2.BeJSON 这是一款拥有各种在线工具的网站,推荐它的主要原因是网站简洁,功能齐全,广告相比其他广告好太多了 bejson网站 3.二维码美化 这个网站的二维码美化很好看,网站界面也很...
《程序人生》系列-这个程序员只用了20行代码就拿了冠军
你知道的越多,你不知道的越多 点赞再看,养成习惯GitHub上已经开源https://github.com/JavaFamily,有一线大厂面试点脑图,欢迎Star和完善 前言 这一期不算《吊打面试官》系列的,所有没前言我直接开始。 絮叨 本来应该是没有这期的,看过我上期的小伙伴应该是知道的嘛,双十一比较忙嘛,要值班又要去帮忙拍摄年会的视频素材,还得搞个程序员一天的Vlog,还要写BU...
相关热词 c# 输入ip c# 乱码 报表 c#选择结构应用基本算法 c# 收到udp包后回包 c#oracle 头文件 c# 序列化对象 自定义 c# tcp 心跳 c# ice连接服务端 c# md5 解密 c# 文字导航控件
立即提问