安装Redis时,出现错误

在Windows下安装Redis时,输入C:>Redis\redis\redis-server.exe redis.windows.conf,出现Invalid argument during startup: Failed to open the .conf file: redis.windows.conf CWD=C:\错误,怎么解决啊?图片说明

4个回答

选用绿色版的,不需要安装呀

我使用时也出现过这种情况。
方法一:
找不到配置文件,那么你就指出配置文件位置
命令: ./redis-server [/path/to/redis.conf] [options]

分析:你应该下载的是zip版本,需要自己进行一些环境配置的。

方法二:
重新下载windows .msi版本的。(推荐)
就是直接点击安装,自动配置好了环境。非常简单。

apeit-程序猿IT中redis的文章由浅入深,非常适合入门学习。

这是因为你没有切换到C:\Redis\redis>目录下执行,系统默认在C:>下查找你的redis.windows.conf文件,这显然是找不到的。你可以这样执行
(在C:>目录):Redis\redis\redis-server.exe .\Redis\redis\redis.windows.conf,图片说明
;也可以参考图片图片说明,还可以参考这个网站(笔者试过,一次成功):http://www.runoob.com/redis/redis-install.html
(图片中左右是两个同时打开的cmd命令行,左边充当服务器,右边充当客户端)

系统告诉你了是参数配置问题啊

Csdn user default icon
上传中...
上传图片
插入图片
抄袭、复制答案,以达到刷声望分或其他目的的行为,在CSDN问答是严格禁止的,一经发现立刻封号。是时候展现真正的技术了!
其他相关推荐
安装redis时出现的错误
在安装redis时出现了一些没见过错误:第一1 Redis为c语言编写,因此安装需要配置c语言编译环境gcc,查看linux是否安装了该编译环境,可以直接输入命令查看如下图所示:而如果提示commond not find则意味着本机并无该环境,因此需要安装gcc环境,采用yum install gcc-c++执行进行安装,然后上传redis的安装包,并解压(别忘了关闭防火墙哦)。然后当你输入命令m...
cnetos6.3安装redis出现的错误
[root@hft redis-3.0.4]# make MALLOC=libcrncd src && make allrnmake[1]: Entering directory `/opt/redis-3.0.4/src'rnrm -rf redis-server redis-sentinel redis-cli redis-benchmark redis-check-dump redis-check-aof *.o *.gcda *.gcno *.gcov redis.info lcov-htmlrn(cd ../deps && make distclean)rnmake[2]: Entering directory `/opt/redis-3.0.4/deps'rn(cd hiredis && make clean) > /dev/null || truern(cd linenoise && make clean) > /dev/null || truern(cd lua && make clean) > /dev/null || truern(cd jemalloc && [ -f Makefile ] && make distclean) > /dev/null || truern(rm -f .make-*)rnmake[2]: Leaving directory `/opt/redis-3.0.4/deps'rn(rm -f .make-*)rnecho STD=-std=c99 -pedantic >> .make-settingsrnecho WARN=-Wall -W >> .make-settingsrnecho OPT=-O2 >> .make-settingsrnecho MALLOC=libc >> .make-settingsrnecho CFLAGS= >> .make-settingsrnecho LDFLAGS= >> .make-settingsrnecho REDIS_CFLAGS= >> .make-settingsrnecho REDIS_LDFLAGS= >> .make-settingsrnecho PREV_FINAL_CFLAGS=-std=c99 -pedantic -Wall -W -O2 -g -ggdb -I../deps/hiredis -I../deps/linenoise -I../deps/lua/src >> .make-settingsrnecho PREV_FINAL_LDFLAGS= -g -ggdb -rdynamic >> .make-settingsrn(cd ../deps && make hiredis linenoise lua)rnmake[2]: Entering directory `/opt/redis-3.0.4/deps'rn(cd hiredis && make clean) > /dev/null || truern(cd linenoise && make clean) > /dev/null || truern(cd lua && make clean) > /dev/null || truern(cd jemalloc && [ -f Makefile ] && make distclean) > /dev/null || truern(rm -f .make-*)rn(echo "" > .make-ldflags)rn(echo "" > .make-cflags)rnMAKE hiredisrncd hiredis && make staticrnmake[3]: Entering directory `/opt/redis-3.0.4/deps/hiredis'rncc -std=c99 -pedantic -c -O3 -fPIC -Wall -W -Wstrict-prototypes -Wwrite-strings -g -ggdb net.crnIn file included from net.h:36,rn from net.c:51:rnhiredis.h:103: 错误:expected specifier-qualifier-list before ‘size_t’rnhiredis.h:117: 错误:expected declaration specifiers or ‘...’ before ‘size_t’rnhiredis.h:130: 错误:expected specifier-qualifier-list before ‘size_t’rnhiredis.h:145: 错误:expected declaration specifiers or ‘...’ before ‘size_t’rnhiredis.h:163: 警告:在‘size_t’的声明中,类型默认为‘int’rnhiredis.h:163: 错误:expected ‘;’, ‘,’ or ‘)’ before ‘*’ tokenrnhiredis.h:176: 警告:‘struct timeval’在形参表内部声明rnhiredis.h:176: 警告:它的作用域仅限于此定义或声明,这可能并不是您想要的rnhiredis.h:180: 警告:‘struct timeval’在形参表内部声明rnhiredis.h:183: 警告:‘struct timeval’在形参表内部声明rnhiredis.h:199: 错误:expected declaration specifiers or ‘...’ before ‘size_t’rnhiredis.h:205: 警告:在‘size_t’的声明中,类型默认为‘int’rnhiredis.h:205: 错误:expected ‘;’, ‘,’ or ‘)’ before ‘*’ tokenrnhiredis.h:214: 警告:在‘size_t’的声明中,类型默认为‘int’rnhiredis.h:214: 错误:expected ‘;’, ‘,’ or ‘)’ before ‘*’ tokenrnIn file included from net.c:51:rnnet.h:43: 警告:‘struct timeval’在形参表内部声明rnnet.h:44: 警告:‘struct timeval’在形参表内部声明rnnet.h:47: 警告:‘struct timeval’在形参表内部声明rnnet.h:48: 警告:‘struct timeval’在形参表内部声明rnIn file included from net.c:52:rnsds.h:47: 错误:expected ‘=’, ‘,’, ‘;’, ‘asm’ or ‘__attribute__’ before ‘sdslen’rnsds.h:52: 错误:expected ‘=’, ‘,’, ‘;’, ‘asm’ or ‘__attribute__’ before ‘sdsavail’rnsds.h:57: 错误:expected declaration specifiers or ‘...’ before ‘size_t’rnsds.h:60: 错误:expected ‘=’, ‘,’, ‘;’, ‘asm’ or ‘__attribute__’ before ‘sdslen’rnsds.h:63: 错误:expected ‘=’, ‘,’, ‘;’, ‘asm’ or ‘__attribute__’ before ‘sdsavail’rnsds.h:64: 错误:expected declaration specifiers or ‘...’ before ‘size_t’rnsds.h:65: 错误:expected declaration specifiers or ‘...’ before ‘size_t’rnsds.h:68: 错误:expected declaration specifiers or ‘...’ before ‘size_t’rnsds.h:90: 错误:expected declaration specifiers or ‘...’ before ‘size_t’rnsds.h:92: 错误:expected declaration specifiers or ‘...’ before ‘size_t’rnsds.h:96: 错误:expected declaration specifiers or ‘...’ before ‘size_t’rnsds.h:99: 错误:expected ‘=’, ‘,’, ‘;’, ‘asm’ or ‘__attribute__’ before ‘sdsAllocSize’rnnet.c: 在函数‘redisContextCloseFd’中:rnnet.c:59: 警告:隐式声明函数‘close’rnnet.c: 在函数‘__redisSetErrorFromErrno’中:rnnet.c:66: 错误:‘size_t’未声明(在此函数内第一次使用)rnnet.c:66: 错误:(即使在一个函数内多次出现,每个未声明的标识符在其rnnet.c:66: 错误:所在的函数内也只报告一次。)rnnet.c:66: 错误:expected ‘;’ before ‘len’rnnet.c:68: 错误:‘NULL’未声明(在此函数内第一次使用)rnnet.c:69: 错误:‘len’未声明(在此函数内第一次使用)rnnet.c:69: 警告:隐式声明函数‘snprintf’rnnet.c:69: 警告:隐式声明与内建函数‘snprintf’不兼容rnnet.c:70: 警告:隐式声明函数‘strerror_r’rnnet.c:70: 错误:‘errno’未声明(在此函数内第一次使用)rnnet.c: 在函数‘redisSetReuseAddr’中:rnnet.c:76: 警告:隐式声明函数‘setsockopt’rnnet.c:76: 错误:‘SOL_SOCKET’未声明(在此函数内第一次使用)rnnet.c:76: 错误:‘SO_REUSEADDR’未声明(在此函数内第一次使用)rnnet.c:77: 错误:‘NULL’未声明(在此函数内第一次使用)rnnet.c: 在函数‘redisCreateSocket’中:rnnet.c:86: 警告:隐式声明函数‘socket’rnnet.c:86: 错误:‘SOCK_STREAM’未声明(在此函数内第一次使用)rnnet.c:87: 错误:‘NULL’未声明(在此函数内第一次使用)rnnet.c:91: 错误:‘AF_INET’未声明(在此函数内第一次使用)rnnet.c: 在函数‘redisSetBlocking’中:rnnet.c:105: 警告:隐式声明函数‘fcntl’rnnet.c:105: 错误:‘F_GETFL’未声明(在此函数内第一次使用)rnnet.c:112: 错误:‘O_NONBLOCK’未声明(在此函数内第一次使用)rnnet.c:116: 错误:‘F_SETFL’未声明(在此函数内第一次使用)rnnet.c: 在函数‘redisKeepAlive’中:rnnet.c:128: 错误:‘SOL_SOCKET’未声明(在此函数内第一次使用)rnnet.c:128: 错误:‘SO_KEEPALIVE’未声明(在此函数内第一次使用)rnnet.c:129: 警告:隐式声明函数‘strerror’rnnet.c:129: 错误:‘errno’未声明(在此函数内第一次使用)rnnet.c:143: 错误:‘IPPROTO_TCP’未声明(在此函数内第一次使用)rnnet.c:143: 错误:‘TCP_KEEPIDLE’未声明(在此函数内第一次使用)rnnet.c:150: 错误:‘TCP_KEEPINTVL’未声明(在此函数内第一次使用)rnnet.c:156: 错误:‘TCP_KEEPCNT’未声明(在此函数内第一次使用)rnnet.c: 在函数‘redisSetTcpNoDelay’中:rnnet.c:168: 错误:‘IPPROTO_TCP’未声明(在此函数内第一次使用)rnnet.c:168: 错误:‘TCP_NODELAY’未声明(在此函数内第一次使用)rnnet.c: 在文件层:rnnet.c:178: 警告:‘struct timeval’在形参表内部声明rnnet.c: 在函数‘redisContextWaitReady’中:rnnet.c:179: 错误:数组元素的类型不完全rnnet.c:184: 错误:‘POLLOUT’未声明(在此函数内第一次使用)rnnet.c:187: 错误:‘NULL’未声明(在此函数内第一次使用)rnnet.c:188: 错误:提领指向不完全类型的指针rnnet.c:188: 错误:提领指向不完全类型的指针rnnet.c:194: 错误:提领指向不完全类型的指针rnnet.c:194: 错误:提领指向不完全类型的指针rnnet.c:201: 错误:‘errno’未声明(在此函数内第一次使用)rnnet.c:201: 错误:‘EINPROGRESS’未声明(在此函数内第一次使用)rnnet.c:204: 警告:隐式声明函数‘poll’rnnet.c:209: 错误:‘ETIMEDOUT’未声明(在此函数内第一次使用)rnnet.c:179: 警告:未使用的变量‘wfd’rnnet.c: 在函数‘redisCheckSocketError’中:rnnet.c:228: 错误:‘socklen_t’未声明(在此函数内第一次使用)rnnet.c:228: 错误:expected ‘;’ before ‘errlen’rnnet.c:230: 警告:隐式声明函数‘getsockopt’rnnet.c:230: 错误:‘SOL_SOCKET’未声明(在此函数内第一次使用)rnnet.c:230: 错误:‘SO_ERROR’未声明(在此函数内第一次使用)rnnet.c:230: 错误:‘errlen’未声明(在此函数内第一次使用)rnnet.c:236: 错误:‘errno’未声明(在此函数内第一次使用)rnnet.c:237: 错误:‘NULL’未声明(在此函数内第一次使用)rnnet.c: 在文件层:rnnet.c:244: 警告:‘struct timeval’在形参表内部声明rnnet.c:244: 错误:形参 2 (‘tv’) 的类型不完全rnnet.c: 在函数‘redisContextSetTimeout’中:rnnet.c:245: 错误:‘SOL_SOCKET’未声明(在此函数内第一次使用)rnnet.c:245: 错误:‘SO_RCVTIMEO’未声明(在此函数内第一次使用)rnnet.c:249: 错误:‘SO_SNDTIMEO’未声明(在此函数内第一次使用)rnnet.c:244: 警告:未使用的参数‘tv’rnnet.c: 在文件层:rnnet.c:258: 警告:‘struct timeval’在形参表内部声明rnnet.c: 在函数‘_redisContextConnectTcp’中:rnnet.c:261: 错误:‘hints’的存储大小未知rnnet.c:264: 警告:隐式声明与内建函数‘snprintf’不兼容rnnet.c:265: 警告:隐式声明函数‘memset’rnnet.c:265: 警告:隐式声明与内建函数‘memset’不兼容rnnet.c:266: 错误:‘AF_INET’未声明(在此函数内第一次使用)rnnet.c:267: 错误:‘SOCK_STREAM’未声明(在此函数内第一次使用)rnnet.c:274: 警告:隐式声明函数‘getaddrinfo’rnnet.c:275: 错误:‘AF_INET6’未声明(在此函数内第一次使用)rnnet.c:277: 警告:隐式声明函数‘gai_strerror’rnnet.c:277: 警告:传递‘__redisSetError’的第 3 个参数时将整数赋给指针,未作类型转换rnnet.c:55: 附注:需要类型‘const char *’,但实参的类型为‘int’rnnet.c:281: 错误:‘NULL’未声明(在此函数内第一次使用)rnnet.c:281: 错误:提领指向不完全类型的指针rnnet.c:282: 错误:提领指向不完全类型的指针rnnet.c:282: 错误:提领指向不完全类型的指针rnnet.c:282: 错误:提领指向不完全类型的指针rnnet.c:293: 警告:格式‘%s’需要类型‘char *’,但实参 4 的类型为‘int’rnnet.c:297: 错误:提领指向不完全类型的指针rnnet.c:298: 警告:隐式声明函数‘bind’rnnet.c:298: 错误:提领指向不完全类型的指针rnnet.c:298: 错误:提领指向不完全类型的指针rnnet.c:303: 警告:隐式声明函数‘freeaddrinfo’rnnet.c:306: 错误:‘errno’未声明(在此函数内第一次使用)rnnet.c:311: 警告:隐式声明函数‘connect’rnnet.c:311: 错误:提领指向不完全类型的指针rnnet.c:311: 错误:提领指向不完全类型的指针rnnet.c:312: 错误:‘EHOSTUNREACH’未声明(在此函数内第一次使用)rnnet.c:315: 错误:‘EINPROGRESS’未声明(在此函数内第一次使用)rnnet.c:318: 警告:传递‘redisContextWaitReady’的第 2 个参数时在不兼容的指针类型间转换rnnet.c:178: 附注:需要类型‘const struct timeval *’,但实参的类型为‘const struct timeval *’rnnet.c:261: 警告:未使用的变量‘hints’rnnet.c: 在文件层:rnnet.c:346: 警告:‘struct timeval’在形参表内部声明rnnet.c:345: 错误:与‘redisContextConnectTcp’类型冲突rnnet.h:44: 附注:‘redisContextConnectTcp’的上一个声明在此rnnet.c: 在函数‘redisContextConnectTcp’中:rnnet.c:347: 错误:‘NULL’未声明(在此函数内第一次使用)rnnet.c:347: 警告:传递‘_redisContextConnectTcp’的第 4 个参数时在不兼容的指针类型间转换rnnet.c:256: 附注:需要类型‘const struct timeval *’,但实参的类型为‘const struct timeval *’rnnet.c: 在文件层:rnnet.c:352: 警告:‘struct timeval’在形参表内部声明rnnet.c:350: 错误:与‘redisContextConnectBindTcp’类型冲突rnnet.h:45: 附注:‘redisContextConnectBindTcp’的上一个声明在此rnnet.c: 在函数‘redisContextConnectBindTcp’中:rnnet.c:353: 警告:传递‘_redisContextConnectTcp’的第 4 个参数时在不兼容的指针类型间转换rnnet.c:256: 附注:需要类型‘const struct timeval *’,但实参的类型为‘const struct timeval *’rnnet.c: 在文件层:rnnet.c:356: 警告:‘struct timeval’在形参表内部声明rnnet.c:356: 错误:与‘redisContextConnectUnix’类型冲突rnnet.h:48: 附注:‘redisContextConnectUnix’的上一个声明在此rnnet.c: 在函数‘redisContextConnectUnix’中:rnnet.c:358: 错误:‘sa’的存储大小未知rnnet.c:360: 错误:‘AF_LOCAL’未声明(在此函数内第一次使用)rnnet.c:366: 警告:隐式声明函数‘strncpy’rnnet.c:366: 警告:隐式声明与内建函数‘strncpy’不兼容rnnet.c:368: 错误:‘errno’未声明(在此函数内第一次使用)rnnet.c:368: 错误:‘EINPROGRESS’未声明(在此函数内第一次使用)rnnet.c:371: 警告:传递‘redisContextWaitReady’的第 2 个参数时在不兼容的指针类型间转换rnnet.c:178: 附注:需要类型‘const struct timeval *’,但实参的类型为‘const struct timeval *’rnnet.c:358: 警告:未使用的变量‘sa’rnmake[3]: *** [net.o] 错误 1rnmake[3]: Leaving directory `/opt/redis-3.0.4/deps/hiredis'rnmake[2]: *** [hiredis] 错误 2rnmake[2]: Leaving directory `/opt/redis-3.0.4/deps'rnmake[1]: [persist-settings] 错误 2 (忽略)rn CC adlist.ornIn file included from adlist.c:34:rnzmalloc.h:68: 错误:expected ‘)’ before ‘size’rnzmalloc.h:69: 错误:expected ‘)’ before ‘size’rnzmalloc.h:70: 错误:expected declaration specifiers or ‘...’ before ‘size_t’rnzmalloc.h:73: 错误:expected ‘=’, ‘,’, ‘;’, ‘asm’ or ‘__attribute__’ before ‘zmalloc_used_memory’rnzmalloc.h:75: 警告:函数声明中出现形参名却未指定类型rnzmalloc.h:76: 错误:expected ‘)’ before ‘rss’rnzmalloc.h:77: 错误:expected ‘=’, ‘,’, ‘;’, ‘asm’ or ‘__attribute__’ before ‘zmalloc_get_rss’rnzmalloc.h:78: 错误:expected ‘=’, ‘,’, ‘;’, ‘asm’ or ‘__attribute__’ before ‘zmalloc_get_private_dirty’rnzmalloc.h:79: 错误:expected ‘=’, ‘,’, ‘;’, ‘asm’ or ‘__attribute__’ before ‘zmalloc_get_smap_bytes_by_field’rnzmalloc.h:83: 错误:expected ‘=’, ‘,’, ‘;’, ‘asm’ or ‘__attribute__’ before ‘zmalloc_size’rnadlist.c: 在函数‘listCreate’中:rnadlist.c:45: 警告:隐式声明函数‘zmalloc’rnadlist.c:45: 警告:赋值时将整数赋给指针,未作类型转换rnadlist.c:45: 错误:‘NULL’未声明(在此函数内第一次使用)rnadlist.c:45: 错误:(即使在一个函数内多次出现,每个未声明的标识符在其rnadlist.c:45: 错误:所在的函数内也只报告一次。)rn...rnmake[1]: *** [adlist.o] 错误 1rnmake[1]: Leaving directory `/opt/redis-3.0.4/src'rnmake: *** [all] 错误 2rnrnrn
安装时出现了错误
1、无法装载与语言相关的资源文件rn2、search stp.exe应用程序初始化失败rnrnsql server2000标准版,win2000 serverrn
安装Duwamish7.0时出现错误
由于安装它时要用到Sql Server,于是我开启它的服务。结果出现“由于登录失败而无法启动服务解决”,怎么会登录失败的?
打包安装时出现的错误
我在制作VB安装程序的时候经常会出现这样的错误,今天它又出现了,很是令我烦恼,很希望各位网友可以帮我解决一下。我的问题是这样的:我在安装程序快要结束的时候就出现这样的错误rn注册文件c:\winnt\system32\msado20.tlb时出错rn不知道其它的网友是否遇到过这类的问题,总之我有许多的朋友和同事都遇到过这样的问题,如果有哪位高手可以帮助解决一下,那本人将万分的感激!!!
安装SQL2008时出现错误
请问:安装SQL2008时出现:rn规则"性能计数器注册表配置单元一致性"失败rnrn怎么解决???????rnrn我是先安装vs2008rn然后卸载了其中自带的SQLrn在然后来安装SQL2008就出现了上面的错误了rnrn请问哪位大虾能帮帮我啦
安装SQL时出现错误!
安装SQL Service时,我选择了安装ReportService,但是在安装过程中出现了rn“正在设置report service排除路径期间遇到错误。错误为:安装时发生严重错误”的错误提示,还怎么解决呢,求给为大侠帮帮忙啊!rn另外的我操作系统的WIN7!
安装MYSQL时出现错误
[img=https://img-bbs.csdn.net/upload/201409/10/1410359246_419342.png][/img]
安装SQLServer2005时出现错误
安装SQLServer2005时出现错误,提示无法启动MSSQLServer服务安装,取消弹出框之后继续完成后登录时不显示服务器名称???rn![图片说明](https://img-ask.csdn.net/upload/201606/15/1465953441_348133.png)rnrn怎么回事??rn
在安装TortoiseSVN 时出现错误
安装环境win7homebasic,在安装TortoiseSVN 1.6.11.20210(32 bit)时出现下列错误:rnrnInstaller InformationrnAn error occured during the installation of assembly componentrnAFA31654-361E-33B5-9ED5-049A6889325CrnHRESULT:0x800736B3rnrn我该怎么解决
oracel安装时出现的错误
找不到文件 F:\app\Administrator\product\11.2.0\dbhome_1\oc4j\j2ee\oc4j_applications\applications\em.earrnrn请问出现上述问题是何故?
安装QT4时,出现错误!!!!!
这些错误对编程有影响吗????rn[img=http://album.hi.csdn.net/app_uploads/haoshen1987/20090805/073826793.p.JPG?d=20090805073836138][/img]rn
安装c++builder时出现的错误
每次我安装的时候总是出现disk1\instal\common\borland shared\MSHelp\95guide.cat这样的错误rn请问这是怎么回事,谁能告诉我该怎么做才能安装好.rn谢谢!!!!!
安装solaris10时出现错误
安装solaris10时出现错误,使用光盘启动,结果出现:rnSolaris Primary Boot SubsystemrnCannot find boot.bin.rn请问这是为什么?
安装rdesktop时出现错误
[root@localhost Packages]# rpm -ivh rdesktop-1.6.0-8.el6.i686.rpmrnwarning: rdesktop-1.6.0-8.el6.i686.rpm: Header V3 RSA/SHA256 Signature, key ID fd431d51: NOKEYrnerror: Failed dependencies:rn libao-devel is needed by rdesktop-1.6.0-8.el6.i686rn libpcsclite.so.1 is needed by rdesktop-1.6.0-8.el6.i686rn pcsc-lite is needed by rdesktop-1.6.0-8.el6.i686rn
安装VMWare时出现的错误
一、第一个问题 尝试创建目录 C:\Public\documents\SharedVirtual Machines时发生错误如图: 这个问题的解决方法我竟然在网上找不到,然后我突发奇想,既然无法创建这个目录,那我帮你创建一个不就好了,然后我就手动创建了一个,没想到竟然不报错了,后来想了想,可能是文件夹权限的问题,不过已经解决了,我就没有尝试,有兴趣的可以试一试是不是权限问题。 二、第...
安装cocoapods时出现的错误
安装cocoapods时出现的错误: 换了个mac本,在上面安装 cocoapods时,输入了sudo gem install cocoapods命后,结果出现了一句话:Error installing pods:activesupport requires Ruby version >= 2.2.2.这句话的意思就是:你要安装 cocoapods. 你的 Ruby 环境版本必须大于等
安装xmms2时出现错误
刚下了个xmms2的rpm包,解压后执行,出现了下面的错误:rnrnrn[xlyz@localhost Download]$ cd xmmsrn[xlyz@localhost xmms]$ lsrnglib-devel-1.2.10-26.fc7.i386.rpm gtk+-devel-1.2.10-57.fc7.i386.rpm xmms-1.2.10-1.i386.rpm xmms-debuginfo-1.2.10-1.i386.rpm xmms-devel-1.2.10-1.i386.rpmrn[xlyz@localhost xmms]$ rpm -ivh *.rpmrnwarning: glib-devel-1.2.10-26.fc7.i386.rpm: Header V3 DSA signature: NOKEY, key ID 4f2a6fd2rnerror: Failed dependencies:rn glib = 1:1.2.10-26.fc7 is needed by glib-devel-1:1.2.10-26.fc7.i386rn libglib-1.2.so.0 is needed by glib-devel-1:1.2.10-26.fc7.i386rn libgmodule-1.2.so.0 is needed by glib-devel-1:1.2.10-26.fc7.i386rn libgthread-1.2.so.0 is needed by glib-devel-1:1.2.10-26.fc7.i386rn gtk+ = 1:1.2.10-57.fc7 is needed by gtk+-devel-1:1.2.10-57.fc7.i386rn libX11-devel is needed by gtk+-devel-1:1.2.10-57.fc7.i386rn libXext-devel is needed by gtk+-devel-1:1.2.10-57.fc7.i386rn libXi-devel is needed by gtk+-devel-1:1.2.10-57.fc7.i386rn libXt-devel is needed by gtk+-devel-1:1.2.10-57.fc7.i386rn libgdk-1.2.so.0 is needed by gtk+-devel-1:1.2.10-57.fc7.i386rn libgtk-1.2.so.0 is needed by gtk+-devel-1:1.2.10-57.fc7.i386rn gtk+ >= 1:1.2.2 is needed by xmms-1:1.2.10-1.i386rn libgdk-1.2.so.0 is needed by xmms-1:1.2.10-1.i386rn libglib-1.2.so.0 is needed by xmms-1:1.2.10-1.i386rn libgmodule-1.2.so.0 is needed by xmms-1:1.2.10-1.i386rn libgthread-1.2.so.0 is needed by xmms-1:1.2.10-1.i386rn libgtk-1.2.so.0 is needed by xmms-1:1.2.10-1.i386rnrnrn我用的系统是federa10,安装软件的时候总是出现依赖的库有问题。rnrn熟悉的 帮个忙,谢谢。我实在是被linux 里面的库依赖性搞怕了。rnrnrnrnrn
安装oracle时出现错误
急急急急急急,我在安装oracle9i时,出现下面错误请问该怎么解决:"装载数据库时发生错误:areasQueries"请大家帮忙。
zabbix安装时出现的错误
问题根源:    在zabbix服务端进行安装的过程中安装zabbix-server-mysql的过程中出现            根据提示执行以下命令并未得到解决yum install -y zabbix-server-mysql --skip-brokenrpm -Va --nofiles --nodigest 解决方案:    根据错误提示,需要安装fping命令这个依赖,在进行yum安装...
安装msdn时出现错误
今天重装msdn到100%的时候出现:OpenCollection g_ccolCollection.open(C:\Program Files\Microsoft Visual Studio\MSDN\2001JAN\1033\MSDN100.COL)dwERROR=8.错误. rnrnrn注:我前天给卸载的时候一时没有找到卸载程序,就索性直接将文件给删了,不知道是这缘故吗,要怎么解决?rnrn还请大虾帮忙。rn[img=http://hi.baidu.com/mltong2008/album/item/f43c3888a93a8fb6a4c272c5.html][/img]rnrn
安装redis服务器时,执行sudo make test时出现错误
You need tcl 8.5 or newer in order to run the Redis test Makefile:225: recipe for target ‘test’ failed make: * [test] Error 1 提示需要安装tcl,解决方法如下 wget http://downloads.sourceforge.net/tcl/tcl8.6.1-s...
安装Redis出现gcc编译环境错误,
CC adlist.orncc: error trying to exec 'cc1': execvp: 没有那个文件或目录rnmake[1]: *** [adlist.o] 错误 1rnmake[1]: Leaving directory `/usr/local/redis-4.0.2/src'rnmake: *** [all] 错误 2rn
Redis集群搭建出现的错误
1、in `call’: ERR Slot 8579 is already busy (Redis::CommandError) 在 /my_soft/Redis安装包及jar包/redis-3.0.4/src 目录下 执行redis 集群安装命令: ./redis-trib.rb create --replicas 0 192.168.3.15:6379 192.168.3.15:6380...
安装oracle10g,创建数据库时出现错误。
错误内容rnora-24324rnora-24323rnora-28547rn是不是什么配置错了?rn拜托各位大侠了rnrnrn
用npm安装package.json时出现错误
我是在win8 64bit上面操作,本来安装的nodejs是64位的,nnnpm install时一直出现错误,上网查后有说要安装32位的,而且需要安装vs,nn于是我卸载64的node又安装32的node,又安装vs2012,nn然后又npm installnn出现如下异常:nnnn```n npm WARN optional dep failed, continuing fsevents@0.3.8n\nnn> spawn-sync@1.0.13 postinstall E:\project2\shijuan\node_modules\node-sass\node_modules\sasnmodules\spawn-syncn> node postinstallnn\nnn> node-sass@3.2.0 install E:\project2\shijuan\node_modules\node-sassn> node scripts/install.jsnnBinary downloaded and installed at E:\project2\shijuan\node_modules\node-sass\vendor\win32-nnnn> node-sass@3.2.0 postinstall E:\project2\shijuan\node_modules\node-sassn> node scripts/build.jsnn` E:\project2\shijuan\node_modules\node-sass\vendor\win32-ia32-14\binding.node ` exists.n testing binary.nBinary is fine; exiting.n\nnn> bufferutil@1.1.0 install E:\project2\shijuan\node_modules\webpack-dev-server\node_modulesn> node-gyp rebuildnn|n(venv) Think@RESEARCH E:\project2\shijuan\node_modules\webpack-dev-server\node_modules\sockn> if not defined npm_config_node_gyp (node "C:\Program Files (x86)\nodejs\node_modules\npm\ne rebuild )n在此解决方案中一次生成一个项目。若要启用并行生成,请添加“/m”开关。n bufferutil.ccn 正在创建库 E:\project2\shijuan\node_modules\webpack-dev-server\node_modules\socket.io\nutiln .expb 和对象 E:\project2\shijuan\node_modules\webpack-dev-server\node_modules\socket.io\nn 正在生成代码n 已完成代码的生成n bufferutil.vcxproj -> E:\project2\shijuan\node_modules\webpack-dev-server\node_modules\son se\\bufferutil.noden|nnn> utf-8-validate@1.1.0 install E:\project2\shijuan\node_modules\webpack-dev-server\node_modnf-8-validaten> node-gyp rebuildnn/n(venv) Think@RESEARCH E:\project2\shijuan\node_modules\webpack-dev-server\node_modules\socknaten> if not defined npm_config_node_gyp (node "C:\Program Files (x86)\nodejs\node_modules\npm\ne rebuild )n在此解决方案中一次生成一个项目。若要启用并行生成,请添加“/m”开关。n validation.ccn 正在创建库 E:\project2\shijuan\node_modules\webpack-dev-server\node_modules\socket.io-nild\n Release\validation.lib 和对象 E:\project2\shijuan\node_modules\webpack-dev-server\node_montfn -8-validate\build\Release\validation.expn 正在生成代码n 已完成代码的生成n validation.vcxproj -> E:\project2\shijuan\node_modules\webpack-dev-server\node_modules\son lidate\build\Release\\validation.nodenn> utf-8-validate@1.1.0 install E:\project2\shijuan\node_modules\webpack-dev-server\node_modn> node-gyp rebuildnnn(venv) Think@RESEARCH E:\project2\shijuan\node_modules\webpack-dev-server\node_modules\sockn> if not defined npm_config_node_gyp (node "C:\Program Files (x86)\nodejs\node_modules\npm\ne rebuild )n在此解决方案中一次生成一个项目。若要启用并行生成,请添加“/m”开关。n validation.ccn 正在创建库 E:\project2\shijuan\node_modules\webpack-dev-server\node_modules\socket.io\nlidan tion.lib 和对象 E:\project2\shijuan\node_modules\webpack-dev-server\node_modules\socket.invan lidation.expn 正在生成代码n 已完成代码的生成n validation.vcxproj -> E:\project2\shijuan\node_modules\webpack-dev-server\node_modules\son elease\\validation.nodenn> bufferutil@1.1.0 install E:\project2\shijuan\node_modules\webpack-dev-server\node_modulesnutiln> node-gyp rebuildnnn(venv) Think@RESEARCH E:\project2\shijuan\node_modules\webpack-dev-server\node_modules\sockn> if not defined npm_config_node_gyp (node "C:\Program Files (x86)\nodejs\node_modules\npm\ne rebuild )n在此解决方案中一次生成一个项目。若要启用并行生成,请添加“/m”开关。n bufferutil.ccn 正在创建库 E:\project2\shijuan\node_modules\webpack-dev-server\node_modules\socket.io-nRelen ase\bufferutil.lib 和对象 E:\project2\shijuan\node_modules\webpack-dev-server\node_modulenrun til\build\Release\bufferutil.expn 正在生成代码n 已完成代码的生成n bufferutil.vcxproj -> E:\project2\shijuan\node_modules\webpack-dev-server\node_modules\son il\build\Release\\bufferutil.nodenvinyl-named@1.1.0 node_modules\vinyl-namedn└── through@2.3.8nnmanifest-revision-webpack-plugin@0.0.5 node_modules\manifest-revision-webpack-pluginn└── walk@2.3.9 (foreachasync@3.0.0)nncoffee-script@1.9.3 node_modules\coffee-scriptnnsuperagent@1.3.0 node_modules\superagentn├── extend@1.2.1n├── methods@1.0.1n├── cookiejar@2.0.1n├── component-emitter@1.1.2n├── reduce-component@1.0.1n├── mime@1.3.4n├── qs@2.3.3n├── debug@2.2.0 (ms@0.7.1)n├── readable-stream@1.0.27-1 (inherits@2.0.1, isarray@0.0.1, string_decoder@0.10.31, core-un├── formidable@1.0.14n└── form-data@0.2.0 (async@0.9.2, combined-stream@0.0.7, mime-types@2.0.14)n```nn其实看上去也成功了很多,但是前面那几个异常怎么解决呢?谢谢各位nnpackage.json如下nn```nn "repository": n "type": "git",n "url": ""n ,n "license": "MIT",n "description": "Project Shijuan",n "scripts": n "start": "node_modules/.bin/webpack-dev-server --config conf/webpack.config.js --progress --colors --port 5001 --content-base build/public",n "build": "node_modules/.bin/webpack --config conf/webpack.config.js --progress --profile --colors"n ,n "dependencies": n "amazeui": "^2.4.2",n "babel-core": "^5.4.7",n "babel-loader": "^5.1.3",n "coffee-loader": "^0.7.2",n "coffee-script": "^1.9.3",n "css-loader": "^0.15.6",n "echarts": "^2.2.7-beta7",n "extract-text-webpack-plugin": "^0.8.1",n "file-loader": "^0.8.4",n "html-loader": "^0.3.0",n "jquery": "^2.1.4",n "manifest-revision-webpack-plugin": "^0.0.5",n "node-sass": "^3.2.0",n "postcss-loader": "^0.5.1",n "sass-loader": "^2.0.0",n "style-loader": "^0.12.3",n "superagent": "^1.3.0",n "url-loader": "^0.5.6",n "vinyl-named": "^1.1.0",n "vue": "^0.12.10",n "vue-loader": "^2.1.1",n "vue-validator": "^1.4.0",n "webpack": "^1.10.0",n "webpack-dev-server": "^1.9.0",n "zrender": "ecomfe/zrender"n nnn```nn
安装 mysql时如果出现密码错误
这种错误: 解决方法:运行cmd: mysql -u root mysql> SETPASSWORDFOR'root'@'localhost' = PASSWORD('newpass');
npm 安装依赖时出现错误
笔者在进行学习webpack学习实践的时候,使用npm命令进行依赖安装时,总是遇到以下错误,笔者一时找不到解决方案,很是无奈。后偶然间在看mpvue文档的时候瞬间受到启发解决了此错误。 解决方法及解决示例图如下: 执行以下命令后再执行安装依赖就不报错误啦 $ npm set registry https://registry.npm.taobao.org/ OR $ yarn con...
vs2005安装时出现错误1335
错误1335号rn_14311_VC80_PDB_WINSXS_ATLMFC_X86.MSM已经损坏,各位谁知道是怎么回事情?
我安装APACHE时,出现了错误:
在我安装APACHE时,出现了错误:rn如rnerror:failed dependencies:rn/etc/mine.types is needed by apache -1.3.14-2.62rnmailcap is needed by apache -1.3.14-2.62
安装openmotif22-2.2.3-18.i386包时出现如下错误
安装openmotif22-2.2.3-18.i386包时出现如下错误rnMissing Dependency: libXp.so.6 is needed by package openmotif22-2.2.3-18.i386 (/openmotif22-2.2.3-18.i386)rn
安装gcc4.4.3 make时出现错误
我的linux系统是red hat enterprise linux 5,系统自带的一个gcc版本是4.1.2,后来我安装了一个低版本的gcc3.4.6rnrn现在安装gcc4.4.3rn我先安装了gmp4.3.2和mpfr2.4.2rn最后安装gcc4.4.3rn ../gcc-4.4.3/configure --prefix=/usr/local/gcc-4.4.3 --enable-threads=posix --disable-checking --disable-multilib --with-system-zlib --enable-languages=c,c++,java --with-gmp=/usr/local/gmp-4.3.2 --with-mpfr=/usr/local/mpfr-2.4.2 --build=i386-redhat-linux-gnu --host=i386-redhat-linux-gnu --target=i386-redhat-linux-gnurnrn没有问题rnrn到make时,大概过了10分钟左右出现如下的问题(错误最后的显示)rnrnrm gcc.podrnmake[3]: Leaving directory `/home/leiding/gcc443build/gcc'rnmkdir -p -- i386-redhat-linux-gnu/libgccrnChecking multilib configuration for libgcc...rnConfiguring stage 1 in i386-redhat-linux-gnu/libgccrnconfigure: creating cache ./config.cachernchecking for --enable-version-specific-runtime-libs... nornchecking for a BSD-compatible install... /usr/bin/install -crnchecking for gawk... gawkrnchecking build system type... i386-redhat-linux-gnurnchecking host system type... i386-redhat-linux-gnurnchecking for i386-redhat-linux-gnu-ar... arrnchecking for i386-redhat-linux-gnu-lipo... lipornchecking for i386-redhat-linux-gnu-nm... /home/leiding/gcc443build/./gcc/nmrnchecking for i386-redhat-linux-gnu-ranlib... ranlibrnchecking for i386-redhat-linux-gnu-strip... striprnchecking whether ln -s works... yesrnchecking for i386-redhat-linux-gnu-gcc... /home/leiding/gcc443build/./gcc/xgcc -B/home/leiding/gcc443build/./gcc/ -B/usr/local/gcc-4.4.3/i386-redhat-linux-gnu/bin/ -B/usr/local/gcc-4.4.3/i386-redhat-linux-gnu/lib/ -isystem /usr/local/gcc-4.4.3/i386-redhat-linux-gnu/include -isystem /usr/local/gcc-4.4.3/i386-redhat-linux-gnu/sys-includernchecking for suffix of object files... configure: error: in `/home/leiding/gcc443build/i386-redhat-linux-gnu/libgcc':rnconfigure: error: cannot compute suffix of object files: cannot compilernSee `config.log' for more details.rnmake[2]: *** [configure-stage1-target-libgcc] Error 1rnmake[2]: Leaving directory `/home/leiding/gcc443build'rnmake[1]: *** [stage1-bubble] Error 2rnmake[1]: Leaving directory `/home/leiding/gcc443build'rnmake: *** [all] Error 2rnrnrn请大家看看这是什么原因呢,谢谢!rn
我在安装XP时,出现了错误!
要到选择在哪个盘上安装的时候,出现了错误:rnA problem has been detected and windows has been shut down to prevend damage to you computer.rn现在都不能装了,还说了硬件可能没装好,请问我应该怎么解决?
在安装midas客户端程序时出现的错误!求教!!!
我在安装了delphi7的机器上(操作系统为window98)安装客户端程序Client.EXE,系统会出现如下异常rn Exception EOleSysError in Module Client.exe at 0006DE2D 远程过程调用失败!rn 请问各位高手是什么错误!?如何解决?
安装qt4.3.2 make 时出现错误
collect2: ld 返回 1rnmake[1]: *** [../../../bin/uic3] 错误 1rnmake[1]: Leaving directory `/tmp/qt/qt-x11-opensource-src-4.3.2/src/tools/uic3'rnmake: *** [sub-uic3-make_default-ordered] 错误 2rn
mapx5.02.19安装点击setup.exe时出现错误
出现问题:rn16 bit Windows SubsystemrnrnC:\Users\Administrator.DAKTBSQ2CPNDIUR\AppData\Local\Temp\. A temporary file needed for initialization could not be created or could not be written to. Make sure that the directory path exists, and disk space is available. Choose 'Close' to terminate the application.rn---------------------------rn关闭(C) rn---------------------------rn该怎么解决呢?求大神指点
sqlserver2k安装时出现错误:错误代码703
sqlserver2k 安装时出现错误:错误代码703 rn提示是说一个文件(此文件是安装程序的临时目录里的文件setup.ins)出现内部错误,无法加载安装指令.错误703rn我把原来的SQL 7.0删除掉重新安装,服务器重装启动不行,到底是怎么回事
在Linux下安装MapXtreme Java时出现了错误
安装的版本是:MapInfo.MapXtreme.Java.Edition.v4.71.22.Linuxrn操作系统是:Mandrivarnrn请问是我系统的问题还是软件本身的问题。rn错误信息的截图如下(JPG格式图片,无病毒):rnhttp://images.blogcn.com/2006/9/14/7/hoffmansong,20060914121912.jpgrn请各位使用过MapXtreme Java的朋友帮我看看。
jeesite安装时,初始数据库出现错误
  求大佬帮忙看一下是哪里出错了》》》》  
Qt在Linux上安装时出现的错误
qmake: could not exec ‘/usr/lib/i386-linux-gnu/qt4/bin/qmake’: No such file or directory 1、错误如下图所示:2、解决的办法按网上一般的步骤来,但还是会遇到讲解不清楚的地方输入密码获取权限,进入如下页面:关键在这里,该如何改,我在这磨蹭了好一会不得门道,现将具体方法告知各位像我一样的小白。 3、上一步用到V
相关热词 c++和c#哪个就业率高 c# 批量动态创建控件 c# 模块和程序集的区别 c# gmap 截图 c# 验证码图片生成类 c# 再次尝试 连接失败 c#开发编写规范 c# 压缩图片好麻烦 c#计算数组中的平均值 c#获取路由参数