ionic3 http请求更改headers post请求出错

我ionic3中设置http请求,后台为webapi,get请求没问题,post不带参数也能请求,
添加参数就报错,要么405要么415,更改ContenT_Type好像没起作用,增加tonken后台也是无法获取值,有哪位大神
遇到过知道怎么解决吗?
//token验证
var headers = new Headers();
headers.append('Content-Type', 'application/json');
headers.append('Authorization', 'weixiao-token');//这里添加了token
let options = new RequestOptions(JSON.stringify({ headers: headers }));
this.http.request('http://localhost:6112/api/UserInfo/Login',options)
.subscribe((res:Response)=>{
console.log(res.json());
});
```
后台获取到的是null
//post带参数
let headers =new Headers({
"Content-Type":"application/x-www-form-urlencoded"})
let body =JSON.stringify({name:"chuanzhi"})
let reqO = new RequestOptions({headers:headers})
this.http.post("http://localhost:23909/api/Cs/postPaths",
body,reqO)
.subscribe((res:Response)=>{
console.log(res.json());
})
在chrome中查看没有变化Content-Type:application/json; charset=utf-8
报错
发现参数在request payload中,报错415然后想到去掉JSON.stringify(),找不到参数了,并且报错405

这是后台的接口,试过去掉[FromBody]也没用,实在没辙了
[Route("api/Cs/postPaths")]
[HttpPost]
public string postPaths([FromBody]string name)
{
return name;
}
刚开始学,希望前辈指教下

2个回答

你好,请问你这个问题结局了吗,我也遇到相同的问题……在httpClient的请求中,自定义头文件报403呢

ysghyy
ysghyy 解决了吗?同求
接近 2 年之前 回复

1、post看下什么模式,如果后台是严格模式前台下发就用严格模式下发,如果是非严格模式,就采用非严格模式。
2、区分也简单:f12看下post后面的url带没带参数,不带参数是严格模式,带了就是非严格模式。
3、将参数作为body传入就是严格模式,在options中增加params属性就是非严格模式下发
public post(url: string, params: any = null, successCallback, errorCallback): any {
// 此处使用的post模式为非严格模式,如果要使用严格模式,请把参数放在第二个位置 覆盖null
return this.http.post(url, null, {
params: params,
headers: this.getHeaders(), // 添加token信息
}).subscribe((res: any) => {
this.responseSuccess(res, function (msg) {
if (successCallback) {
successCallback(res, msg);
}
});
}, err => {
if (errorCallback) {
errorCallback(err);
}
});
}

Csdn user default icon
上传中...
上传图片
插入图片
抄袭、复制答案,以达到刷声望分或其他目的的行为,在CSDN问答是严格禁止的,一经发现立刻封号。是时候展现真正的技术了!
其他相关推荐
ionic4 post请求返回的数据在浏览器上是json格式,在android真机上返回却是html页面

我的项目是ionic4项目,angular的版本是angular7,写了个登陆页面在浏览器上测试是可以的返回的数据也是json格式,但是拿到手机测试,返回的数据就变成了html页面,内容大概就是项目中index.html中html; 头里面的responseType如果默认是json,那么直接就会报http failure during parsing for .... ,因为返回的是html所以无法解析;将responseType设置成text,就看到了返回是个html页面。 下面贴出部分的代码。。。 **http服务** ``` Login(userName: string, password: string) { let params = {"request":{"user_name":userName,"password":password,"user_auth":1}}; const httpOptions ={ headers:new HttpHeaders({ 'Content-Type':'application/json;chatset=UTF-8', }), }; return this.http.post(this.loginUrl,JSON.stringify(params),httpOptions); } ``` **页面组件** ``` this.http.Login(username,password).subscribe( (data:any)=>{ if(data.success=true){ this.loginError='成功'; alert('登录成功'); // sessionStorage.setItem('permission','true'); this.router.navigateByUrl('/main'); } else if(data.success=false){ this.loginError=data.error+'错误'; alert('登录失败'); } }, error =>{ this.loginError="登陆失败"+JSON.stringify(error); } ``` **跨域我也做了处理** proxy.config.json文件 ![图片说明](https://img-ask.csdn.net/upload/201906/25/1561427469_350939.png) angular.json文件 ![图片说明](https://img-ask.csdn.net/upload/201906/25/1561427484_150835.png) 最终发现,在浏览器上需要使用跨域处理,但是在android真机上不用,直接将angular.json文件中的proxyConfig删除,http请求的URL直接写全路径,设置的httpOption也要删除。 然后,重新打包测试,登陆成功了。

ionic4如何拦截http请求

如题。。。。。。。。。。。。。。。。。。。。。。。。。。。。。。。。。。。。。。。。。。。。。。。。。。。。。。。

Ionic请求问题,浏览器请求正常而真机就不行咯

我浏览器都可以请求的,但是再真机上就不行咯。而且服务端也没收到请求。请问大神这是什么原因呢 ![![图片说明](https://img-ask.csdn.net/upload/201801/19/1516332303_146795.png)图片说明](https://img-ask.csdn.net/upload/201801/19/1516332289_683574.png)

离子发送http.post和php接收GET请求

<div class="post-text" itemprop="text"> <p>I already developed ionic 4 in my Mac. When trying to improve an app in ionic 3, my <code>http.post</code> (angular) calls in php is received as <code>GET ($ _SERVER ['REQUEST_METHOD'])</code>. I discovered that my parameters are not being recognized in php. * I read the other posts and none solved my problem Thank you!</p> <pre><code>import { Http , Headers, RequestOptions} from '@angular/http'; import 'rxjs/add/operator/catch'; import 'rxjs/add/operator/toPromise'; let parametros = JSON.stringify({ idtApostador: localStorage.getItem("idtApostador"), }); let headers = new Headers( { 'Content-Type' : 'application/json' }); let options = new RequestOptions({ headers: headers }); return new Promise(resolve =&gt; { this.http.post(url, parametros, options) .timeout(15000) .subscribe(data =&gt; { }) }) </code></pre> </div>

POST请求没有正确到达httpClient - ionic - php

<div class="post-text" itemprop="text"> <p>I'm creating a REST API in PHP. The service <code>login</code> is:</p> <pre><code>&lt;?php include_once 'libs/Database.php'; header("Content-Type: application/json; charset=UTF-8"); Database::getPDO(); $myObj = null; if ( Database::check($_POST['username'], $_POST['password']) ) { $myObj = array('message' =&gt; "Verified", 'success' =&gt; true); } else { $myObj = array('message' =&gt; "Unauthorized", 'username' =&gt; $_POST['username'], 'success' =&gt; false); } $myJSON = json_encode($myObj); echo $myJSON; ?&gt; </code></pre> <p>And as you may see, I'm accessing <code>$_POST</code> global variable.</p> <ul> <li>Postman: sending a POST request with header <code>x-www-form-urlenconded</code> and specifying the keys and values, the server does capture such keys.</li> <li>Ionic: sending a POST request using <code>HttpClient</code> will not work. (The server captures <code>null</code> for both keys, <code>username</code> and <code>password</code>).</li> </ul> <p>This is the code of the provider:</p> <pre><code> login(user, pass, url) { const httpOptions = { headers: new HttpHeaders({ 'Content-Type': 'application/x-www-form-urlencoded' }) }; return this.http.post(url, "username="+user+"&amp;"+"password="+pass, httpOptions); } </code></pre> <p>I'm wondering how the <code>body</code> should be formatted, and according to <a href="https://stackoverflow.com/questions/14551194/how-are-parameters-sent-in-an-http-post-request">this link</a> should be like I have done (username=user&amp;password=pass). By the way, all parameters are not null when the <code>login</code> function is called, hence, the problem is in the request.</p> <p>For those of you interested, the answer of the server is:</p> <pre><code>{message: "Unauthorized", username: null, success: false} </code></pre> <p>Any help will be appreciated.</p> </div>

使用angualrjs $Http.post发送请求时 angular.path 参数表示什么意思

使用angualrjs $Http.post发送请求时 angular.path 参数表示什么意思

ionic3 ionic serve 很慢要5分钟左右

ionic3 ionic serve 很慢要5分钟左右,项目做了一段时间后 页面越来越多,现在改一个ts,编译要很久.看了ionic serve 控制台打印出来的 主要的时间都在webpack上.有没有什么好的解决方案

无法处理来自PHP服务和JSON的Ionic HTTP请求

<div class="post-text" itemprop="text"> <p>I'm trying to build an Angular-Ionic app, which gets information from a central database via http request information. These are built by PHP in the form of JSON. I also get the information back but can not process it.</p> <p>My JSON looks like this:</p> <pre><code>[ {0: {id: 1, title: 'TITLE', image:'TITEL'}, {1: {id: 2, title: 'TITLE', image:'TITEL'}, {2: {id: 3, title: 'TITLE', image:'TITEL'} ] </code></pre> <p></p> <p>This is my PHP-Code:</p> <pre><code>if (isset($_SERVER['HTTP_ORIGIN'])) { header("Access-Control-Allow-Origin: {$_SERVER['HTTP_ORIGIN']}"); header('Access-Control-Allow-Credentials: true'); header('Access-Control-Max-Age: 86400'); // cache for 1 day } // Access-Control headers are received during OPTIONS requests if ($_SERVER['REQUEST_METHOD'] == 'OPTIONS') { if (isset($_SERVER['HTTP_ACCESS_CONTROL_REQUEST_METHOD'])) header("Access-Control-Allow-Methods: GET, POST, PUT, DELETE, OPTIONS"); if (isset($_SERVER['HTTP_ACCESS_CONTROL_REQUEST_HEADERS'])) header("Access-Control-Allow-Headers: {$_SERVER['HTTP_ACCESS_CONTROL_REQUEST_HEADERS']}"); } $mysqli = new mysqli("[DATABASE_URL]", "[DATABASE_USER]", "[DATABASE_PWD]", "[DATABASE]"); $query = "SELECT id, title, image FROM database ORDER BY title ASC"; $dbresult = $mysqli-&gt;query($query); while($row = $dbresult-&gt;fetch_array(MYSQLI_ASSOC)){ $data[] = array( 'id' =&gt; $row['id'], 'title' =&gt; $row['title'], 'image' =&gt; $row['image'] ); } if($dbresult){ $result = json_encode(utf8ize($data),JSON_FORCE_OBJECT); } else { $result = "{success:false}"; } echo $result; function utf8ize($d) { if (is_array($d)) { foreach ($d as $k =&gt; $v) { $d[$k] = utf8ize($v); } } else if (is_string ($d)) { return utf8_encode($d); } return $d; } </code></pre> <p>I would like to build a list with the obtained data in Angular / Ionic. I use Ionic 3 on the latest version. Http and HttpClient, as well as HttpProvider did not bring any result:</p> <pre><code>&lt;ion-card *ngFor="let item of newsData"&gt; &lt;img src="../../assets/imgs/{{ item.image }}.jpeg"/&gt; &lt;div class="card-title"&gt;{{ item.title }}&lt;/div&gt; &lt;div class="card-subtitle"&gt;{{item.id}} Rezepte&lt;/div&gt; &lt;/ion-card&gt; </code></pre> <p>How can I achieve that?</p> </div>

Ionic 2在使用php和mysql发出请求时给出了错误的响应

<div class="post-text" itemprop="text"> <p>I'm doing login from an app using php and mysql. When I put the URL on the browser with credentials appended with it, if the credentials are valid, it prints correct response like <code>success:true</code>. If credentials are not valid, it prints <code>success:false</code>. But when I put do ionic serve and do a login from the app, it prints <code>success:true</code> on console all the time, even if the credentials are not valid.</p> <p>This is my IONIC-2 code:</p> <pre><code>var headers = new Headers(); headers.append("Accept",'application/json'); headers.append('Content-Type','application/json'); let options = new RequestOptions({headers:headers}); let postParams={ username: logincreds.username, password: logincreds.password, } this.http.post("http://vaishalishaadi.com/AppLogin.php", postParams, options) .subscribe(data=&gt;{ console.log(postParams); console.log(data); /*if(data.json().success=="success"){ } else{ } */ }, error =&gt; { console.log(error); }); </code></pre> <p>Following code is of PHP:</p> <pre><code> header('Content-type: application/json'); if($check){ session_start(); $_SESSION['u_id'] = $check-&gt;u_id; $_SESSION['u_name'] = $check-&gt;u_firstname; $login_response=["success"=&gt;"true"]; //print(json_encode($login_response)); //echo $check-&gt;u_id; $data[] = array( 'pram'=$username 'id' =&gt; $check-&gt;u_id, 'fname' =&gt; $check-&gt;u_firstname, 'lname' =&gt; $check-&gt;u_lastname, ); $result = "{'success':true, 'data':" . json_encode($data) . "}"; } else{ $result = "{'success':false}"; } echo($result); </code></pre> </div>

多图像上传IONIC 3和PHP

<div class="post-text" itemprop="text"> <p>I am trying to upload multiple images in base64 format from my IONIC app using IONIC native camera plugin via PHP service. I successfully uploaded and decoded single image through the following way:</p> <pre><code>&lt;?php header("Content-Type: application/json"); require('confi.php'); define('UPLOAD_DIR', 'uploads/'); $target_file = $_POST['fileToUpload']; $target_file = str_replace('data:image/png;base64,', '', $target_file); $target_file = str_replace(' ', '+', $target_file); $data = base64_decode($target_file); $file = UPLOAD_DIR . uniqid() . '.png'; $success = file_put_contents($file, $data); $myPic = 'http://yyyy .com/xxx/'.$file; $sql = "insert into images(images) values('{$myPic}')"; </code></pre> <p>How can I decode and upload multiple images like $image1,$image2,$image3,$image4 in database? I know I have to use foreach to loop the process but I tried several times but no luck. TIA </p> </div>

ionic 生成的项目框架 怎么修改端口?

用yeoman生成的ionic项目框架 怎么修改端口?我想改为默认端扣口 80

ionic3中的tabs嵌套问题

ionic3 首页是一个tabs 二级页面隐藏tabs标签 但是首页tab 点击进入的二级标签还是一个tabs 1.这个tabs 返回改怎么返回?2.首页传的值只能传给tabs不能传给tab,要怎么样才能将tabs的值传给tab

ionic angular js 跨域Access-Control-Allow-Origin

``` var myUrl = "http://10.1.20.9:8080/bingo-web/system/listWapOutJson.vhtml?wuLiaoID=40010000040"; $http.get(myUrl).success(function (response) { if(response.success){ console.log("2123"); $scope.chat = response.data; }else { console.log("qweqwe"); } }) ``` 这样写就会出现以下错误, XMLHttpRequest cannot load http://10.1.20.9:8080/bingo-web/system/listWapOutJson.vhtml?wuLiaoID=40010000040. No 'Access-Control-Allow-Origin' header is present on the requested resource. Origin 'http://192.168.40.6:8100' is therefore not allowed access. 求大神,这个问题应该怎么解决呀?

提高查询速度Ionic / Laravel Post请求

<div class="post-text" itemprop="text"> <p>I'm trying to increase the speed of my query, currently it takes around <strong>15 seconds</strong> for all the data to get returned. I have an <strong>Ionic 3</strong> app which is sending a post request to get all inventory and my <strong>Laravel 5.4</strong> server is handling the request.</p> <p>Here's my query :</p> <pre><code> $input = file_get_contents( "php://input" ); $request = json_decode( $input ); $dealer_id = $request-&gt;dealer_id; $tmp = Inventory::where( 'dealer_id', '=', $dealer_id )-&gt;where( 'inventories.is_sold', '=', 0 )-&gt;where( 'is_active','=', 1 ); // dd($tmp); $data = collect(); $pmt = $tmp-&gt;get(); logger( sprintf('# of rows returned: %s', $pmt-&gt;count() ) ); $pmt-&gt;each( function($row) use(&amp;$data) { logger( sprintf('Row : %s', $row-&gt;toJson() )); $data-&gt;push( array( 'stock_number' =&gt; $row-&gt;stock_number, 'vehicle_id' =&gt; $row-&gt;vehicle_id, 'year' =&gt; $row-&gt;vehicle()-&gt;first()-&gt;year, 'make' =&gt; $row-&gt;vehicle()-&gt;first()-&gt;make, 'model' =&gt; $row-&gt;vehicle()-&gt;first()-&gt;model, // 'trim' =&gt; $row-&gt;vehicle()-&gt;first()-&gt;trim, 'vin' =&gt; $row-&gt;vehicle()-&gt;first()-&gt;vin, 'status' =&gt; $row-&gt;vehicle_status, 'purchase_price' =&gt; $row-&gt;purchase_price, 'cost' =&gt; $row-&gt;cost, // 'retail_price' =&gt; $row-&gt;retail_price, 'search_meta' =&gt; $row-&gt;search_meta, // 'interior_color' =&gt; $row-&gt;vehicle()-&gt;first()-&gt;interior_color, // 'exterior_color' =&gt; $row-&gt;vehicle()-&gt;first()-&gt;exterior_color, 'firstImg' =&gt; $row-&gt;getFirstImage(), 'images' =&gt; Vimage::select('vehicle_id','name' )-&gt;where( 'dealer_id', '=', $row-&gt;dealer_id )-&gt;where( 'vehicle_id', '=', $row-&gt;vehicle_id )-&gt;get() )); }); $statusKey = \App\lt_vehicle_status::where( 'dealer_id', '=', $dealer_id )-&gt;where( 'is_active','=', 1 )-&gt;get(); $response = [ "status" =&gt; "Success", "code" =&gt; "MAC01", "reason" =&gt; "MAC - Inventory Gathered Successfully", "data" =&gt; $data, "status_keys" =&gt; $statusKey ]; echo json_encode( $response ); </code></pre> <p>Data Returned:</p> <p><a href="https://i.imgur.com/zxWSNo5.png" rel="nofollow noreferrer">https://i.imgur.com/zxWSNo5.png</a></p> <p>One of the biggest issues is getting all the image urls as well as all the vehicles.</p> <p>Thank you to whomever can help me try to increase my speed and efficiency of this.</p> </div>

ionic 3.20.0 ionic cordova platform add iOS 失败

sudo ionic start ionicV1Demo tabs --type ionic1 sudo ionic cordova platform add ios ios工程创建成功 但是sudo ionic start ionic4Demo tabs 会卡在Running command 有时候会过 但是会出错 ![图片说明](https://img-ask.csdn.net/upload/201803/21/1521629145_15523.png) 如果出错了 到创建目录下 cnpm install 然后 ionic serve 就能运行 但是sudo ionic cordova platform add ios 就一直出错 ![图片说明](https://img-ask.csdn.net/upload/201803/21/1521629214_608764.png) 反反复复 taobao镜像 vpn都用过了 都不行 求大神指点

ionic3打包出错,求大佬帮忙!!

今天打包的时候cordova build android就出现下面这个错误,以前都没有问题的,请问是哪的问题?该如何解决了,求具体如何操作。。。 C:\Users\Administrator\.gradle\caches\transforms-1\files-1.1\appcompat-v7-26.1.0.aar\ac54a0ace3996090bdb7ad492e3b5bcd\res\values\values.xml:246:5-69: AAPT: error: resource android:attr/fontVariationSettings not found. C:\Users\Administrator\.gradle\caches\transforms-1\files-1.1\appcompat-v7-26.1.0.aar\ac54a0ace3996090bdb7ad492e3b5bcd\res\values\values.xml:246:5-69: AAPT: error: resource android:attr/ttcIndex not found. D:\Code\YSDA\ysda\platforms\android\app\build\intermediates\incremental\mergeDebugResources\merged.dir\values\values.xml:248: error: resource android:attr/fontVariationSettings not found. D:\Code\YSDA\ysda\platforms\android\app\build\intermediates\incremental\mergeDebugResources\merged.dir\values\values.xml:248: error: resource android:attr/ttcIndex not found. error: failed linking references. =============== 全部的: PS D:\code\ysda\ysda> cordova build android cordova-android-support-gradle-release: Android platform: V7+ cordova-android-support-gradle-release: Wrote custom version '26.+' to D:\code\ysda\ysda\platforms\android\app\build.gra dle cordova-android-support-gradle-release: Wrote custom version '26.+' to D:\code\ysda\ysda\platforms\android\cordova-andro id-support-gradle-release\zxh-cordova-android-support-gradle-release.gradle Android Studio project detected cordova-android-support-gradle-release: Android platform: V7+ cordova-android-support-gradle-release: Wrote custom version '26.+' to D:\code\ysda\ysda\platforms\android\app\build.gra dle cordova-android-support-gradle-release: Wrote custom version '26.+' to D:\code\ysda\ysda\platforms\android\cordova-andro id-support-gradle-release\zxh-cordova-android-support-gradle-release.gradle ANDROID_HOME=C:\Users\Administrator\AppData\Local\Android\sdk JAVA_HOME=E:\Java\jdk1.8.0_91 studio Starting a Gradle Daemon (subsequent builds will be faster) BUILD SUCCESSFUL in 5s 1 actionable task: 1 executed Subproject Path: CordovaLib Subproject Path: app publishNonDefault is deprecated and has no effect anymore. All variants are now published. +----------------------------------------------------------------- | cordova-android-support-gradle-release: 26.+ +----------------------------------------------------------------- Configuration 'compile' in project ':app' is deprecated. Use 'implementation' instead. The Task.leftShift(Closure) method has been deprecated and is scheduled to be removed in Gradle 5.0. Please use Task.doL ast(Action) instead. at build_dxxuwns2wpt3q41rnhqfnnu3n.run(D:\Code\YSDA\ysda\platforms\android\app\build.gradle:152) :CordovaLib:preBuild UP-TO-DATE :CordovaLib:preDebugBuild UP-TO-DATE :CordovaLib:compileDebugAidl :CordovaLib:compileDebugRenderscript :CordovaLib:checkDebugManifest :CordovaLib:generateDebugBuildConfig :CordovaLib:prepareLintJar :CordovaLib:generateDebugResValues :CordovaLib:generateDebugResources :CordovaLib:packageDebugResources :CordovaLib:platformAttrExtractor :CordovaLib:processDebugManifest :CordovaLib:javaPreCompileDebug :CordovaLib:processDebugJavaRes NO-SOURCE :app:preBuild UP-TO-DATE :app:preDebugBuild :app:compileDebugAidl :CordovaLib:packageDebugRenderscript NO-SOURCE :app:compileDebugRenderscript :app:checkDebugManifest :app:generateDebugBuildConfig :app:prepareLintJar :app:generateDebugResValues :app:generateDebugResources :app:mergeDebugResources :app:createDebugCompatibleScreenManifests :app:processDebugManifest :app:splitsDiscoveryTaskDebug :app:compileDebugNdk NO-SOURCE :CordovaLib:mergeDebugShaders :CordovaLib:compileDebugShaders :CordovaLib:generateDebugAssets :CordovaLib:mergeDebugAssets :app:mergeDebugShaders :app:compileDebugShaders :app:generateDebugAssets :app:mergeDebugAssets :CordovaLib:compileDebugNdk NO-SOURCE :CordovaLib:mergeDebugJniLibFolders :CordovaLib:transformNativeLibsWithMergeJniLibsForDebug :CordovaLib:transformNativeLibsWithIntermediateJniLibsForDebug :app:mergeDebugJniLibFolders :app:processDebugJavaRes NO-SOURCE :app:validateSigningDebug :CordovaLib:processDebugResources :CordovaLib:generateDebugSources :CordovaLib:compileDebugJavaWithJavacע: ijЩ�����ļ�ʹ�û�����ѹ�ʱ�� API�� ע: �й���ϸ��Ϣ, ��ʹ�� -Xlint:deprecation ���±��롣 :CordovaLib:transformClassesAndResourcesWithPrepareIntermediateJarsForDebug :app:processDebugResourcesC:\Users\Administrator\.gradle\caches\transforms-1\files-1.1\appcompat-v7-26.1.0.aar\ac54a0ace 3996090bdb7ad492e3b5bcd\res\values\values.xml:246:5-69: AAPT: error: resource android:attr/fontVariationSettings not fou nd. C:\Users\Administrator\.gradle\caches\transforms-1\files-1.1\appcompat-v7-26.1.0.aar\ac54a0ace3996090bdb7ad492e3b5bcd\re s\values\values.xml:246:5-69: AAPT: error: resource android:attr/ttcIndex not found. D:\Code\YSDA\ysda\platforms\android\app\build\intermediates\incremental\mergeDebugResources\merged.dir\values\values.xml :248: error: resource android:attr/fontVariationSettings not found. D:\Code\YSDA\ysda\platforms\android\app\build\intermediates\incremental\mergeDebugResources\merged.dir\values\values.xml :248: error: resource android:attr/ttcIndex not found. error: failed linking references. Failed to execute aapt com.android.ide.common.process.ProcessException: Failed to execute aapt at com.android.builder.core.AndroidBuilder.processResources(AndroidBuilder.java:796) at com.android.build.gradle.tasks.ProcessAndroidResources.invokeAaptForSplit(ProcessAndroidResources.java:551) at com.android.build.gradle.tasks.ProcessAndroidResources.doFullTaskAction(ProcessAndroidResources.java:285) at com.android.build.gradle.internal.tasks.IncrementalTask.taskAction(IncrementalTask.java:109) at sun.reflect.GeneratedMethodAccessor182.invoke(Unknown Source) at sun.reflect.DelegatingMethodAccessorImpl.invoke(DelegatingMethodAccessorImpl.java:43) at java.lang.reflect.Method.invoke(Method.java:498) at org.gradle.internal.reflect.JavaMethod.invoke(JavaMethod.java:73) at org.gradle.api.internal.project.taskfactory.DefaultTaskClassInfoStore$IncrementalTaskAction.doExecute(Default TaskClassInfoStore.java:173) at org.gradle.api.internal.project.taskfactory.DefaultTaskClassInfoStore$StandardTaskAction.execute(DefaultTaskC lassInfoStore.java:134) at org.gradle.api.internal.project.taskfactory.DefaultTaskClassInfoStore$StandardTaskAction.execute(DefaultTaskC lassInfoStore.java:121) at org.gradle.api.internal.tasks.execution.ExecuteActionsTaskExecuter$1.run(ExecuteActionsTaskExecuter.java:122) at org.gradle.internal.progress.DefaultBuildOperationExecutor$RunnableBuildOperationWorker.execute(DefaultBuildO perationExecutor.java:336) at org.gradle.internal.progress.DefaultBuildOperationExecutor$RunnableBuildOperationWorker.execute(DefaultBuildO perationExecutor.java:328) at org.gradle.internal.progress.DefaultBuildOperationExecutor.execute(DefaultBuildOperationExecutor.java:197) at org.gradle.internal.progress.DefaultBuildOperationExecutor.run(DefaultBuildOperationExecutor.java:107) at org.gradle.api.internal.tasks.execution.ExecuteActionsTaskExecuter.executeAction(ExecuteActionsTaskExecuter.j ava:111) at org.gradle.api.internal.tasks.execution.ExecuteActionsTaskExecuter.executeActions(ExecuteActionsTaskExecuter. java:92) at org.gradle.api.internal.tasks.execution.ExecuteActionsTaskExecuter.execute(ExecuteActionsTaskExecuter.java:70 ) at org.gradle.api.internal.tasks.execution.SkipUpToDateTaskExecuter.execute(SkipUpToDateTaskExecuter.java:63) at org.gradle.api.internal.tasks.execution.ResolveTaskOutputCachingStateExecuter.execute(ResolveTaskOutputCachin gStateExecuter.java:54) at org.gradle.api.internal.tasks.execution.ValidatingTaskExecuter.execute(ValidatingTaskExecuter.java:58) at org.gradle.api.internal.tasks.execution.SkipEmptySourceFilesTaskExecuter.execute(SkipEmptySourceFilesTaskExec uter.java:88) at org.gradle.api.internal.tasks.execution.ResolveTaskArtifactStateTaskExecuter.execute(ResolveTaskArtifactState TaskExecuter.java:52) at org.gradle.api.internal.tasks.execution.SkipTaskWithNoActionsExecuter.execute(SkipTaskWithNoActionsExecuter.j ava:52) at org.gradle.api.internal.tasks.execution.SkipOnlyIfTaskExecuter.execute(SkipOnlyIfTaskExecuter.java:54) at org.gradle.api.internal.tasks.execution.ExecuteAtMostOnceTaskExecuter.execute(ExecuteAtMostOnceTaskExecuter.j ava:43) at org.gradle.api.internal.tasks.execution.CatchExceptionTaskExecuter.execute(CatchExceptionTaskExecuter.java:34 ) at org.gradle.execution.taskgraph.DefaultTaskGraphExecuter$EventFiringTaskWorker$1.run(DefaultTaskGraphExecuter. java:248) at org.gradle.internal.progress.DefaultBuildOperationExecutor$RunnableBuildOperationWorker.execute(DefaultBuildO perationExecutor.java:336) at org.gradle.internal.progress.DefaultBuildOperationExecutor$RunnableBuildOperationWorker.execute(DefaultBuildO perationExecutor.java:328) at org.gradle.internal.progress.DefaultBuildOperationExecutor.execute(DefaultBuildOperationExecutor.java:197) at org.gradle.internal.progress.DefaultBuildOperationExecutor.run(DefaultBuildOperationExecutor.java:107) at org.gradle.execution.taskgraph.DefaultTaskGraphExecuter$EventFiringTaskWorker.execute(DefaultTaskGraphExecute r.java:241) at org.gradle.execution.taskgraph.DefaultTaskGraphExecuter$EventFiringTaskWorker.execute(DefaultTaskGraphExecute r.java:230) at org.gradle.execution.taskgraph.DefaultTaskPlanExecutor$TaskExecutorWorker.processTask(DefaultTaskPlanExecutor .java:124) at org.gradle.execution.taskgraph.DefaultTaskPlanExecutor$TaskExecutorWorker.access$200(DefaultTaskPlanExecutor. java:80) at org.gradle.execution.taskgraph.DefaultTaskPlanExecutor$TaskExecutorWorker$1.execute(DefaultTaskPlanExecutor.j ava:105) at org.gradle.execution.taskgraph.DefaultTaskPlanExecutor$TaskExecutorWorker$1.execute(DefaultTaskPlanExecutor.j ava:99) at org.gradle.execution.taskgraph.DefaultTaskExecutionPlan.execute(DefaultTaskExecutionPlan.java:625) at org.gradle.execution.taskgraph.DefaultTaskExecutionPlan.executeWithTask(DefaultTaskExecutionPlan.java:580) at org.gradle.execution.taskgraph.DefaultTaskPlanExecutor$TaskExecutorWorker.run(DefaultTaskPlanExecutor.java:99 ) at org.gradle.execution.taskgraph.DefaultTaskPlanExecutor.process(DefaultTaskPlanExecutor.java:60) at org.gradle.execution.taskgraph.DefaultTaskGraphExecuter.execute(DefaultTaskGraphExecuter.java:128) at org.gradle.execution.SelectedTaskExecutionAction.execute(SelectedTaskExecutionAction.java:37) at org.gradle.execution.DefaultBuildExecuter.execute(DefaultBuildExecuter.java:37) at org.gradle.execution.DefaultBuildExecuter.access$000(DefaultBuildExecuter.java:23) at org.gradle.execution.DefaultBuildExecuter$1.proceed(DefaultBuildExecuter.java:43) at org.gradle.execution.DryRunBuildExecutionAction.execute(DryRunBuildExecutionAction.java:46) at org.gradle.execution.DefaultBuildExecuter.execute(DefaultBuildExecuter.java:37) at org.gradle.execution.DefaultBuildExecuter.execute(DefaultBuildExecuter.java:30) at org.gradle.initialization.DefaultGradleLauncher$ExecuteTasks.run(DefaultGradleLauncher.java:311) at org.gradle.internal.progress.DefaultBuildOperationExecutor$RunnableBuildOperationWorker.execute(DefaultBuildO perationExecutor.java:336) at org.gradle.internal.progress.DefaultBuildOperationExecutor$RunnableBuildOperationWorker.execute(DefaultBuildO perationExecutor.java:328) at org.gradle.internal.progress.DefaultBuildOperationExecutor.execute(DefaultBuildOperationExecutor.java:197) at org.gradle.internal.progress.DefaultBuildOperationExecutor.run(DefaultBuildOperationExecutor.java:107) at org.gradle.initialization.DefaultGradleLauncher.runTasks(DefaultGradleLauncher.java:202) at org.gradle.initialization.DefaultGradleLauncher.doBuildStages(DefaultGradleLauncher.java:132) at org.gradle.initialization.DefaultGradleLauncher.executeTasks(DefaultGradleLauncher.java:107) at org.gradle.internal.invocation.GradleBuildController$1.call(GradleBuildController.java:78) at org.gradle.internal.invocation.GradleBuildController$1.call(GradleBuildController.java:75) at org.gradle.internal.work.DefaultWorkerLeaseService.withLocks(DefaultWorkerLeaseService.java:152) at org.gradle.internal.invocation.GradleBuildController.doBuild(GradleBuildController.java:100) at org.gradle.internal.invocation.GradleBuildController.run(GradleBuildController.java:75) at org.gradle.tooling.internal.provider.ExecuteBuildActionRunner.run(ExecuteBuildActionRunner.java:28) at org.gradle.launcher.exec.ChainingBuildActionRunner.run(ChainingBuildActionRunner.java:35) at org.gradle.tooling.internal.provider.ValidatingBuildActionRunner.run(ValidatingBuildActionRunner.java:32) at org.gradle.launcher.exec.RunAsBuildOperationBuildActionRunner$1.run(RunAsBuildOperationBuildActionRunner.java :43) at org.gradle.internal.progress.DefaultBuildOperationExecutor$RunnableBuildOperationWorker.execute(DefaultBuildO perationExecutor.java:336) at org.gradle.internal.progress.DefaultBuildOperationExecutor$RunnableBuildOperationWorker.execute(DefaultBuildO perationExecutor.java:328) at org.gradle.internal.progress.DefaultBuildOperationExecutor.execute(DefaultBuildOperationExecutor.java:197) at org.gradle.internal.progress.DefaultBuildOperationExecutor.run(DefaultBuildOperationExecutor.java:107) at org.gradle.launcher.exec.RunAsBuildOperationBuildActionRunner.run(RunAsBuildOperationBuildActionRunner.java:4 0) at org.gradle.tooling.internal.provider.SubscribableBuildActionRunner.run(SubscribableBuildActionRunner.java:51) at org.gradle.launcher.exec.InProcessBuildActionExecuter.execute(InProcessBuildActionExecuter.java:45) at org.gradle.launcher.exec.InProcessBuildActionExecuter.execute(InProcessBuildActionExecuter.java:29) at org.gradle.launcher.exec.BuildTreeScopeBuildActionExecuter.execute(BuildTreeScopeBuildActionExecuter.java:39) at org.gradle.launcher.exec.BuildTreeScopeBuildActionExecuter.execute(BuildTreeScopeBuildActionExecuter.java:25) at org.gradle.tooling.internal.provider.ContinuousBuildActionExecuter.execute(ContinuousBuildActionExecuter.java :71) at org.gradle.tooling.internal.provider.ContinuousBuildActionExecuter.execute(ContinuousBuildActionExecuter.java :45) at org.gradle.tooling.internal.provider.ServicesSetupBuildActionExecuter.execute(ServicesSetupBuildActionExecute r.java:51) at org.gradle.tooling.internal.provider.ServicesSetupBuildActionExecuter.execute(ServicesSetupBuildActionExecute r.java:32) at org.gradle.tooling.internal.provider.GradleThreadBuildActionExecuter.execute(GradleThreadBuildActionExecuter. java:36) at org.gradle.tooling.internal.provider.GradleThreadBuildActionExecuter.execute(GradleThreadBuildActionExecuter. java:25) at org.gradle.tooling.internal.provider.ParallelismConfigurationBuildActionExecuter.execute(ParallelismConfigura tionBuildActionExecuter.java:43) at org.gradle.tooling.internal.provider.ParallelismConfigurationBuildActionExecuter.execute(ParallelismConfigura tionBuildActionExecuter.java:29) at org.gradle.tooling.internal.provider.StartParamsValidatingActionExecuter.execute(StartParamsValidatingActionE xecuter.java:64) at org.gradle.tooling.internal.provider.StartParamsValidatingActionExecuter.execute(StartParamsValidatingActionE xecuter.java:29) at org.gradle.tooling.internal.provider.SessionFailureReportingActionExecuter.execute(SessionFailureReportingAct ionExecuter.java:55) at org.gradle.tooling.internal.provider.SessionFailureReportingActionExecuter.execute(SessionFailureReportingAct ionExecuter.java:42) at org.gradle.tooling.internal.provider.SetupLoggingActionExecuter.execute(SetupLoggingActionExecuter.java:58) at org.gradle.tooling.internal.provider.SetupLoggingActionExecuter.execute(SetupLoggingActionExecuter.java:33) at org.gradle.launcher.daemon.server.exec.ExecuteBuild.doBuild(ExecuteBuild.java:67) at org.gradle.launcher.daemon.server.exec.BuildCommandOnly.execute(BuildCommandOnly.java:36) at org.gradle.launcher.daemon.server.api.DaemonCommandExecution.proceed(DaemonCommandExecution.java:120) at org.gradle.launcher.daemon.server.exec.WatchForDisconnection.execute(WatchForDisconnection.java:37) at org.gradle.launcher.daemon.server.api.DaemonCommandExecution.proceed(DaemonCommandExecution.java:120) at org.gradle.launcher.daemon.server.exec.ResetDeprecationLogger.execute(ResetDeprecationLogger.java:26) at org.gradle.launcher.daemon.server.api.DaemonCommandExecution.proceed(DaemonCommandExecution.java:120) at org.gradle.launcher.daemon.server.exec.RequestStopIfSingleUsedDaemon.execute(RequestStopIfSingleUsedDaemon.ja va:34) at org.gradle.launcher.daemon.server.api.DaemonCommandExecution.proceed(DaemonCommandExecution.java:120) at org.gradle.launcher.daemon.server.exec.ForwardClientInput$2.call(ForwardClientInput.java:74) at org.gradle.launcher.daemon.server.exec.ForwardClientInput$2.call(ForwardClientInput.java:72) at org.gradle.util.Swapper.swap(Swapper.java:38) at org.gradle.launcher.daemon.server.exec.ForwardClientInput.execute(ForwardClientInput.java:72) at org.gradle.launcher.daemon.server.api.DaemonCommandExecution.proceed(DaemonCommandExecution.java:120) at org.gradle.launcher.daemon.server.exec.LogAndCheckHealth.execute(LogAndCheckHealth.java:55) at org.gradle.launcher.daemon.server.api.DaemonCommandExecution.proceed(DaemonCommandExecution.java:120) at org.gradle.launcher.daemon.server.exec.LogToClient.doBuild(LogToClient.java:62) at org.gradle.launcher.daemon.server.exec.BuildCommandOnly.execute(BuildCommandOnly.java:36) at org.gradle.launcher.daemon.server.api.DaemonCommandExecution.proceed(DaemonCommandExecution.java:120) at org.gradle.launcher.daemon.server.exec.EstablishBuildEnvironment.doBuild(EstablishBuildEnvironment.java:82) at org.gradle.launcher.daemon.server.exec.BuildCommandOnly.execute(BuildCommandOnly.java:36) at org.gradle.launcher.daemon.server.api.DaemonCommandExecution.proceed(DaemonCommandExecution.java:120) at org.gradle.launcher.daemon.server.exec.StartBuildOrRespondWithBusy$1.run(StartBuildOrRespondWithBusy.java:50) at org.gradle.launcher.daemon.server.DaemonStateCoordinator$1.run(DaemonStateCoordinator.java:297) at org.gradle.internal.concurrent.ExecutorPolicy$CatchAndRecordFailures.onExecute(ExecutorPolicy.java:63) at org.gradle.internal.concurrent.ManagedExecutorImpl$1.run(ManagedExecutorImpl.java:46) at java.util.concurrent.ThreadPoolExecutor.runWorker(ThreadPoolExecutor.java:1142) at java.util.concurrent.ThreadPoolExecutor$Worker.run(ThreadPoolExecutor.java:617) at org.gradle.internal.concurrent.ThreadFactoryImpl$ManagedThreadRunnable.run(ThreadFactoryImpl.java:55) at java.lang.Thread.run(Thread.java:745) Caused by: java.util.concurrent.ExecutionException: java.util.concurrent.ExecutionException: com.android.tools.aapt2.Aap t2Exception: AAPT2 error: check logs for details at com.google.common.util.concurrent.AbstractFuture.getDoneValue(AbstractFuture.java:503) at com.google.common.util.concurrent.AbstractFuture.get(AbstractFuture.java:482) at com.google.common.util.concurrent.AbstractFuture$TrustedFuture.get(AbstractFuture.java:79) at com.android.builder.core.AndroidBuilder.processResources(AndroidBuilder.java:794) ... 121 more Caused by: java.util.concurrent.ExecutionException: com.android.tools.aapt2.Aapt2Exception: AAPT2 error: check logs for details at com.google.common.util.concurrent.AbstractFuture.getDoneValue(AbstractFuture.java:503) at com.google.common.util.concurrent.AbstractFuture.get(AbstractFuture.java:462) at com.google.common.util.concurrent.AbstractFuture$TrustedFuture.get(AbstractFuture.java:79) at com.android.builder.internal.aapt.v2.QueueableAapt2.lambda$makeValidatedPackage$1(QueueableAapt2.java:179) at java.util.concurrent.ThreadPoolExecutor.runWorker(ThreadPoolExecutor.java:1142) at java.util.concurrent.ThreadPoolExecutor$Worker.run(ThreadPoolExecutor.java:617) ... 1 more Caused by: com.android.tools.aapt2.Aapt2Exception: AAPT2 error: check logs for details at com.android.builder.png.AaptProcess$NotifierProcessOutput.handleOutput(AaptProcess.java:463) at com.android.builder.png.AaptProcess$NotifierProcessOutput.err(AaptProcess.java:415) at com.android.builder.png.AaptProcess$ProcessOutputFacade.err(AaptProcess.java:332) at com.android.utils.GrabProcessOutput$1.run(GrabProcessOutput.java:104) FAILED 36 actionable tasks: 36 executed FAILURE: Build failed with an exception. * What went wrong: Execution failed for task ':app:processDebugResources'. > Failed to execute aapt * Try: Run with --stacktrace option to get the stack trace. Run with --info or --debug option to get more log output. * Get more help at https://help.gradle.org BUILD FAILED in 31s cmd: Command failed with exit code 1 Error output: ע: ijЩ�����ļ�ʹ�û�����ѹ�ʱ�� API�� ע: �й���ϸ��Ϣ, ��ʹ�� -Xlint:deprecation ���±��롣 C:\Users\Administrator\.gradle\caches\transforms-1\files-1.1\appcompat-v7-26.1.0.aar\ac54a0ace3996090bdb7ad492e3b5bcd\re s\values\values.xml:246:5-69: AAPT: error: resource android:attr/fontVariationSettings not found. C:\Users\Administrator\.gradle\caches\transforms-1\files-1.1\appcompat-v7-26.1.0.aar\ac54a0ace3996090bdb7ad492e3b5bcd\re s\values\values.xml:246:5-69: AAPT: error: resource android:attr/ttcIndex not found. D:\Code\YSDA\ysda\platforms\android\app\build\intermediates\incremental\mergeDebugResources\merged.dir\values\values.xml :248: error: resource android:attr/fontVariationSettings not found. D:\Code\YSDA\ysda\platforms\android\app\build\intermediates\incremental\mergeDebugResources\merged.dir\values\values.xml :248: error: resource android:attr/ttcIndex not found. error: failed linking references. Failed to execute aapt com.android.ide.common.process.ProcessException: Failed to execute aapt at com.android.builder.core.AndroidBuilder.processResources(AndroidBuilder.java:796) at com.android.build.gradle.tasks.ProcessAndroidResources.invokeAaptForSplit(ProcessAndroidResources.java:551) at com.android.build.gradle.tasks.ProcessAndroidResources.doFullTaskAction(ProcessAndroidResources.java:285) at com.android.build.gradle.internal.tasks.IncrementalTask.taskAction(IncrementalTask.java:109) at sun.reflect.GeneratedMethodAccessor182.invoke(Unknown Source) at sun.reflect.DelegatingMethodAccessorImpl.invoke(DelegatingMethodAccessorImpl.java:43) at java.lang.reflect.Method.invoke(Method.java:498) at org.gradle.internal.reflect.JavaMethod.invoke(JavaMethod.java:73) at org.gradle.api.internal.project.taskfactory.DefaultTaskClassInfoStore$IncrementalTaskAction.doExecute(Default TaskClassInfoStore.java:173) at org.gradle.api.internal.project.taskfactory.DefaultTaskClassInfoStore$StandardTaskAction.execute(DefaultTaskC lassInfoStore.java:134) at org.gradle.api.internal.project.taskfactory.DefaultTaskClassInfoStore$StandardTaskAction.execute(DefaultTaskC lassInfoStore.java:121) at org.gradle.api.internal.tasks.execution.ExecuteActionsTaskExecuter$1.run(ExecuteActionsTaskExecuter.java:122) at org.gradle.internal.progress.DefaultBuildOperationExecutor$RunnableBuildOperationWorker.execute(DefaultBuildO perationExecutor.java:336) at org.gradle.internal.progress.DefaultBuildOperationExecutor$RunnableBuildOperationWorker.execute(DefaultBuildO perationExecutor.java:328) at org.gradle.internal.progress.DefaultBuildOperationExecutor.execute(DefaultBuildOperationExecutor.java:197) at org.gradle.internal.progress.DefaultBuildOperationExecutor.run(DefaultBuildOperationExecutor.java:107) at org.gradle.api.internal.tasks.execution.ExecuteActionsTaskExecuter.executeAction(ExecuteActionsTaskExecuter.j ava:111) at org.gradle.api.internal.tasks.execution.ExecuteActionsTaskExecuter.executeActions(ExecuteActionsTaskExecuter. java:92) at org.gradle.api.internal.tasks.execution.ExecuteActionsTaskExecuter.execute(ExecuteActionsTaskExecuter.java:70 ) at org.gradle.api.internal.tasks.execution.SkipUpToDateTaskExecuter.execute(SkipUpToDateTaskExecuter.java:63) at org.gradle.api.internal.tasks.execution.ResolveTaskOutputCachingStateExecuter.execute(ResolveTaskOutputCachin gStateExecuter.java:54) at org.gradle.api.internal.tasks.execution.ValidatingTaskExecuter.execute(ValidatingTaskExecuter.java:58) at org.gradle.api.internal.tasks.execution.SkipEmptySourceFilesTaskExecuter.execute(SkipEmptySourceFilesTaskExec uter.java:88) at org.gradle.api.internal.tasks.execution.ResolveTaskArtifactStateTaskExecuter.execute(ResolveTaskArtifactState TaskExecuter.java:52) at org.gradle.api.internal.tasks.execution.SkipTaskWithNoActionsExecuter.execute(SkipTaskWithNoActionsExecuter.j ava:52) at org.gradle.api.internal.tasks.execution.SkipOnlyIfTaskExecuter.execute(SkipOnlyIfTaskExecuter.java:54) at org.gradle.api.internal.tasks.execution.ExecuteAtMostOnceTaskExecuter.execute(ExecuteAtMostOnceTaskExecuter.j ava:43) at org.gradle.api.internal.tasks.execution.CatchExceptionTaskExecuter.execute(CatchExceptionTaskExecuter.java:34 ) at org.gradle.execution.taskgraph.DefaultTaskGraphExecuter$EventFiringTaskWorker$1.run(DefaultTaskGraphExecuter. java:248) at org.gradle.internal.progress.DefaultBuildOperationExecutor$RunnableBuildOperationWorker.execute(DefaultBuildO perationExecutor.java:336) at org.gradle.internal.progress.DefaultBuildOperationExecutor$RunnableBuildOperationWorker.execute(DefaultBuildO perationExecutor.java:328) at org.gradle.internal.progress.DefaultBuildOperationExecutor.execute(DefaultBuildOperationExecutor.java:197) at org.gradle.internal.progress.DefaultBuildOperationExecutor.run(DefaultBuildOperationExecutor.java:107) at org.gradle.execution.taskgraph.DefaultTaskGraphExecuter$EventFiringTaskWorker.execute(DefaultTaskGraphExecute r.java:241) at org.gradle.execution.taskgraph.DefaultTaskGraphExecuter$EventFiringTaskWorker.execute(DefaultTaskGraphExecute r.java:230) at org.gradle.execution.taskgraph.DefaultTaskPlanExecutor$TaskExecutorWorker.processTask(DefaultTaskPlanExecutor .java:124) at org.gradle.execution.taskgraph.DefaultTaskPlanExecutor$TaskExecutorWorker.access$200(DefaultTaskPlanExecutor. java:80) at org.gradle.execution.taskgraph.DefaultTaskPlanExecutor$TaskExecutorWorker$1.execute(DefaultTaskPlanExecutor.j ava:105) at org.gradle.execution.taskgraph.DefaultTaskPlanExecutor$TaskExecutorWorker$1.execute(DefaultTaskPlanExecutor.j ava:99) at org.gradle.execution.taskgraph.DefaultTaskExecutionPlan.execute(DefaultTaskExecutionPlan.java:625) at org.gradle.execution.taskgraph.DefaultTaskExecutionPlan.executeWithTask(DefaultTaskExecutionPlan.java:580) at org.gradle.execution.taskgraph.DefaultTaskPlanExecutor$TaskExecutorWorker.run(DefaultTaskPlanExecutor.java:99 ) at org.gradle.execution.taskgraph.DefaultTaskPlanExecutor.process(DefaultTaskPlanExecutor.java:60) at org.gradle.execution.taskgraph.DefaultTaskGraphExecuter.execute(DefaultTaskGraphExecuter.java:128) at org.gradle.execution.SelectedTaskExecutionAction.execute(SelectedTaskExecutionAction.java:37) at org.gradle.execution.DefaultBuildExecuter.execute(DefaultBuildExecuter.java:37) at org.gradle.execution.DefaultBuildExecuter.access$000(DefaultBuildExecuter.java:23) at org.gradle.execution.DefaultBuildExecuter$1.proceed(DefaultBuildExecuter.java:43) at org.gradle.execution.DryRunBuildExecutionAction.execute(DryRunBuildExecutionAction.java:46) at org.gradle.execution.DefaultBuildExecuter.execute(DefaultBuildExecuter.java:37) at org.gradle.execution.DefaultBuildExecuter.execute(DefaultBuildExecuter.java:30) at org.gradle.initialization.DefaultGradleLauncher$ExecuteTasks.run(DefaultGradleLauncher.java:311) at org.gradle.internal.progress.DefaultBuildOperationExecutor$RunnableBuildOperationWorker.execute(DefaultBuildO perationExecutor.java:336) at org.gradle.internal.progress.DefaultBuildOperationExecutor$RunnableBuildOperationWorker.execute(DefaultBuildO perationExecutor.java:328) at org.gradle.internal.progress.DefaultBuildOperationExecutor.execute(DefaultBuildOperationExecutor.java:197) at org.gradle.internal.progress.DefaultBuildOperationExecutor.run(DefaultBuildOperationExecutor.java:107) at org.gradle.initialization.DefaultGradleLauncher.runTasks(DefaultGradleLauncher.java:202) at org.gradle.initialization.DefaultGradleLauncher.doBuildStages(DefaultGradleLauncher.java:132) at org.gradle.initialization.DefaultGradleLauncher.executeTasks(DefaultGradleLauncher.java:107) at org.gradle.internal.invocation.GradleBuildController$1.call(GradleBuildController.java:78) at org.gradle.internal.invocation.GradleBuildController$1.call(GradleBuildController.java:75) at org.gradle.internal.work.DefaultWorkerLeaseService.withLocks(DefaultWorkerLeaseService.java:152) at org.gradle.internal.invocation.GradleBuildController.doBuild(GradleBuildController.java:100) at org.gradle.internal.invocation.GradleBuildController.run(GradleBuildController.java:75) at org.gradle.tooling.internal.provider.ExecuteBuildActionRunner.run(ExecuteBuildActionRunner.java:28) at org.gradle.launcher.exec.ChainingBuildActionRunner.run(ChainingBuildActionRunner.java:35) at org.gradle.tooling.internal.provider.ValidatingBuildActionRunner.run(ValidatingBuildActionRunner.java:32) at org.gradle.launcher.exec.RunAsBuildOperationBuildActionRunner$1.run(RunAsBuildOperationBuildActionRunner.java :43) at org.gradle.internal.progress.DefaultBuildOperationExecutor$RunnableBuildOperationWorker.execute(DefaultBuildO perationExecutor.java:336) at org.gradle.internal.progress.DefaultBuildOperationExecutor$RunnableBuildOperationWorker.execute(DefaultBuildO perationExecutor.java:328) at org.gradle.internal.progress.DefaultBuildOperationExecutor.execute(DefaultBuildOperationExecutor.java:197) at org.gradle.internal.progress.DefaultBuildOperationExecutor.run(DefaultBuildOperationExecutor.java:107) at org.gradle.launcher.exec.RunAsBuildOperationBuildActionRunner.run(RunAsBuildOperationBuildActionRunner.java:4 0) at org.gradle.tooling.internal.provider.SubscribableBuildActionRunner.run(SubscribableBuildActionRunner.java:51) at org.gradle.launcher.exec.InProcessBuildActionExecuter.execute(InProcessBuildActionExecuter.java:45) at org.gradle.launcher.exec.InProcessBuildActionExecuter.execute(InProcessBuildActionExecuter.java:29) at org.gradle.launcher.exec.BuildTreeScopeBuildActionExecuter.execute(BuildTreeScopeBuildActionExecuter.java:39) at org.gradle.launcher.exec.BuildTreeScopeBuildActionExecuter.execute(BuildTreeScopeBuildActionExecuter.java:25) at org.gradle.tooling.internal.provider.ContinuousBuildActionExecuter.execute(ContinuousBuildActionExecuter.java :71) at org.gradle.tooling.internal.provider.ContinuousBuildActionExecuter.execute(ContinuousBuildActionExecuter.java :45) at org.gradle.tooling.internal.provider.ServicesSetupBuildActionExecuter.execute(ServicesSetupBuildActionExecute r.java:51) at org.gradle.tooling.internal.provider.ServicesSetupBuildActionExecuter.execute(ServicesSetupBuildActionExecute r.java:32) at org.gradle.tooling.internal.provider.GradleThreadBuildActionExecuter.execute(GradleThreadBuildActionExecuter. java:36) at org.gradle.tooling.internal.provider.GradleThreadBuildActionExecuter.execute(GradleThreadBuildActionExecuter. java:25) at org.gradle.tooling.internal.provider.ParallelismConfigurationBuildActionExecuter.execute(ParallelismConfigura tionBuildActionExecuter.java:43) at org.gradle.tooling.internal.provider.ParallelismConfigurationBuildActionExecuter.execute(ParallelismConfigura tionBuildActionExecuter.java:29) at org.gradle.tooling.internal.provider.StartParamsValidatingActionExecuter.execute(StartParamsValidatingActionE xecuter.java:64) at org.gradle.tooling.internal.provider.StartParamsValidatingActionExecuter.execute(StartParamsValidatingActionE xecuter.java:29) at org.gradle.tooling.internal.provider.SessionFailureReportingActionExecuter.execute(SessionFailureReportingAct ionExecuter.java:55) at org.gradle.tooling.internal.provider.SessionFailureReportingActionExecuter.execute(SessionFailureReportingAct ionExecuter.java:42) at org.gradle.tooling.internal.provider.SetupLoggingActionExecuter.execute(SetupLoggingActionExecuter.java:58) at org.gradle.tooling.internal.provider.SetupLoggingActionExecuter.execute(SetupLoggingActionExecuter.java:33) at org.gradle.launcher.daemon.server.exec.ExecuteBuild.doBuild(ExecuteBuild.java:67) at org.gradle.launcher.daemon.server.exec.BuildCommandOnly.execute(BuildCommandOnly.java:36) at org.gradle.launcher.daemon.server.api.DaemonCommandExecution.proceed(DaemonCommandExecution.java:120) at org.gradle.launcher.daemon.server.exec.WatchForDisconnection.execute(WatchForDisconnection.java:37) at org.gradle.launcher.daemon.server.api.DaemonCommandExecution.proceed(DaemonCommandExecution.java:120) at org.gradle.launcher.daemon.server.exec.ResetDeprecationLogger.execute(ResetDeprecationLogger.java:26) at org.gradle.launcher.daemon.server.api.DaemonCommandExecution.proceed(DaemonCommandExecution.java:120) at org.gradle.launcher.daemon.server.exec.RequestStopIfSingleUsedDaemon.execute(RequestStopIfSingleUsedDaemon.ja va:34) at org.gradle.launcher.daemon.server.api.DaemonCommandExecution.proceed(DaemonCommandExecution.java:120) at org.gradle.launcher.daemon.server.exec.ForwardClientInput$2.call(ForwardClientInput.java:74) at org.gradle.launcher.daemon.server.exec.ForwardClientInput$2.call(ForwardClientInput.java:72) at org.gradle.util.Swapper.swap(Swapper.java:38) at org.gradle.launcher.daemon.server.exec.ForwardClientInput.execute(ForwardClientInput.java:72) at org.gradle.launcher.daemon.server.api.DaemonCommandExecution.proceed(DaemonCommandExecution.java:120) at org.gradle.launcher.daemon.server.exec.LogAndCheckHealth.execute(LogAndCheckHealth.java:55) at org.gradle.launcher.daemon.server.api.DaemonCommandExecution.proceed(DaemonCommandExecution.java:120) at org.gradle.launcher.daemon.server.exec.LogToClient.doBuild(LogToClient.java:62) at org.gradle.launcher.daemon.server.exec.BuildCommandOnly.execute(BuildCommandOnly.java:36) at org.gradle.launcher.daemon.server.api.DaemonCommandExecution.proceed(DaemonCommandExecution.java:120) at org.gradle.launcher.daemon.server.exec.EstablishBuildEnvironment.doBuild(EstablishBuildEnvironment.java:82) at org.gradle.launcher.daemon.server.exec.BuildCommandOnly.execute(BuildCommandOnly.java:36) at org.gradle.launcher.daemon.server.api.DaemonCommandExecution.proceed(DaemonCommandExecution.java:120) at org.gradle.launcher.daemon.server.exec.StartBuildOrRespondWithBusy$1.run(StartBuildOrRespondWithBusy.java:50) at org.gradle.launcher.daemon.server.DaemonStateCoordinator$1.run(DaemonStateCoordinator.java:297) at org.gradle.internal.concurrent.ExecutorPolicy$CatchAndRecordFailures.onExecute(ExecutorPolicy.java:63) at org.gradle.internal.concurrent.ManagedExecutorImpl$1.run(ManagedExecutorImpl.java:46) at java.util.concurrent.ThreadPoolExecutor.runWorker(ThreadPoolExecutor.java:1142) at java.util.concurrent.ThreadPoolExecutor$Worker.run(ThreadPoolExecutor.java:617) at org.gradle.internal.concurrent.ThreadFactoryImpl$ManagedThreadRunnable.run(ThreadFactoryImpl.java:55) at java.lang.Thread.run(Thread.java:745) Caused by: java.util.concurrent.ExecutionException: java.util.concurrent.ExecutionException: com.android.tools.aapt2.Aap t2Exception: AAPT2 error: check logs for details at com.google.common.util.concurrent.AbstractFuture.getDoneValue(AbstractFuture.java:503) at com.google.common.util.concurrent.AbstractFuture.get(AbstractFuture.java:482) at com.google.common.util.concurrent.AbstractFuture$TrustedFuture.get(AbstractFuture.java:79) at com.android.builder.core.AndroidBuilder.processResources(AndroidBuilder.java:794) ... 121 more Caused by: java.util.concurrent.ExecutionException: com.android.tools.aapt2.Aapt2Exception: AAPT2 error: check logs for details at com.google.common.util.concurrent.AbstractFuture.getDoneValue(AbstractFuture.java:503) at com.google.common.util.concurrent.AbstractFuture.get(AbstractFuture.java:462) at com.google.common.util.concurrent.AbstractFuture$TrustedFuture.get(AbstractFuture.java:79) at com.android.builder.internal.aapt.v2.QueueableAapt2.lambda$makeValidatedPackage$1(QueueableAapt2.java:179) at java.util.concurrent.ThreadPoolExecutor.runWorker(ThreadPoolExecutor.java:1142) at java.util.concurrent.ThreadPoolExecutor$Worker.run(ThreadPoolExecutor.java:617) ... 1 more Caused by: com.android.tools.aapt2.Aapt2Exception: AAPT2 error: check logs for details at com.android.builder.png.AaptProcess$NotifierProcessOutput.handleOutput(AaptProcess.java:463) at com.android.builder.png.AaptProcess$NotifierProcessOutput.err(AaptProcess.java:415) at com.android.builder.png.AaptProcess$ProcessOutputFacade.err(AaptProcess.java:332) at com.android.utils.GrabProcessOutput$1.run(GrabProcessOutput.java:104) FAILURE: Build failed with an exception. * What went wrong: Execution failed for task ':app:processDebugResources'. > Failed to execute aapt

一些关于Ionic的简单问题

因为没有接触过Ionic,所以有一些很低级的问题想请教各位大大 1、Ionic = Cordova + AngularJS + Ionic UI ,那么能够理解为Ionic只做前端没有做后台业务逻辑之类的吗? 2、Ionic创建一个项目,然后通过什么IDE来开发? 3、Ionic创建的项目是一个可以转化成各个平台的项目,然后添加对应的平台后就会将这个项目转为对应平台的项目,之后才进行业务逻辑开发?如果我添加android平台后在Eclipse中写了一些代码,可以转为ios吗?还是要在Xcode中编写? 谢谢。

为了使我的简单Ionic 3 WebApp GET请求正常工作,我需要在REST-API响应中设置哪些标头?

<div class="post-text" itemprop="text"> <p>I'm stuck in creating my first Ionic app.</p> <h2>Scenario:</h2> <ol> <li><p>Created a simple REST-API with Golang. It's working fine when i make the GET call in browser and / or Postman. The Output is:</p> <pre><code>[ { "id": 1, "name": "Leanne Graham" }, { "id": 100, "name": "I COME FROM YOUR OWN REST-API!!!" } ] </code></pre></li> <li><p>I created a simple Ionic 3 (with Angular 5) web app based on some tutorials. I just wanted to diplay my test data in an ionic-list with ngFor. This is working fine with some static (hard-coded) data.</p></li> <li>I then switched from hard-coded data to a REST-API. The tutorial suggested me to use <code>http://jsonplaceholder.typicode.com/users</code>. This also worked fine; I was able to display the users' data (tried only with <code>id</code> and <code>name</code>) in my ionic-list.</li> <li>I then switched to my own REST-API. I took similar (a little less) JSON content like the one from <code>http://jsonplaceholder.typicode.com/users</code>. See above.</li> </ol> <h2>Problem:</h2> <p>My ionic-list stays empty after fetching data from my own REST-API but works with any other public API.</p> <h2>Thoughts:</h2> <ul> <li>Since the content of my REST-API response is nearly the same as the one from <code>http://jsonplaceholder.typicode.com/users</code> i guess there is something wrong in my api-response headers. No tutorial covers the header stuff. This is why I didn't set them. I tried different headers in my response like <code>w.Header().Set("content-type", "application/json")</code> but this doesn't help.</li> <li>Are there general headers I always have to set when responding to a GET request from an Ionic app?</li> <li>When helpful I naturally will post my app's code here.</li> </ul> </div>

ionic3在ios上拖动页面垂直滚动出屏幕,卡死,稍后一会才正常

ionic3项目在ios上,手指拖动页面滚出屏幕外再松开手指,页面触发阻尼回弹回到原来页面,这时候再拖动页面,无法拖动,需要稍等几秒才能操作

在中国程序员是青春饭吗?

今年,我也32了 ,为了不给大家误导,咨询了猎头、圈内好友,以及年过35岁的几位老程序员……舍了老脸去揭人家伤疤……希望能给大家以帮助,记得帮我点赞哦。 目录: 你以为的人生 一次又一次的伤害 猎头界的真相 如何应对互联网行业的「中年危机」 一、你以为的人生 刚入行时,拿着傲人的工资,想着好好干,以为我们的人生是这样的: 等真到了那一天,你会发现,你的人生很可能是这样的: ...

程序员请照顾好自己,周末病魔差点一套带走我。

程序员在一个周末的时间,得了重病,差点当场去世,还好及时挽救回来了。

我以为我学懂了数据结构,直到看了这个导图才发现,我错了

数据结构与算法思维导图

String s = new String(" a ") 到底产生几个对象?

老生常谈的一个梗,到2020了还在争论,你们一天天的,哎哎哎,我不是针对你一个,我是说在座的各位都是人才! 上图红色的这3个箭头,对于通过new产生一个字符串(”宜春”)时,会先去常量池中查找是否已经有了”宜春”对象,如果没有则在常量池中创建一个此字符串对象,然后堆中再创建一个常量池中此”宜春”对象的拷贝对象。 也就是说准确答案是产生了一个或两个对象,如果常量池中原来没有 ”宜春” ,就是两个。...

技术大佬:我去,你写的 switch 语句也太老土了吧

昨天早上通过远程的方式 review 了两名新来同事的代码,大部分代码都写得很漂亮,严谨的同时注释也很到位,这令我非常满意。但当我看到他们当中有一个人写的 switch 语句时,还是忍不住破口大骂:“我擦,小王,你丫写的 switch 语句也太老土了吧!” 来看看小王写的代码吧,看完不要骂我装逼啊。 private static String createPlayer(PlayerTypes p...

Linux面试题(2020最新版)

文章目录Linux 概述什么是LinuxUnix和Linux有什么区别?什么是 Linux 内核?Linux的基本组件是什么?Linux 的体系结构BASH和DOS之间的基本区别是什么?Linux 开机启动过程?Linux系统缺省的运行级别?Linux 使用的进程间通信方式?Linux 有哪些系统日志文件?Linux系统安装多个桌面环境有帮助吗?什么是交换空间?什么是root帐户什么是LILO?什...

将一个接口响应时间从2s优化到 200ms以内的一个案例

一、背景 在开发联调阶段发现一个接口的响应时间特别长,经常超时,囧… 本文讲讲是如何定位到性能瓶颈以及修改的思路,将该接口从 2 s 左右优化到 200ms 以内 。 二、步骤 2.1 定位 定位性能瓶颈有两个思路,一个是通过工具去监控,一个是通过经验去猜想。 2.1.1 工具监控 就工具而言,推荐使用 arthas ,用到的是 trace 命令 具体安装步骤很简单,大家自行研究。 我的使用步骤是...

学历低,无法胜任工作,大佬告诉你应该怎么做

微信上收到一位读者小涛的留言,大致的意思是自己只有高中学历,经过培训后找到了一份工作,但很难胜任,考虑要不要辞职找一份他能力可以胜任的实习工作。下面是他留言的一部分内容: 二哥,我是 2016 年高中毕业的,考上了大学但没去成,主要是因为当时家里经济条件不太允许。 打工了三年后想学一门技术,就去培训了。培训的学校比较垃圾,现在非常后悔没去正规一点的机构培训。 去年 11 月份来北京找到了一份工...

JVM内存结构和Java内存模型别再傻傻分不清了

讲一讲什么是Java内存模型 Java内存模型虽说是一个老生常谈的问题 ,也是大厂面试中绕不过的,甚至初级面试也会问到。但是真正要理解起来,还是相当困难,主要这个东西看不见,摸不着。 这是一个比较开放的题目,面试官主要想考察的是对Java内存模型的了解到了什么程度了,然后根据回答进行进一步的提问 下面,我们就这个问题的回答列一下我们的思路 具体的思路如下: 说一说Java内存模型的缘由 简略辨析...

和黑客斗争的 6 天!

互联网公司工作,很难避免不和黑客们打交道,我呆过的两家互联网公司,几乎每月每天每分钟都有黑客在公司网站上扫描。有的是寻找 Sql 注入的缺口,有的是寻找线上服务器可能存在的漏洞,大部分都...

Google 与微软的浏览器之争

浏览器再现“神仙打架”。整理 | 屠敏头图 | CSDN 下载自东方 IC出品 | CSDN(ID:CSDNnews)从 IE 到 Chrome,再从 Chrome 到 Edge,微软与...

讲一个程序员如何副业月赚三万的真实故事

loonggg读完需要3分钟速读仅需 1 分钟大家好,我是你们的校长。我之前讲过,这年头,只要肯动脑,肯行动,程序员凭借自己的技术,赚钱的方式还是有很多种的。仅仅靠在公司出卖自己的劳动时...

上班一个月,后悔当初着急入职的选择了

最近有个老铁,告诉我说,上班一个月,后悔当初着急入职现在公司了。他之前在美图做手机研发,今年美图那边今年也有一波组织优化调整,他是其中一个,在协商离职后,当时捉急找工作上班,因为有房贷供着,不能没有收入来源。所以匆忙选了一家公司,实际上是一个大型外包公司,主要派遣给其他手机厂商做外包项目。**当时承诺待遇还不错,所以就立马入职去上班了。但是后面入职后,发现薪酬待遇这块并不是HR所说那样,那个HR自...

女程序员,为什么比男程序员少???

昨天看到一档综艺节目,讨论了两个话题:(1)中国学生的数学成绩,平均下来看,会比国外好?为什么?(2)男生的数学成绩,平均下来看,会比女生好?为什么?同时,我又联想到了一个技术圈经常讨...

搜狗输入法也在挑战国人的智商!

故事总是一个接着一个到来...上周写完《鲁大师已经彻底沦为一款垃圾流氓软件!》这篇文章之后,鲁大师的市场工作人员就找到了我,希望把这篇文章删除掉。经过一番沟通我先把这篇文章从公号中删除了...

85后蒋凡:28岁实现财务自由、34岁成为阿里万亿电商帝国双掌门,他的人生底层逻辑是什么?...

蒋凡是何许人也? 2017年12月27日,在入职4年时间里,蒋凡开挂般坐上了淘宝总裁位置。 为此,时任阿里CEO张勇在任命书中力赞: 蒋凡加入阿里,始终保持创业者的冲劲,有敏锐的...

总结了 150 余个神奇网站,你不来瞅瞅吗?

原博客再更新,可能就没了,之后将持续更新本篇博客。

副业收入是我做程序媛的3倍,工作外的B面人生是怎样的?

提到“程序员”,多数人脑海里首先想到的大约是:为人木讷、薪水超高、工作枯燥…… 然而,当离开工作岗位,撕去层层标签,脱下“程序员”这身外套,有的人生动又有趣,马上展现出了完全不同的A/B面人生! 不论是简单的爱好,还是正经的副业,他们都干得同样出色。偶尔,还能和程序员的特质结合,产生奇妙的“化学反应”。 @Charlotte:平日素颜示人,周末美妆博主 大家都以为程序媛也个个不修边幅,但我们也许...

MySQL数据库面试题(2020最新版)

文章目录数据库基础知识为什么要使用数据库什么是SQL?什么是MySQL?数据库三大范式是什么mysql有关权限的表都有哪几个MySQL的binlog有有几种录入格式?分别有什么区别?数据类型mysql有哪些数据类型引擎MySQL存储引擎MyISAM与InnoDB区别MyISAM索引与InnoDB索引的区别?InnoDB引擎的4大特性存储引擎选择索引什么是索引?索引有哪些优缺点?索引使用场景(重点)...

如果你是老板,你会不会踢了这样的员工?

有个好朋友ZS,是技术总监,昨天问我:“有一个老下属,跟了我很多年,做事勤勤恳恳,主动性也很好。但随着公司的发展,他的进步速度,跟不上团队的步伐了,有点...

我入职阿里后,才知道原来简历这么写

私下里,有不少读者问我:“二哥,如何才能写出一份专业的技术简历呢?我总感觉自己写的简历太烂了,所以投了无数份,都石沉大海了。”说实话,我自己好多年没有写过简历了,但我认识的一个同行,他在阿里,给我说了一些他当年写简历的方法论,我感觉太牛逼了,实在是忍不住,就分享了出来,希望能够帮助到你。 01、简历的本质 作为简历的撰写者,你必须要搞清楚一点,简历的本质是什么,它就是为了来销售你的价值主张的。往深...

离职半年了,老东家又发 offer,回不回?

有小伙伴问松哥这个问题,他在上海某公司,在离职了几个月后,前公司的领导联系到他,希望他能够返聘回去,他很纠结要不要回去? 俗话说好马不吃回头草,但是这个小伙伴既然感到纠结了,我觉得至少说明了两个问题:1.曾经的公司还不错;2.现在的日子也不是很如意。否则应该就不会纠结了。 老实说,松哥之前也有过类似的经历,今天就来和小伙伴们聊聊回头草到底吃不吃。 首先一个基本观点,就是离职了也没必要和老东家弄的苦...

男生更看重女生的身材脸蛋,还是思想?

往往,我们看不进去大段大段的逻辑。深刻的哲理,往往短而精悍,一阵见血。问:产品经理挺漂亮的,有点心动,但不知道合不合得来。男生更看重女生的身材脸蛋,还是...

什么时候跳槽,为什么离职,你想好了么?

都是出来打工的,多为自己着想

程序员为什么千万不要瞎努力?

本文作者用对比非常鲜明的两个开发团队的故事,讲解了敏捷开发之道 —— 如果你的团队缺乏统一标准的环境,那么即使勤劳努力,不仅会极其耗时而且成果甚微,使用...

为什么程序员做外包会被瞧不起?

二哥,有个事想询问下您的意见,您觉得应届生值得去外包吗?公司虽然挺大的,中xx,但待遇感觉挺低,马上要报到,挺纠结的。

当HR压你价,说你只值7K,你该怎么回答?

当HR压你价,说你只值7K时,你可以流畅地回答,记住,是流畅,不能犹豫。 礼貌地说:“7K是吗?了解了。嗯~其实我对贵司的面试官印象很好。只不过,现在我的手头上已经有一份11K的offer。来面试,主要也是自己对贵司挺有兴趣的,所以过来看看……”(未完) 这段话主要是陪HR互诈的同时,从公司兴趣,公司职员印象上,都给予对方正面的肯定,既能提升HR的好感度,又能让谈判气氛融洽,为后面的发挥留足空间。...

面试:第十六章:Java中级开发(16k)

HashMap底层实现原理,红黑树,B+树,B树的结构原理 Spring的AOP和IOC是什么?它们常见的使用场景有哪些?Spring事务,事务的属性,传播行为,数据库隔离级别 Spring和SpringMVC,MyBatis以及SpringBoot的注解分别有哪些?SpringMVC的工作原理,SpringBoot框架的优点,MyBatis框架的优点 SpringCould组件有哪些,他们...

面试阿里p7,被按在地上摩擦,鬼知道我经历了什么?

面试阿里p7被问到的问题(当时我只知道第一个):@Conditional是做什么的?@Conditional多个条件是什么逻辑关系?条件判断在什么时候执...

终于懂了TCP和UDP协议区别

终于懂了TCP和UDP协议区别

立即提问
相关内容推荐