maven项目jar包missing的问题

开发工具是myesclipse 网上的update 删除仓库的jar包 等等方法都试过了不好使。
有没有解决方法

1个回答

maven加-U参数

 mvn -U package 

看看哪个下载不下来

Csdn user default icon
上传中...
上传图片
插入图片
抄袭、复制答案,以达到刷声望分或其他目的的行为,在CSDN问答是严格禁止的,一经发现立刻封号。是时候展现真正的技术了!
其他相关推荐
maven引入外部jar包,jar包在其他项目的target目录下,引入不成功

<scope>system</scope>  <systemPath>${basedir}/../cachecore/target/cachecore.jar</systemPath>   这是maven引入外部jar包的两个参数。但死活引入不进去,最后把jar包放到targer文件夹外边,路径改成这样 <systemPath>${basedir}/../cachecore/target/cachecore.jar</systemPath> OK啦,为什么放到target目录里面就不行呢?不明白。有了解的朋友请指点一下,感谢!

maven错误 jar包没有错误只有红叉

maven项目 could not calculate build plan:missing![图片说明](https://img-ask.csdn.net/upload/201707/05/1499252096_246037.png)

在maven更新依赖的时候,无法下载jar包,一直报missing

我这边导公司的项目在maven更新依赖的时候,无法下载jar包,一直报missing,只能吧包的pom文件下载下来,请各位有经验的大神们帮我看看![图片说明](https://img-ask.csdn.net/upload/201504/15/1429062403_10129.jpg)![图片说明](https://img-ask.csdn.net/upload/201504/15/1429062418_99233.jpg)

通过pom依赖导入jar包,在maven dependencies中显示missing?大神们,怎么解决啊?

![图片说明](https://img-ask.csdn.net/upload/201905/14/1557820419_755869.png) ![图片说明](https://img-ask.csdn.net/upload/201905/14/1557820284_416561.png)

maven 中 eclipse>>maven install成jar文件问题

maven install成war文件的话 自动把关联的jar包放在libs文件夹中。 但是install成jar文件的话不会包含关联的jar。 请问有什么办法解决吗?

pom文件无法下载maven中央库的jar包

今天从github上看到一个比较好的开源框架想用一下,结果在项目pom文件中引入jar包,一直下载失败,请大家帮忙看下是什么原因 ``` <dependency> <groupId>com.github.anji-plus</groupId> <artifactId>captcha</artifactId> <version>1.1.4</version> </dependency> ``` 这是pom文件,我在maven的远程仓库也确实找到了这个jar包 ``` https://repo1.maven.org/maven2/com/github/anji-plus/captcha/1.1.4/ ``` 以下是我的本地maven settings.xml配置,连接是的maven的远程库 ``` <mirror> <id>central</id> <name>Maven Repository Switchboard</name> <url>https://repo1.maven.org/maven2/</url> <mirrorOf>central</mirrorOf> </mirror> ``` 然后idea下载不到这个jar包 ![图片说明](https://img-ask.csdn.net/upload/202005/09/1589005154_403704.jpg) 求解是哪个地方出了问题

maven项目编译时jar包冲突相关问题

从开源代码上拷下来一个源码学习,执行mvn clean install时报错: [WARNING] Error injecting: aQute.bnd.maven.plugin.BndMavenPlugin java.lang.NoClassDefFoundError: org/codehaus/plexus/util/Scanner at java.lang.Class.getDeclaredConstructors0(Native Method) at java.lang.Class.privateGetDeclaredConstructors(Class.java:2671) at java.lang.Class.getDeclaredConstructors(Class.java:2020) at com.google.inject.spi.InjectionPoint.forConstructorOf(InjectionPoint.java:245) at com.google.inject.internal.ConstructorBindingImpl.create(ConstructorBindingImpl.java:99) at com.google.inject.internal.InjectorImpl.createUninitializedBinding(InjectorImpl.java:658) at com.google.inject.internal.InjectorImpl.createJustInTimeBinding(InjectorImpl.java:882) at com.google.inject.internal.InjectorImpl.createJustInTimeBindingRecursive(InjectorImpl.java:805) at com.google.inject.internal.InjectorImpl.getJustInTimeBinding(InjectorImpl.java:282) at com.google.inject.internal.InjectorImpl.getBindingOrThrow(InjectorImpl.java:214) at com.google.inject.internal.InjectorImpl.getProviderOrThrow(InjectorImpl.java:1006) at com.google.inject.internal.InjectorImpl.getProvider(InjectorImpl.java:1038) at com.google.inject.internal.InjectorImpl.getProvider(InjectorImpl.java:1001) at com.google.inject.internal.InjectorImpl.getInstance(InjectorImpl.java:1051) at org.eclipse.sisu.space.AbstractDeferredClass.get(AbstractDeferredClass.java:48) at com.google.inject.internal.ProviderInternalFactory.provision(ProviderInternalFactory.java:81) at com.google.inject.internal.InternalFactoryToInitializableAdapter.provision(InternalFactoryToInitializableAdapter.java:53) at com.google.inject.internal.ProviderInternalFactory$1.call(ProviderInternalFactory.java:65) at com.google.inject.internal.ProvisionListenerStackCallback$Provision.provision(ProvisionListenerStackCallback.java:115) ........ Caused by: java.lang.ClassNotFoundException: org.codehaus.plexus.util.Scanner ........ [INFO] ------------------------------------------------------------------------ [INFO] BUILD FAILURE [INFO] ------------------------------------------------------------------------ [INFO] Total time: 4.616 s [INFO] Finished at: 2017-11-20T15:08:13+08:00 [INFO] Final Memory: 17M/201M [INFO] ------------------------------------------------------------------------ [ERROR] Failed to execute goal biz.aQute.bnd:bnd-maven-plugin:3.1.0:bnd-process (default) on project gson: Execution default of goal biz.aQute.bnd:bnd-maven-plugin:3.1.0:bnd-process failed: A required class was missing while executing biz.aQute.bnd:bnd-maven-plugin:3.1.0:bnd-process: org/codehaus/plexus/util/Scanner [ERROR] ----------------------------------------------------- [ERROR] realm = plugin>biz.aQute.bnd:bnd-maven-plugin:3.1.0 [ERROR] strategy = org.codehaus.plexus.classworlds.strategy.SelfFirstStrategy [ERROR] urls[0] = file:/Users/dasouche/.m2/repository/biz/aQute/bnd/bnd-maven-plugin/3.1.0/bnd-maven-plugin-3.1.0.jar [ERROR] urls[1] = file:/Users/dasouche/.m2/repository/org/sonatype/plexus/plexus-build-api/0.0.7/plexus-build-api-0.0.7.jar [ERROR] urls[2] = file:/Users/dasouche/.m2/repository/biz/aQute/bnd/biz.aQute.bndlib/3.1.0/biz.aQute.bndlib-3.1.0.jar [ERROR] urls[3] = file:/Users/dasouche/.m2/repository/org/codehaus/plexus/plexus-utils/1.1/plexus-utils-1.1.jar [ERROR] Number of foreign imports: 1 [ERROR] import: Entry[import from realm ClassRealm[maven.api, parent: null]] [ERROR] [ERROR] ----------------------------------------------------- [ERROR] : org.codehaus.plexus.util.Scanner [ERROR] -> [Help 1] [ERROR] [ERROR] To see the full stack trace of the errors, re-run Maven with the -e switch. [ERROR] Re-run Maven using the -X switch to enable full debug logging. [ERROR] [ERROR] For more information about the errors and possible solutions, please read the following articles: [ERROR] [Help 1] http://cwiki.apache.org/confluence/display/MAVEN/PluginContainerException 在项目的pom.xml文件中添加jar包依赖明确版本号: <dependency> <groupId>org.codehaus.plexus</groupId> <artifactId>plexus-utils</artifactId> <version>3.0.5</version> </dependency> 依然报上面的错误。 请问各位大神这个是什么问题,怎么解决?

怎么查看maven的pom.xml是否成功下载了所需jar包

## 如题,pom.xml动不动就要报错,不知道是不是因为没有成功下载jar的原因? ![图片说明](https://img-ask.csdn.net/upload/201606/23/1466666764_888875.jpg) Multiple annotations found at this line: - Missing artifact org.apache.maven:maven-artifact:jar:2.0.6:compile - Missing artifact org.apache.maven.shared:maven-filtering:jar:1.0-beta-4:compile - Missing artifact org.apache.maven:maven-profile:jar:2.0.6:compile - Missing artifact org.apache.maven.reporting:maven-reporting-api:jar: 2.0.6:compile - Missing artifact org.apache.maven:maven-plugin-descriptor:jar:2.0.6:compile - Missing artifact org.apache.maven.wagon:wagon-ssh:jar:1.0-beta-2:runtime - Missing artifact org.apache.maven.wagon:wagon-ssh-external:jar:1.0- beta-2:runtime - Missing artifact org.apache.maven:maven-artifact-manager:jar:2.0.6:compile - Missing artifact org.apache.maven:maven-plugin-registry:jar:2.0.6:compile - Missing artifact org.apache.maven:maven-project:jar:2.0.6:compile - Missing artifact org.apache.maven:maven-plugin-api:jar:2.0.6:compile - Missing artifact org.codehaus.plexus:plexus-utils:jar:2.0.5:compile - Missing artifact com.jcraft:jsch:jar:0.1.27:runtime - Missing artifact commons-cli:commons-cli:jar:1.0:compile - Missing artifact org.apache.maven.wagon:wagon-ssh-common:jar:1.0- beta-2:runtime - Missing artifact org.codehaus.plexus:plexus-interactivity-api:jar:1.0- alpha-4:compile - Missing artifact org.wisdom-framework:mysql-connector-java:jar:5.1.34_1:compile - Failed to read artifact descriptor for org.wisdom-framework:abstract-jdbc- driver:jar:0.5 - Missing artifact org.apache.maven.wagon:wagon-file:jar:1.0-beta-2:runtime - Missing artifact org.sonatype.plexus:plexus-build-api:jar:0.0.4:compile - Missing artifact classworlds:classworlds:jar:1.1:compile - Missing artifact org.apache.maven.plugins:maven-resources-plugin:jar: 2.4.3:compile - Missing artifact org.apache.felix:org.apache.felix.ipojo.annotations:jar: 1.12.1:compile - Missing artifact org.codehaus.plexus:plexus-interpolation:jar:1.13:compile - Missing artifact org.apache.maven.wagon:wagon-provider-api:jar:1.0- beta-2:compile - Missing artifact org.apache.maven:maven-monitor:jar:2.0.6:compile - Missing artifact xml-apis:xml-apis:jar:1.0.b2:runtime - Missing artifact org.apache.maven.wagon:wagon-http-shared:jar:1.0- beta-2:runtime - Missing artifact jtidy:jtidy:jar:4aug2000r7-dev:runtime - Missing artifact org.apache.maven:maven-core:jar:2.0.6:compile - Missing artifact org.apache.maven:maven-settings:jar:2.0.6:compile - Missing artifact org.apache.maven:maven-model:jar:2.0.6:compile - Missing artifact org.apache.maven.doxia:doxia-sink-api:jar:1.0-alpha-7:compile - Missing artifact org.apache.maven.wagon:wagon-http-lightweight:jar:1.0- beta-2:runtime - Missing artifact org.apache.maven:maven-repository-metadata:jar:2.0.6:compile - Missing artifact org.apache.maven:maven-error-diagnostics:jar:2.0.6:compile - Missing artifact org.codehaus.plexus:plexus-container-default:jar:1.0-alpha-9- stable-1:compile - Missing artifact junit:junit:jar:3.8.1:test - Missing artifact org.apache.maven:maven-plugin-parameter-documenter:jar: 2.0.6:compile

maven项目debug tomcat:run为啥不能自动关联jar包的源代码

所有jar包的源代码都已经自动下载了,并且在项目的jar包中打开class文件是可以看到源代码的,在Debug Configurations的source里面已经把项目和m2_repo都加进去了,在debug的时候死活就是看不到源代码,报source not found,网上找了很多,都没有用,并且没有说到关键点上,求遇到这个坑的大侠帮帮忙。

idea中jar包缺失但是Maven Project不报红

打开其他项目也出现这种情况![图片说明](https://img-ask.csdn.net/upload/201906/26/1561538379_524715.png)

maven打包Springboot项目报错,求大佬们解决

[INFO] Scanning for projects... [ERROR] [ERROR] Some problems were encountered while processing the POMs: [ERROR] 'dependencies.dependency.version' for org.springframework.boot:spring-boot-starter-redis:jar is missing. @ cn.testin:TestinStack:0.0.1-SNAPSHOT, E:\yunce\TestinStack\pom.xml, line 31, column 15 @ [ERROR] The build could not read 1 project -> [Help 1] [ERROR] [ERROR] The project cn.testin:TS.UnityPlatform:0.0.1-SNAPSHOT (E:\yunce\TestinStack\TS.UnityPlatform\pom.xml) has 1 error [ERROR] 'dependencies.dependency.version' for org.springframework.boot:spring-boot-starter-redis:jar is missing. @ cn.testin:TestinStack:0.0.1-SNAPSHOT, E:\yunce\TestinStack\pom.xml, line 31, column 15 [ERROR] [ERROR] To see the full stack trace of the errors, re-run Maven with the -e switch. [ERROR] Re-run Maven using the -X switch to enable full debug logging. [ERROR] [ERROR] For more information about the errors and possible solutions, please read the following articles: [ERROR] [Help 1] http://cwiki.apache.org/confluence/display/MAVEN/ProjectBuildingException Process finished with exit code 1

关于maven仓库的问题 Missing artifact

我建了一个私服nexus nexus有公共库包含了中央库和三方库和apache的快照库 配置镜像是从私服下载 <mirror> <id>nexus</id> <name>Nexus</name> <mirrorOf>*</mirrorOf> <url>http://127.0.0.1:8081/nexus/content/groups/public/</url> </mirror> ---------------------------------- 项目中配置 <dependencies> <dependency> <groupId>commons-logging</groupId> <artifactId>commons-logging</artifactId> <version>1.1.1</version> </dependency> </dependencies> 项目中报错 10-12-28 上午11时05分58秒: [WARN] The POM for commons-logging:commons-logging:jar:1.1.1 is missing, no dependency information available 10-12-28 上午11时05分58秒: Missing artifact commons-logging:commons-logging:jar:1.1.1:compile 但是我看 http://127.0.0.1:8081/nexus/content/repositories/central/commons-logging/commons-logging/1.1.1/是有这个jar的 http://127.0.0.1:8081/nexus/content/repositories/public/中没有 Download Remote Indexes 也设成了true 也reindex过了 index都很正常 jar也能搜到 我是初学者,很是不理解 是什么原因呢 哪位大侠解释下????

maven项目pom.xml报错

配置文件如图,错误如下: -The parameters 'finalName' for goal org.apache.maven.plugins:maven-jar-plugin:2.4:jar are missing or invalid -The project cannot be built until build path errors are resolved 该如何解决?![图片说明](https://img-ask.csdn.net/upload/201807/27/1532662553_952578.png)

[Maven] Missing artifact

eclipse新建一个maven项目后依赖的第三方jar包自动下载了,但是自己新建的pojo层jar包找不到, ![图片说明](https://img-ask.csdn.net/upload/201512/30/1451481303_866203.jpg) ![图片说明](https://img-ask.csdn.net/upload/201512/30/1451481369_532994.jpg)

maven项目导入到Eclipse中红色叹号!

最近看一个开源CMS系统Magnolia。 环境: Ubuntu14,Eclipse4.4 for j2ee,jdk1.6,tomcat6,maven2.2.1 按照文档,写了一个小项目。用maven。在命令行创建的项目结构大概: myProject ----myProject-webapp ----myTemplateModule 下面两个是上面的module。 在命令行中已经clean install成功。 但是导入到Eclipse中myProject-webapp项目的图标上有红色感叹号。 ![CSDN移动问答][1] 网上说是jar引用问题。我在buildpath》library中没有发现有问题的jar啊,也尝试过order and export,sellect all。打开.classpath里面貌似也没有引用什么jar啊。内容如下:.classpath. 另外,myProject项目上还有个红叉,其中的一个文件引用的某个类,Eclipse说找不到,可是我在library中都找到这个类了。 ![CSDN移动问答][2] 后来,我不管这个红色提醒,就把myProject-webapp部署在tomcat上面了。运行错误: 2014-9-4 18:25:42 org.apache.catalina.startup.TldConfig tldScanJar 严重: Exception processing JAR at resource path /home/user/.m2/repository/com/vaadin/vaadin-shared/7.1.7/vaadin-shared-7.1.7.jar in context /myProject-webapp java.util.zip.ZipException: error in opening zip file at java.util.zip.ZipFile.open(Native Method) at java.util.zip.ZipFile.<init>(ZipFile.java:127) at java.util.jar.JarFile.<init>(JarFile.java:136) at java.util.jar.JarFile.<init>(JarFile.java:100) at org.apache.catalina.startup.TldConfig.tldScanJar(TldConfig.java:393) at org.apache.catalina.startup.TldConfig.execute(TldConfig.java:320) at org.apache.catalina.startup.TldConfig.lifecycleEvent(TldConfig.java:688) at org.apache.catalina.util.LifecycleSupport.fireLifecycleEvent(LifecycleSupport.java:142) at org.apache.catalina.core.StandardContext.start(StandardContext.java:4616) at org.apache.catalina.core.ContainerBase.start(ContainerBase.java:1057) at org.apache.catalina.core.StandardHost.start(StandardHost.java:822) at org.apache.catalina.core.ContainerBase.start(ContainerBase.java:1057) at org.apache.catalina.core.StandardEngine.start(StandardEngine.java:463) at org.apache.catalina.core.StandardService.start(StandardService.java:525) at org.apache.catalina.core.StandardServer.start(StandardServer.java:754) at org.apache.catalina.startup.Catalina.start(Catalina.java:595) at sun.reflect.NativeMethodAccessorImpl.invoke0(Native Method) at sun.reflect.NativeMethodAccessorImpl.invoke(NativeMethodAccessorImpl.java:39) at sun.reflect.DelegatingMethodAccessorImpl.invoke(DelegatingMethodAccessorImpl.java:25) at java.lang.reflect.Method.invoke(Method.java:597) at org.apache.catalina.startup.Bootstrap.start(Bootstrap.java:289) at org.apache.catalina.startup.Bootstrap.main(Bootstrap.java:414) 2014-9-4 18:25:42 org.apache.catalina.startup.TldConfig tldScanJar 严重: Exception processing JAR at resource path /home/user/.m2/repository/org/jsoup/jsoup/1.6.3/jsoup-1.6.3.jar in context /myProject-webapp ............ ......... **附件:** .classpath <?xml version="1.0" encoding="UTF-8"?> <classpath> <classpathentry kind="src" output="target/classes" path="src/main/java"> <attributes> <attribute name="optional" value="true"/> <attribute name="maven.pomderived" value="true"/> </attributes> </classpathentry> <classpathentry kind="src" output="target/test-classes" path="src/test/java"> <attributes> <attribute name="optional" value="true"/> <attribute name="maven.pomderived" value="true"/> </attributes> </classpathentry> <classpathentry exported="true" kind="con" path="org.eclipse.m2e.MAVEN2_CLASSPATH_CONTAINER"> <attributes> <attribute name="maven.pomderived" value="true"/> <attribute name="org.eclipse.jst.component.dependency" value="/WEB-INF/lib"/> </attributes> </classpathentry> <classpathentry kind="con" path="org.eclipse.jst.server.core.container/org.eclipse.jst.server.tomcat.runtimeTarget/Apache Tomcat v6.0"> <attributes> <attribute name="owner.project.facets" value="jst.web"/> </attributes> </classpathentry> <classpathentry kind="con" path="org.eclipse.jdt.launching.JRE_CONTAINER/org.eclipse.jdt.internal.debug.ui.launcher.StandardVMType/jdk1.6.0_45"> <attributes> <attribute name="owner.project.facets" value="java"/> </attributes> </classpathentry> <classpathentry kind="output" path="target/classes"/> </classpath> [1]: http://my.csdn.net/my/album/detail/1784229 [2]: http://my.csdn.net/my/album/detail/1784231

使用install:file命令安装第三方jar到maven本地仓库,报错no pom

问题补充: 项目中要用到一个分词的jar包。于是我在晚上下了一个,本来是这样IK Analyzer 2012FF_hf1.jar, 为了符合maven install命令的规范,我随意加了一个版本号变为这样IK Analyzer 2012FF_1.0.1.然后切换到jar包所在文件夹,执行如图命令,爆出如图错误。查了百度,有说缺少pom.xml文件的,难道随便一个jar包安装到本地仓库,都要手写pom文件吗?我怎么知道它依赖了哪些包? ![图片说明](https://img-ask.csdn.net/upload/201512/04/1449235294_708303.png) ![图片说明](https://img-ask.csdn.net/upload/201512/04/1449235443_415435.png)

Maven 执行 install 问题

导入工程,执行maven install时 报如下警告: [WARNING] The POM for db2jcc:db2jcc:jar:0.x is missing, no dependency information available [WARNING] The POM for db2jcc:db2jcc_license_cisuz:jar:0.x is missing, no dependency information available [WARNING] The POM for db2jcc:db2jcc_license_cu:jar:0.x is missing, no dependency information available 之后报如下错误: [ERROR] Failed to execute goal on project TopMallWeb: Could not resolve dependencies for project com.gdrcu.96138:TopMallWeb:war:1.0: The following artifacts could not be resolved: db2jcc:db2jcc:jar:0.x, db2jcc:db2jcc_license_cisuz:jar:0.x, 但是本地的maven库里是有相应的jar包的 请教问题出在哪里?

怎么把oracle的jar包添加到中央仓库?

![图片说明](https://img-ask.csdn.net/upload/201711/16/1510794675_684755.png)我手动添加进去 然后update 之后没加载 还是报错! Description Resource Path Location Type The project cannot be built until build path errors are resolved bos_management Unknown Java Problem Description Resource Path Location Type The container 'Maven Dependencies' references non existing library 'D:\apache-maven-3.3.9\repository_ssh\com\oracle\ojdbc6\11.2.0.1.0\ojdbc6-11.2.0.1.0.jar' bos_management Build path Build Path Problem Description Resource Path Location Type Missing artifact com.oracle:ojdbc6:jar:11.2.0.1.0 pom.xml /bos_management line 3 Maven Dependency Problem 上图上不了 直接复制错误信息 谢谢大家帮忙看下!

普元EOS7.6使用Maven构建项目时出错,急!!!

1、Archive for required library: 'D:/dev-sdk/maven-repo/com/primeton/ptp/server/ptp-server-commons/5.1.4.0/ptp-server-commons-5.1.4.0.jar' in project 'project-name' cannot be read or is not a valid ZIP file 2、Error resolving version for plugin 'com.primeton.ptp.build:maven-eos-compile-plugin' from the repositories [local (D:\dev-sdk\maven-repo), eos (http://192.168.1.203:9001/nexus/content/repositories/eos/), aliyun (http://maven.aliyun.com/nexus/content/groups/public/), alimaven (http://maven.aliyun.com/nexus/content/groups/public/)]: Plugin not found in any plugin repository 3、在解决构建路径错误之前不能构建该项目 按照官网的文档说明来的,百度说是jar包问题,删了重下,我试了没用,请大神解答 ![图片说明](https://img-ask.csdn.net/upload/201811/23/1542961006_531035.png)

在中国程序员是青春饭吗?

今年,我也32了 ,为了不给大家误导,咨询了猎头、圈内好友,以及年过35岁的几位老程序员……舍了老脸去揭人家伤疤……希望能给大家以帮助,记得帮我点赞哦。 目录: 你以为的人生 一次又一次的伤害 猎头界的真相 如何应对互联网行业的「中年危机」 一、你以为的人生 刚入行时,拿着傲人的工资,想着好好干,以为我们的人生是这样的: 等真到了那一天,你会发现,你的人生很可能是这样的: ...

程序员请照顾好自己,周末病魔差点一套带走我。

程序员在一个周末的时间,得了重病,差点当场去世,还好及时挽救回来了。

Java基础知识面试题(2020最新版)

文章目录Java概述何为编程什么是Javajdk1.5之后的三大版本JVM、JRE和JDK的关系什么是跨平台性?原理是什么Java语言有哪些特点什么是字节码?采用字节码的最大好处是什么什么是Java程序的主类?应用程序和小程序的主类有何不同?Java应用程序与小程序之间有那些差别?Java和C++的区别Oracle JDK 和 OpenJDK 的对比基础语法数据类型Java有哪些数据类型switc...

和黑客斗争的 6 天!

互联网公司工作,很难避免不和黑客们打交道,我呆过的两家互联网公司,几乎每月每天每分钟都有黑客在公司网站上扫描。有的是寻找 Sql 注入的缺口,有的是寻找线上服务器可能存在的漏洞,大部分都...

Intellij IDEA 实用插件安利

1. 前言从2020 年 JVM 生态报告解读 可以看出Intellij IDEA 目前已经稳坐 Java IDE 头把交椅。而且统计得出付费用户已经超过了八成(国外统计)。IDEA 的...

搜狗输入法也在挑战国人的智商!

故事总是一个接着一个到来...上周写完《鲁大师已经彻底沦为一款垃圾流氓软件!》这篇文章之后,鲁大师的市场工作人员就找到了我,希望把这篇文章删除掉。经过一番沟通我先把这篇文章从公号中删除了...

总结了 150 余个神奇网站,你不来瞅瞅吗?

原博客再更新,可能就没了,之后将持续更新本篇博客。

副业收入是我做程序媛的3倍,工作外的B面人生是怎样的?

提到“程序员”,多数人脑海里首先想到的大约是:为人木讷、薪水超高、工作枯燥…… 然而,当离开工作岗位,撕去层层标签,脱下“程序员”这身外套,有的人生动又有趣,马上展现出了完全不同的A/B面人生! 不论是简单的爱好,还是正经的副业,他们都干得同样出色。偶尔,还能和程序员的特质结合,产生奇妙的“化学反应”。 @Charlotte:平日素颜示人,周末美妆博主 大家都以为程序媛也个个不修边幅,但我们也许...

MySQL数据库面试题(2020最新版)

文章目录数据库基础知识为什么要使用数据库什么是SQL?什么是MySQL?数据库三大范式是什么mysql有关权限的表都有哪几个MySQL的binlog有有几种录入格式?分别有什么区别?数据类型mysql有哪些数据类型引擎MySQL存储引擎MyISAM与InnoDB区别MyISAM索引与InnoDB索引的区别?InnoDB引擎的4大特性存储引擎选择索引什么是索引?索引有哪些优缺点?索引使用场景(重点)...

如果你是老板,你会不会踢了这样的员工?

有个好朋友ZS,是技术总监,昨天问我:“有一个老下属,跟了我很多年,做事勤勤恳恳,主动性也很好。但随着公司的发展,他的进步速度,跟不上团队的步伐了,有点...

我入职阿里后,才知道原来简历这么写

私下里,有不少读者问我:“二哥,如何才能写出一份专业的技术简历呢?我总感觉自己写的简历太烂了,所以投了无数份,都石沉大海了。”说实话,我自己好多年没有写过简历了,但我认识的一个同行,他在阿里,给我说了一些他当年写简历的方法论,我感觉太牛逼了,实在是忍不住,就分享了出来,希望能够帮助到你。 01、简历的本质 作为简历的撰写者,你必须要搞清楚一点,简历的本质是什么,它就是为了来销售你的价值主张的。往深...

魂迁光刻,梦绕芯片,中芯国际终获ASML大型光刻机

据羊城晚报报道,近日中芯国际从荷兰进口的一台大型光刻机,顺利通过深圳出口加工区场站两道闸口进入厂区,中芯国际发表公告称该光刻机并非此前盛传的EUV光刻机,主要用于企业复工复产后的生产线扩容。 我们知道EUV主要用于7nm及以下制程的芯片制造,光刻机作为集成电路制造中最关键的设备,对芯片制作工艺有着决定性的影响,被誉为“超精密制造技术皇冠上的明珠”,根据之前中芯国际的公报,目...

优雅的替换if-else语句

场景 日常开发,if-else语句写的不少吧??当逻辑分支非常多的时候,if-else套了一层又一层,虽然业务功能倒是实现了,但是看起来是真的很不优雅,尤其是对于我这种有强迫症的程序"猿",看到这么多if-else,脑袋瓜子就嗡嗡的,总想着解锁新姿势:干掉过多的if-else!!!本文将介绍三板斧手段: 优先判断条件,条件不满足的,逻辑及时中断返回; 采用策略模式+工厂模式; 结合注解,锦...

离职半年了,老东家又发 offer,回不回?

有小伙伴问松哥这个问题,他在上海某公司,在离职了几个月后,前公司的领导联系到他,希望他能够返聘回去,他很纠结要不要回去? 俗话说好马不吃回头草,但是这个小伙伴既然感到纠结了,我觉得至少说明了两个问题:1.曾经的公司还不错;2.现在的日子也不是很如意。否则应该就不会纠结了。 老实说,松哥之前也有过类似的经历,今天就来和小伙伴们聊聊回头草到底吃不吃。 首先一个基本观点,就是离职了也没必要和老东家弄的苦...

2020阿里全球数学大赛:3万名高手、4道题、2天2夜未交卷

阿里巴巴全球数学竞赛( Alibaba Global Mathematics Competition)由马云发起,由中国科学技术协会、阿里巴巴基金会、阿里巴巴达摩院共同举办。大赛不设报名门槛,全世界爱好数学的人都可参与,不论是否出身数学专业、是否投身数学研究。 2020年阿里巴巴达摩院邀请北京大学、剑桥大学、浙江大学等高校的顶尖数学教师组建了出题组。中科院院士、美国艺术与科学院院士、北京国际数学...

为什么你不想学习?只想玩?人是如何一步一步废掉的

不知道是不是只有我这样子,还是你们也有过类似的经历。 上学的时候总有很多光辉历史,学年名列前茅,或者单科目大佬,但是虽然慢慢地长大了,你开始懈怠了,开始废掉了。。。 什么?你说不知道具体的情况是怎么样的? 我来告诉你: 你常常潜意识里或者心理觉得,自己真正的生活或者奋斗还没有开始。总是幻想着自己还拥有大把时间,还有无限的可能,自己还能逆风翻盘,只不是自己还没开始罢了,自己以后肯定会变得特别厉害...

百度工程师,获利10万,判刑3年!

所有一夜暴富的方法都写在刑法中,但总有人心存侥幸。这些年互联网犯罪高发,一些工程师高技术犯罪更是引发关注。这两天,一个百度运维工程师的案例传遍朋友圈。1...

程序员为什么千万不要瞎努力?

本文作者用对比非常鲜明的两个开发团队的故事,讲解了敏捷开发之道 —— 如果你的团队缺乏统一标准的环境,那么即使勤劳努力,不仅会极其耗时而且成果甚微,使用...

为什么程序员做外包会被瞧不起?

二哥,有个事想询问下您的意见,您觉得应届生值得去外包吗?公司虽然挺大的,中xx,但待遇感觉挺低,马上要报到,挺纠结的。

当HR压你价,说你只值7K,你该怎么回答?

当HR压你价,说你只值7K时,你可以流畅地回答,记住,是流畅,不能犹豫。 礼貌地说:“7K是吗?了解了。嗯~其实我对贵司的面试官印象很好。只不过,现在我的手头上已经有一份11K的offer。来面试,主要也是自己对贵司挺有兴趣的,所以过来看看……”(未完) 这段话主要是陪HR互诈的同时,从公司兴趣,公司职员印象上,都给予对方正面的肯定,既能提升HR的好感度,又能让谈判气氛融洽,为后面的发挥留足空间。...

面试:第十六章:Java中级开发(16k)

HashMap底层实现原理,红黑树,B+树,B树的结构原理 Spring的AOP和IOC是什么?它们常见的使用场景有哪些?Spring事务,事务的属性,传播行为,数据库隔离级别 Spring和SpringMVC,MyBatis以及SpringBoot的注解分别有哪些?SpringMVC的工作原理,SpringBoot框架的优点,MyBatis框架的优点 SpringCould组件有哪些,他们...

面试阿里p7,被按在地上摩擦,鬼知道我经历了什么?

面试阿里p7被问到的问题(当时我只知道第一个):@Conditional是做什么的?@Conditional多个条件是什么逻辑关系?条件判断在什么时候执...

无代码时代来临,程序员如何保住饭碗?

编程语言层出不穷,从最初的机器语言到如今2500种以上的高级语言,程序员们大呼“学到头秃”。程序员一边面临编程语言不断推陈出新,一边面临由于许多代码已存在,程序员编写新应用程序时存在重复“搬砖”的现象。 无代码/低代码编程应运而生。无代码/低代码是一种创建应用的方法,它可以让开发者使用最少的编码知识来快速开发应用程序。开发者通过图形界面中,可视化建模来组装和配置应用程序。这样一来,开发者直...

面试了一个 31 岁程序员,让我有所触动,30岁以上的程序员该何去何从?

最近面试了一个31岁8年经验的程序猿,让我有点感慨,大龄程序猿该何去何从。

大三实习生,字节跳动面经分享,已拿Offer

说实话,自己的算法,我一个不会,太难了吧

程序员垃圾简历长什么样?

已经连续五年参加大厂校招、社招的技术面试工作,简历看的不下于万份 这篇文章会用实例告诉你,什么是差的程序员简历! 疫情快要结束了,各个公司也都开始春招了,作为即将红遍大江南北的新晋UP主,那当然要为小伙伴们做点事(手动狗头)。 就在公众号里公开征简历,义务帮大家看,并一一点评。《启舰:春招在即,义务帮大家看看简历吧》 一石激起千层浪,三天收到两百多封简历。 花光了两个星期的所有空闲时...

《Oracle Java SE编程自学与面试指南》最佳学习路线图2020年最新版(进大厂必备)

正确选择比瞎努力更重要!

字节跳动面试官竟然问了我JDBC?

轻松等回家通知

面试官:你连SSO都不懂,就别来面试了

大厂竟然要考我SSO,卧槽。

实时更新:计算机编程语言排行榜—TIOBE世界编程语言排行榜(2020年6月份最新版)

内容导航: 1、TIOBE排行榜 2、总榜(2020年6月份) 3、本月前三名 3.1、C 3.2、Java 3.3、Python 4、学习路线图 5、参考地址 1、TIOBE排行榜 TIOBE排行榜是根据全世界互联网上有经验的程序员、课程和第三方厂商的数量,并使用搜索引擎(如Google、Bing、Yahoo!)以及Wikipedia、Amazon、YouTube统计出排名数据。

立即提问
相关内容推荐