新建工程后Android Studio 一直处于 Gradle Build Running 10C

之前下载了Android Studio,是为了打开前辈写的APP然后做改进,也一直没有什么问题。最近开始自己写APP了,就新建了工程,然后就一直处于Gradle Build Running状态。
图片说明
网上的很多方法都试过了:
(1)我的gradle-wrapper.properties的内容为distributionUrl=https://services.gradle.org/distributions/gradle-3.3-all.zip,所以我用的是离线好的gradle-3.3-all.zip,放在默认的路径里,C:\Users\Administrator.gradle\wrapper\dists\gradle-3.3-all\55gk2rcmfc6p2dg9u9ohc3hw9,并且选择的是offline,但是没有用
图片说明
(2)关于添加grandle.properties文件,以及内容为org.gradle.daemon=true的建议也没有作用

我的build.gradle文件的内容如下:
图片说明

请问怎样才能解决呢?

17个回答

一般都是某个插件或lib更新不下来,具体看看下面正在更新什么 ,url是啥,能否访问

检查你的SDK下载对没有,你下载的api 版本要与你新建的Android相容

这种情况是你下载项目的 gradle 和你自己的版本不一致,而工具本身会进行检查,不一致就会在网上下载,但国外的网站,国内不支持浏览或者下载,所以你的工具
就会一直去下载,但始终下载不下来,这种情况你可以使用自己本地的 gradle 详情请参考 : http://blog.csdn.net/qq_37043246/article/details/77651280

weixin_41602518
weixin_41602518 dsadsa asdsa
2 年多之前 回复
qq_37043246
路边小树苗 gradle本身分为项目级别和全局级别,当项目级别不存在就会使用全局级别,详情请看链接
2 年多之前 回复

一般都是某个插件或lib更新不下来,检查你的SDK下载对没有,你下载的api 版本要与你新建的Android相容

去掉原来项目中关于gradle的文件,这些文件属于这个项目在别人开发环境自有的,你直接导入会需要重新构建,删掉后build就会快很多。
删除的文件文件夹如下.gradle .idea gradle gradlew gradlew.bat local.properties。具体可以查询android studio 上传过滤文件,这些文件也不应该提交到SVN的。不然会引起别人的代码构建有问题

检查网络状态是否良好呢

你直接把你原来项目的gradle拿过来用就可以了,这最简单了

先把下面的几个依赖包删除 我看里面有两个还是测试版本 等项目编译好再加回去 版本号用26+ 不要用alpha的

一般都是依赖包的问题。

共17条数据 1 尾页
Csdn user default icon
上传中...
上传图片
插入图片
抄袭、复制答案,以达到刷声望分或其他目的的行为,在CSDN问答是严格禁止的,一经发现立刻封号。是时候展现真正的技术了!
其他相关推荐
android studio run时一直 Gradle Build Running

我其他的demo都没问题,一运行这个项目run时就一直Gradle Build Running ,编译不了![图片说明](https://img-ask.csdn.net/upload/201609/15/1473921454_985008.png)

android studio gradle问题

Error:Could not run build action using Gradle installation 'C:\Program Files\Android\Android Studio\gradle\gradle-2.8'.这个是什么问题啊 我一直用的好好的啊

android stuido 求大神指点 Gradle build finished

UNEXPECTED TOP-LEVEL EXCEPTION: com.android.dex.DexException: Multiple dex files define Lcom/lidroid/xutils/task/TaskHandler; at com.android.dx.merge.DexMerger.readSortableTypes(DexMerger.java:594) at com.android.dx.merge.DexMerger.getSortedTypes(DexMerger.java:552) at com.android.dx.merge.DexMerger.mergeClassDefs(DexMerger.java:533) at com.android.dx.merge.DexMerger.mergeDexes(DexMerger.java:170) at com.android.dx.merge.DexMerger.merge(DexMerger.java:188) at com.android.dx.command.dexer.Main.mergeLibraryDexBuffers(Main.java:439) at com.android.dx.command.dexer.Main.runMonoDex(Main.java:287) at com.android.dx.command.dexer.Main.run(Main.java:230) at com.android.dx.command.dexer.Main.main(Main.java:199) at com.android.dx.command.Main.main(Main.java:103) FAILED FAILURE: Build failed with an exception. * What went wrong: Execution failed for task ':app:dexDebug'. > com.android.ide.common.internal.LoggedErrorException: Failed to run command: D:\Android\android-studio\sdk\build-tools\android-4.4W\dx.bat --dex --num-threads=4 --output E:\一点通\新闻客户端APP\code\android\XMRBApp\app\build\intermediates\dex\debug E:\一点通\新闻客户端APP\code\android\XMRBApp\app\build\intermediates\classes\debug E:\一点通\新闻客户端APP\code\android\XMRBApp\app\build\intermediates\dependency-cache\debug E:\一点通\新闻客户端APP\code\android\XMRBApp\app\build\intermediates\pre-dexed\debug\baseproject-c56c14be9943929c5c5813d4553338c6b5b2977e.jar E:\一点通\新闻客户端APP\code\android\XMRBApp\app\build\intermediates\pre-dexed\debug\classes-1f8f8478b937dc74b01aabab03122fad3284ca52.jar E:\一点通\新闻客户端APP\code\android\XMRBApp\app\build\intermediates\pre-dexed\debug\classes-1ff5837b36cb81358fc0327eb8469bcf0233db7d.jar Error Code: 2 Output: UNEXPECTED TOP-LEVEL EXCEPTION: com.android.dex.DexException: Multiple dex files define Lcom/lidroid/xutils/task/TaskHandler; at com.android.dx.merge.DexMerger.readSortableTypes(DexMerger.java:594) at com.android.dx.merge.DexMerger.getSortedTypes(DexMerger.java:552) at com.android.dx.merge.DexMerger.mergeClassDefs(DexMerger.java:533) at com.android.dx.merge.DexMerger.mergeDexes(DexMerger.java:170) at com.android.dx.merge.DexMerger.merge(DexMerger.java:188) at com.android.dx.command.dexer.Main.mergeLibraryDexBuffers(Main.java:439) at com.android.dx.command.dexer.Main.runMonoDex(Main.java:287) at com.android.dx.command.dexer.Main.run(Main.java:230) at com.android.dx.command.dexer.Main.main(Main.java:199) at com.android.dx.command.Main.main(Main.java:103) * Try: Run with --stacktrace option to get the stack trace. Run with --info or --debug option to get more log output. BUILD FAILED 求大神指点!!!感谢感谢

刚安装好android studio 后新建第一个项目报错 Gradle sync failed

android studio 新建项目 Gradle sync failed: The first result from the daemon was empty. Most likely the process died immediately after connection. ![图片说明](https://img-ask.csdn.net/upload/201701/24/1485259415_875463.png) 关闭了杀毒软件,但还是报错; File->Invalidate Caches/Restart仍然出现这样的错误 ![图片说明](https://img-ask.csdn.net/upload/201701/24/1485259599_139647.png) 电脑没有连接任何其他设备 关于gradle的设置和文件是这样的:![图片说明](https://img-ask.csdn.net/upload/201701/24/1485259902_92537.png) ![图片说明](https://img-ask.csdn.net/upload/201701/24/1485259913_196525.png) ![图片说明](https://img-ask.csdn.net/upload/201701/24/1485261039_326185.png) 打开后看到: Caused by: org.gradle.launcher.daemon.client.NoUsableDaemonFoundException: Unable to find a usable idle daemon. I have connected to 100 different daemons but I could not use any of them to run the build. BuildActionParameters were DefaultBuildActionParameters {, currentDir=F:\Android_studio_projects\MyApplication, systemProperties size=91, envVariables size=43, logLevel=LIFECYCLE, daemonUsage=IMPLICITLY_DISABLED, continuous=false, interactive=false, injectedPluginClasspath=[]}.

AndroidStudio项目突然不能build打包了,但是run是可以的

AndroidStudio 3.0 mac jdk1.7 java环境 突然项目不能打包了,build apk,build signed apk都报错app:transformClassesWithMultidexlistForDebug,但是直接run是可以的 ``` FAILURE: Build failed with an exception. * What went wrong: Execution failed for task ':app:transformClassesWithMultidexlistForDebug'. > com.android.build.api.transform.TransformException: Error while generating the main dex list. * Try: Run with --stacktrace option to get the stack trace. Run with --info or --debug option to get more log output. Run with --scan to get full insights. * Get more help at https://help.gradle.org BUILD FAILED in 1m 0s ``` 然后尝试过得方法有 1,invalided caches /Restart 删除build重启电脑 2,彻底卸载AndroidStudio,重新安装 3,在App的build中添加 ``` buildTypes { debug { useProguard true } } ``` 4,使用上个月压缩包备份的好的项目代码也不能跑 已经尝试过了baidu google stackoverflow上很多方法还是没解决问题,求大神指教下,不剩感激

android studio 可以build但run会报错

android studio 可以build但run会报错 并且已经参考网上把gradle对应版本对应了 (想运行个hello world都这么难。。。。) ![图片说明](https://img-ask.csdn.net/upload/201911/18/1574009065_408984.png) ![图片说明](https://img-ask.csdn.net/upload/201911/18/1574009192_4232.png)

studio使用gradle成功build,idea却失败

报错如下: ``` Error:Gradle: A problem occurred configuring root project 'MyApplication1'. > Could not resolve all dependencies for configuration ':classpath'. > Could not resolve com.android.tools.build:gradle:2.2.2. Required by: :MyApplication1:unspecified > Could not resolve com.android.tools.build:gradle:2.2.2. > Could not get resource 'https://jcenter.bintray.com/com/android/tools/build/gradle/2.2.2/gradle-2.2.2.pom'. > Could not GET 'https://jcenter.bintray.com/com/android/tools/build/gradle/2.2.2/gradle-2.2.2.pom'. Received status code 400 from server: Bad Request ``` 十分诡异!studio和idea 的 gradle设置几乎是一样的!gradle对应的版本也是存在的 ![图片说明](https://img-ask.csdn.net/upload/201704/20/1492659180_279864.png) 看了下网上很多文章,并没有解决问题! 是否有人遇到过相似问题,并且成功解决问题呢?

Android Studio Gradle project sync failed,Configure project:app 前出现红叹号

Android Studio Gradle project sync failed,Configure project:app 前出现红叹号 ![图片说明](https://img-ask.csdn.net/upload/201905/13/1557746272_155433.jpg) 提示为 ``` org.gradle.api.ProjectConfigurationException: A problem occurred configuring project ':app' at java.util.concurrent.ThreadPoolExecutor.runWorker(ThreadPoolExecutor.java:1142) at java.util.concurrent.ThreadPoolExecutor$Worker.run(ThreadPoolExecutor.java:617) at org.gradle.internal.concurrent.ThreadFactoryImpl$ManagedThreadRunnable.run(ThreadFactoryImpl.java:55) at java.lang.Thread.run(Thread.java:745) Caused by: com.android.builder.errors.EvalIssueException: Failed to install the following Android SDK packages as some licences have not been accepted. build-tools;28.0.2 Android SDK Build-Tools 28.0.2 To build this project, accept the SDK license agreements and install the missing components using the Android Studio SDK Manager. Alternatively, to transfer the license agreements from one workstation to another, see http://d.android.com/r/studio-ui/export-licenses.html Using Android SDK: D:\Android\SDK at com.android.build.gradle.internal.SdkHandler.initTarget(SdkHandler.java:194) at com.android.build.gradle.BasePlugin.ensureTargetSetup(BasePlugin.java:980) at com.android.build.gradle.BasePlugin.createAndroidTasks(BasePlugin.java:752) at com.android.build.gradle.BasePlugin.lambda$null$4(BasePlugin.java:690) at com.android.builder.profile.ThreadRecorder.record(ThreadRecorder.java:81) at com.android.build.gradle.BasePlugin.lambda$createTasks$5(BasePlugin.java:686) at org.gradle.internal.event.BroadcastDispatch$ActionInvocationHandler.dispatch(BroadcastDispatch.java:91) at org.gradle.internal.event.BroadcastDispatch$ActionInvocationHandler.dispatch(BroadcastDispatch.java:80) at org.gradle.internal.event.AbstractBroadcastDispatch.dispatch(AbstractBroadcastDispatch.java:42) at org.gradle.internal.event.BroadcastDispatch$SingletonDispatch.dispatch(BroadcastDispatch.java:230) at org.gradle.internal.event.BroadcastDispatch$SingletonDispatch.dispatch(BroadcastDispatch.java:149) at org.gradle.internal.event.AbstractBroadcastDispatch.dispatch(AbstractBroadcastDispatch.java:58) at org.gradle.internal.event.BroadcastDispatch$CompositeDispatch.dispatch(BroadcastDispatch.java:324) at org.gradle.internal.event.BroadcastDispatch$CompositeDispatch.dispatch(BroadcastDispatch.java:234) at org.gradle.internal.event.ListenerBroadcast.dispatch(ListenerBroadcast.java:140) at org.gradle.internal.event.ListenerBroadcast.dispatch(ListenerBroadcast.java:37) at org.gradle.internal.dispatch.ProxyDispatchAdapter$DispatchingInvocationHandler.invoke(ProxyDispatchAdapter.java:93) at com.sun.proxy.$Proxy27.afterEvaluate(Unknown Source) at org.gradle.configuration.project.LifecycleProjectEvaluator.notifyAfterEvaluate(LifecycleProjectEvaluator.java:76) ... 85 more ```

android studio插件jrebel for android报错

报错信息,请问怎么解决,或者提供思路 ``` :app:processDebugResources FAILED Error:failed to create directory 'C:\Users\Administrator\.jrebel-android\gradle\0\debug\build-dir\WAvatar\app\build\generated\source\r\debug\android\support\v7\appcompat', error: 13 Permission denied. Error:Execution failed for task ':app:processDebugResources'. > Process 'C:\Users\Administrator\.jrebel-android\distributions\2.5.14_20171220124024\bin\win32\aapt2.exe' finished with non-zero exit value 1 ```

Android studio编程这个报错怎么解决

Error:Could not run build action using Gradle installation 'D:\Program Files\Android\Android Studio\gradle\gradle-2.4'. 这个报错怎么解决?

android studio编译项目时遇到这个问题。

Caused by: java.lang.NoClassDefFoundError: Could not initialize class com.google.wireless.android.sdk.stats.AndroidStudioStats$GradleBuildProfile at com.android.builder.profile.ProcessRecorder.<init>(ProcessRecorder.java:96) at com.android.builder.profile.ProcessRecorderFactory.get(ProcessRecorderFactory.java:222) at com.android.builder.profile.ProcessRecorderFactory.initialize(ProcessRecorderFactory.java:122) at com.android.build.gradle.internal.profile.ProfilerInitializer.init(ProfilerInitializer.java:66) at com.android.build.gradle.BasePlugin.apply(BasePlugin.java:310) at com.android.build.gradle.LibraryPlugin.apply(LibraryPlugin.java:85) at com.android.build.gradle.LibraryPlugin.apply(LibraryPlugin.java:40) at org.gradle.api.internal.plugins.ImperativeOnlyPluginApplicator.applyImperative(ImperativeOnlyPluginApplicator.java:35) at org.gradle.api.internal.plugins.RuleBasedPluginApplicator.applyImperative(RuleBasedPluginApplicator.java:43) at org.gradle.api.internal.plugins.DefaultPluginManager.doApply(DefaultPluginManager.java:139) at org.gradle.api.internal.plugins.DefaultPluginManager.apply(DefaultPluginManager.java:112) at org.gradle.api.internal.plugins.DefaultObjectConfigurationAction.applyType(DefaultObjectConfigurationAction.java:113) at org.gradle.api.internal.plugins.DefaultObjectConfigurationAction.access$200(DefaultObjectConfigurationAction.java:36) at org.gradle.api.internal.plugins.DefaultObjectConfigurationAction$3.run(DefaultObjectConfigurationAction.java:80) at org.gradle.api.internal.plugins.DefaultObjectConfigurationAction.execute(DefaultObjectConfigurationAction.java:136) at org.gradle.api.internal.project.AbstractPluginAware.apply(AbstractPluginAware.java:44) at org.gradle.api.internal.project.ProjectScript.apply(ProjectScript.java:34) at org.gradle.api.Script$apply$0.callCurrent(Unknown Source) at build_1ztzbib3h4rketyrpodndoubp.run(F:\yjyl_android_studio_work_space\teacher_svn\pIMlibs\build.gradle:1) at org.gradle.groovy.scripts.internal.DefaultScriptRunnerFactory$ScriptRunnerImpl.run(DefaultScriptRunnerFactory.java:90)

Android studio build时候报错

FAILURE: Build failed with an exception. * What went wrong: A problem occurred configuring root project 'MyApplication'. > Could not resolve all dependencies for configuration ':classpath'. > Could not resolve com.android.tools.build:gradle:1.5.0. Required by: :MyApplication:unspecified > Could not resolve com.android.tools.build:gradle:1.5.0. > Could not get resource 'https://jcenter.bintray.com/com/android/tools/build/gradle/1.5.0/gradle-1.5.0.pom'. > Could not GET 'https://jcenter.bintray.com/com/android/tools/build/gradle/1.5.0/gradle-1.5.0.pom'. > Connection to https://jcenter.bintray.com refused * Try: Run with --stacktrace option to get the stack trace. Run with --info or --debug option to get more log output. BUILD FAILED Total time: 45.925 secs Process finished with exit code 1 本地是有gradle的,但是好像build的时候还需要去下载似的 这个是运行出来的gradlew compileDebug --stacktrace 出来的Log信息,求指教 D:\work\Androidstudio\project\MyApplication>gradlew compileDebug --stacktrace Downloading https://services.gradle.org/distributions/gradle-2.8-all.zip Exception in thread "main" java.net.UnknownHostException: services.gradle.org at java.net.AbstractPlainSocketImpl.connect(AbstractPlainSocketImpl.java:184) at java.net.PlainSocketImpl.connect(PlainSocketImpl.java:172) at java.net.SocksSocketImpl.connect(SocksSocketImpl.java:392) at java.net.Socket.connect(Socket.java:589) at sun.security.ssl.SSLSocketImpl.connect(SSLSocketImpl.java:649) at sun.security.ssl.BaseSSLSocketImpl.connect(BaseSSLSocketImpl.java:173) at sun.net.NetworkClient.doConnect(NetworkClient.java:180) at sun.net.www.http.HttpClient.openServer(HttpClient.java:432) at sun.net.www.http.HttpClient.openServer(HttpClient.java:527) at sun.net.www.protocol.https.HttpsClient.(HttpsClient.java:275) at sun.net.www.protocol.https.HttpsClient.New(HttpsClient.java:371) at sun.net.www.protocol.https.AbstractDelegateHttpsURLConnection.getNewHttpClient(AbstractDelegateHttpsURLConnection.java:191) at sun.net.www.protocol.http.HttpURLConnection.plainConnect0(HttpURLConnection.java:1103) at sun.net.www.protocol.http.HttpURLConnection.plainConnect(HttpURLConnection.java:997) at sun.net.www.protocol.https.AbstractDelegateHttpsURLConnection.connect(AbstractDelegateHttpsURLConnection.java:177) at sun.net.www.protocol.http.HttpURLConnection.getInputStream0(HttpURLConnection.java:1511) at sun.net.www.protocol.http.HttpURLConnection.getInputStream(HttpURLConnection.java:1439) at sun.net.www.protocol.https.HttpsURLConnectionImpl.getInputStream(HttpsURLConnectionImpl.java:254) at org.gradle.wrapper.Download.downloadInternal(Download.java:58) at org.gradle.wrapper.Download.download(Download.java:44) at org.gradle.wrapper.Install$1.call(Install.java:61) at org.gradle.wrapper.Install$1.call(Install.java:48) at org.gradle.wrapper.ExclusiveFileAccessManager.access(ExclusiveFileAccessManager.java:65) at org.gradle.wrapper.Install.createDist(Install.java:48) at org.gradle.wrapper.WrapperExecutor.execute(WrapperExecutor.java:128) at org.gradle.wrapper.GradleWrapperMain.main(GradleWrapperMain.java:61)

Android studio 3.1.3 初始化项目 build 失败问题

本机环境:mac 10.12.6 . Android Studio 3.1.3 代理已测试可连结youtube.com ![图片说明](https://img-ask.csdn.net/upload/201807/07/1530931982_394881.png) build.gradle ``` apply plugin: 'com.android.application' android { compileSdkVersion 28 defaultConfig { applicationId "com.example.hubs.ok" minSdkVersion 19 targetSdkVersion 28 versionCode 1 versionName "1.0" testInstrumentationRunner "android.support.test.runner.AndroidJUnitRunner" } buildTypes { release { minifyEnabled false proguardFiles getDefaultProguardFile('proguard-android.txt'), 'proguard-rules.pro' } } buildToolsVersion '28.0.1' compileOptions { sourceCompatibility JavaVersion.VERSION_1_8 targetCompatibility JavaVersion.VERSION_1_8 } } dependencies { implementation fileTree(include: ['*.jar'], dir: 'libs') implementation 'com.android.support:appcompat-v7:28.0.0-alpha3' implementation 'com.android.support.constraint:constraint-layout:1.1.2' testImplementation 'junit:junit:4.12' androidTestImplementation 'com.android.support.test:runner:1.0.2' androidTestImplementation 'com.android.support.test.espresso:espresso-core:3.0.2' } ``` 点击编译时一直卡在Download .... ![图片说明](https://img-ask.csdn.net/upload/201807/07/1530932031_62049.png) 命令行里gradlew build 也一直卡在这 ![图片说明](https://img-ask.csdn.net/upload/201807/07/1530932050_488694.png) 本地curl -i 是可以访问链接的 ![图片说明](https://img-ask.csdn.net/upload/201807/07/1530932079_448161.png) 到底是什么原因呢...崩溃了....哪些同学遇到过这个情况?谢谢。

android studio 导入github项目出错:startup failed

android studio 导入github项目出错:startup failed ![图片说明](https://img-ask.csdn.net/upload/201912/07/1575705839_965977.png) 点击open file,显示注释这行有错: ![图片说明](https://img-ask.csdn.net/upload/201912/07/1575705925_659514.png) 删除注释,就会有新错: ![图片说明](https://img-ask.csdn.net/upload/201912/07/1575706040_376828.png) 错误是这样: ``` ERROR: Could not find method buildscript() for arguments [build_d3qy2t3u4593rxqhf9sxz98oc$_run_closure1@4bd534b8] on root project 'MobileShop-prj06' of type org.gradle.api.Project. ``` 弄了好久真的没辙了,有大神能帮忙提点解决一下吗,感激不尽!!!!

android studio 2.0 使用instant run后无法成功build

更新了android studio 2.0,然后更新了gradle使用instant run后,再重建工程会出现如下错误: :app:transformClassesWithDexForDebug FAILED Error:Execution failed for task ':app:transformClassesWithDexForDebug'. java.io.IOException: Failed to delete C:\Users\XXXXXXX\AndroidStudioProjects\XXXXXXXX\app\build\intermediates\pre-dexed\debug\main_4be3817b3ac54222d1f1b2d714d0ba2d9da99cbb.jar 实际发现这个文件是不存在的,不知道IOException是不是正是由此导致。 试过修改buildTool版本,compileSdk版本等等,都没用啊。

AS修改xml后必须clean

我的android studio最近在做项目时发现修改了xml文件后直接run在手机上并没有显示的还是未修改之前的效果,必须clean或者rebuild一下再run的时候在手机上才能看到效果。 gradle版本:4.4 对应的插件com.android.tools.build:gradle:3.1.2 相关的配置如下: // SDK And Tools minSdkVersion = 14 targetSdkVersion = 20 compileSdkVersion = 27 buildToolsVersion = '27.0.3' //Dependencies supportLibraryVersion = '26.1.0' 网上看到有修改instant run什么的都试过了不行,哪位大神指导讲解下。

android studio中有一个报错不知道怎么解决,有前辈可以指导一下怎么解决吗?

程序报错 org.xml.sax.SAXParseException; lineNumber: 9; columnNumber: 18; XML 文档结构必须从头至尾包含在同一个实体内。 at com.sun.org.apache.xerces.internal.util.ErrorHandlerWrapper.createSAXParseException(ErrorHandlerWrapper.java:203) at com.sun.org.apache.xerces.internal.util.ErrorHandlerWrapper.fatalError(ErrorHandlerWrapper.java:177) at com.sun.org.apache.xerces.internal.impl.XMLErrorReporter.reportError(XMLErrorReporter.java:400) at com.sun.org.apache.xerces.internal.impl.XMLErrorReporter.reportError(XMLErrorReporter.java:327) at com.sun.org.apache.xerces.internal.impl.XMLScanner.reportFatalError(XMLScanner.java:1472) at com.sun.org.apache.xerces.internal.impl.XMLDocumentFragmentScannerImpl.endEntity(XMLDocumentFragmentScannerImpl.java:899) at com.sun.org.apache.xerces.internal.impl.XMLDocumentScannerImpl.endEntity(XMLDocumentScannerImpl.java:559) at com.sun.org.apache.xerces.internal.impl.XMLEntityManager.endEntity(XMLEntityManager.java:1398) at com.sun.org.apache.xerces.internal.impl.XMLEntityScanner.load(XMLEntityScanner.java:1916) at com.sun.org.apache.xerces.internal.impl.XMLEntityScanner.skipSpaces(XMLEntityScanner.java:1629) at com.sun.org.apache.xerces.internal.impl.XMLNSDocumentScannerImpl.scanAttribute(XMLNSDocumentScannerImpl.java:411) at com.sun.org.apache.xerces.internal.impl.XMLNSDocumentScannerImpl.scanStartElement(XMLNSDocumentScannerImpl.java:250) at com.sun.org.apache.xerces.internal.impl.XMLDocumentFragmentScannerImpl$FragmentContentDriver.next(XMLDocumentFragmentScannerImpl.java:2784) at com.sun.org.apache.xerces.internal.impl.XMLDocumentScannerImpl.next(XMLDocumentScannerImpl.java:602) at com.sun.org.apache.xerces.internal.impl.XMLNSDocumentScannerImpl.next(XMLNSDocumentScannerImpl.java:112) at com.sun.org.apache.xerces.internal.impl.XMLDocumentFragmentScannerImpl.scanDocument(XMLDocumentFragmentScannerImpl.java:505) at com.sun.org.apache.xerces.internal.parsers.XML11Configuration.parse(XML11Configuration.java:842) at com.sun.org.apache.xerces.internal.parsers.XML11Configuration.parse(XML11Configuration.java:771) at com.sun.org.apache.xerces.internal.parsers.XMLParser.parse(XMLParser.java:141) at com.sun.org.apache.xerces.internal.parsers.AbstractSAXParser.parse(AbstractSAXParser.java:1213) at com.sun.org.apache.xerces.internal.jaxp.SAXParserImpl$JAXPSAXParser.parse(SAXParserImpl.java:643) at com.sun.org.apache.xerces.internal.jaxp.SAXParserImpl.parse(SAXParserImpl.java:327) at com.android.utils.PositionXmlParser.parse(PositionXmlParser.java:176) at com.android.utils.PositionXmlParser.parse(PositionXmlParser.java:139) at com.android.utils.PositionXmlParser.parse(PositionXmlParser.java:92) at com.android.utils.PositionXmlParser.parse(PositionXmlParser.java:101) at com.android.ide.common.resources.ValueResourceParser2.parseDocument(ValueResourceParser2.java:212) at com.android.ide.common.resources.ValueResourceParser2.parseFile(ValueResourceParser2.java:91) at com.android.ide.common.resources.ResourceSet.createResourceFile(ResourceSet.java:553) at com.android.ide.common.resources.ResourceSet.parseFolder(ResourceSet.java:485) at com.android.ide.common.resources.ResourceSet.readSourceFolder(ResourceSet.java:291) at com.android.ide.common.resources.DataSet.loadFromFiles(DataSet.java:252) at com.android.build.gradle.tasks.MergeResources.lambda$doFullTaskAction$0(MergeResources.java:238) at com.android.build.gradle.internal.tasks.Blocks.recordSpan(Blocks.java:58) at com.android.build.gradle.tasks.MergeResources.doFullTaskAction(MergeResources.java:232) at com.android.build.gradle.internal.tasks.IncrementalTask.handleIncrementalInputs(IncrementalTask.kt:107) at com.android.build.gradle.internal.tasks.IncrementalTask.access$handleIncrementalInputs(IncrementalTask.kt:64) at com.android.build.gradle.internal.tasks.IncrementalTask$taskAction$$inlined$recordTaskAction$1.invoke(AndroidVariantTask.kt:51) at com.android.build.gradle.internal.tasks.IncrementalTask$taskAction$$inlined$recordTaskAction$1.invoke(AndroidVariantTask.kt:31) at com.android.build.gradle.internal.tasks.Blocks.recordSpan(Blocks.java:91) at com.android.build.gradle.internal.tasks.IncrementalTask.taskAction$gradle(IncrementalTask.kt:134) at sun.reflect.GeneratedMethodAccessor289.invoke(Unknown Source) at sun.reflect.DelegatingMethodAccessorImpl.invoke(DelegatingMethodAccessorImpl.java:43) at java.lang.reflect.Method.invoke(Method.java:498) at org.gradle.internal.reflect.JavaMethod.invoke(JavaMethod.java:103) at org.gradle.api.internal.project.taskfactory.IncrementalTaskInputsTaskAction.doExecute(IncrementalTaskInputsTaskAction.java:46) at org.gradle.api.internal.project.taskfactory.StandardTaskAction.execute(StandardTaskAction.java:41) at org.gradle.api.internal.project.taskfactory.AbstractIncrementalTaskAction.execute(AbstractIncrementalTaskAction.java:25) at org.gradle.api.internal.project.taskfactory.StandardTaskAction.execute(StandardTaskAction.java:28) at org.gradle.api.internal.tasks.execution.ExecuteActionsTaskExecuter$5.run(ExecuteActionsTaskExecuter.java:404) at org.gradle.internal.operations.DefaultBuildOperationExecutor$RunnableBuildOperationWorker.execute(DefaultBuildOperationExecutor.java:402) at org.gradle.internal.operations.DefaultBuildOperationExecutor$RunnableBuildOperationWorker.execute(DefaultBuildOperationExecutor.java:394) at org.gradle.internal.operations.DefaultBuildOperationExecutor$1.execute(DefaultBuildOperationExecutor.java:165) at org.gradle.internal.operations.DefaultBuildOperationExecutor.execute(DefaultBuildOperationExecutor.java:250) at org.gradle.internal.operations.DefaultBuildOperationExecutor.execute(DefaultBuildOperationExecutor.java:158) at org.gradle.internal.operations.DefaultBuildOperationExecutor.run(DefaultBuildOperationExecutor.java:92) at org.gradle.internal.operations.DelegatingBuildOperationExecutor.run(DelegatingBuildOperationExecutor.java:31) at org.gradle.api.internal.tasks.execution.ExecuteActionsTaskExecuter.executeAction(ExecuteActionsTaskExecuter.java:393) at org.gradle.api.internal.tasks.execution.ExecuteActionsTaskExecuter.executeActions(ExecuteActionsTaskExecuter.java:376) at org.gradle.api.internal.tasks.execution.ExecuteActionsTaskExecuter.access$200(ExecuteActionsTaskExecuter.java:80) at org.gradle.api.internal.tasks.execution.ExecuteActionsTaskExecuter$TaskExecution.execute(ExecuteActionsTaskExecuter.java:213) at org.gradle.internal.execution.steps.ExecuteStep.lambda$execute$0(ExecuteStep.java:32) at java.util.Optional.map(Optional.java:215) at org.gradle.internal.execution.steps.ExecuteStep.execute(ExecuteStep.java:32) at org.gradle.internal.execution.steps.ExecuteStep.execute(ExecuteStep.java:26) at org.gradle.internal.execution.steps.CleanupOutputsStep.execute(CleanupOutputsStep.java:58) at org.gradle.internal.execution.steps.CleanupOutputsStep.execute(CleanupOutputsStep.java:35) at org.gradle.internal.execution.steps.ResolveInputChangesStep.execute(ResolveInputChangesStep.java:48) at org.gradle.internal.execution.steps.ResolveInputChangesStep.execute(ResolveInputChangesStep.java:33) at org.gradle.internal.execution.steps.CancelExecutionStep.execute(CancelExecutionStep.java:39) at org.gradle.internal.execution.steps.TimeoutStep.executeWithoutTimeout(TimeoutStep.java:73) at org.gradle.internal.execution.steps.TimeoutStep.execute(TimeoutStep.java:54) at org.gradle.internal.execution.steps.CatchExceptionStep.execute(CatchExceptionStep.java:35) at org.gradle.internal.execution.steps.CreateOutputsStep.execute(CreateOutputsStep.java:51) at org.gradle.internal.execution.steps.SnapshotOutputsStep.execute(SnapshotOutputsStep.java:45) at org.gradle.internal.execution.steps.SnapshotOutputsStep.execute(SnapshotOutputsStep.java:31) at org.gradle.internal.execution.steps.CacheStep.executeWithoutCache(CacheStep.java:201) at org.gradle.internal.execution.steps.CacheStep.execute(CacheStep.java:70) at org.gradle.internal.execution.steps.CacheStep.execute(CacheStep.java:45) at org.gradle.internal.execution.steps.BroadcastChangingOutputsStep.execute(BroadcastChangingOutputsStep.java:49) at org.gradle.internal.execution.steps.StoreSnapshotsStep.execute(StoreSnapshotsStep.java:43) at org.gradle.internal.execution.steps.StoreSnapshotsStep.execute(StoreSnapshotsStep.java:32) at org.gradle.internal.execution.steps.RecordOutputsStep.execute(RecordOutputsStep.java:38) at org.gradle.internal.execution.steps.RecordOutputsStep.execute(RecordOutputsStep.java:24) at org.gradle.internal.execution.steps.SkipUpToDateStep.executeBecause(SkipUpToDateStep.java:96) at org.gradle.internal.execution.steps.SkipUpToDateStep.lambda$execute$0(SkipUpToDateStep.java:89) at java.util.Optional.map(Optional.java:215) at org.gradle.internal.execution.steps.SkipUpToDateStep.execute(SkipUpToDateStep.java:54) at org.gradle.internal.execution.steps.SkipUpToDateStep.execute(SkipUpToDateStep.java:38) at org.gradle.internal.execution.steps.ResolveChangesStep.execute(ResolveChangesStep.java:77) at org.gradle.internal.execution.steps.ResolveChangesStep.execute(ResolveChangesStep.java:37) at org.gradle.internal.execution.steps.legacy.MarkSnapshottingInputsFinishedStep.execute(MarkSnapshottingInputsFinishedStep.java:36) at org.gradle.internal.execution.steps.legacy.MarkSnapshottingInputsFinishedStep.execute(MarkSnapshottingInputsFinishedStep.java:26) at org.gradle.internal.execution.steps.ResolveCachingStateStep.execute(ResolveCachingStateStep.java:90) at org.gradle.internal.execution.steps.ResolveCachingStateStep.execute(ResolveCachingStateStep.java:48) at org.gradle.internal.execution.impl.DefaultWorkExecutor.execute(DefaultWorkExecutor.java:33) at org.gradle.api.internal.tasks.execution.ExecuteActionsTaskExecuter.execute(ExecuteActionsTaskExecuter.java:120) at org.gradle.api.internal.tasks.execution.ResolveBeforeExecutionStateTaskExecuter.execute(ResolveBeforeExecutionStateTaskExecuter.java:75) at org.gradle.api.internal.tasks.execution.ValidatingTaskExecuter.execute(ValidatingTaskExecuter.java:62) at org.gradle.api.internal.tasks.execution.SkipEmptySourceFilesTaskExecuter.execute(SkipEmptySourceFilesTaskExecuter.java:108) at org.gradle.api.internal.tasks.execution.ResolveBeforeExecutionOutputsTaskExecuter.execute(ResolveBeforeExecutionOutputsTaskExecuter.java:67) at org.gradle.api.internal.tasks.execution.ResolveAfterPreviousExecutionStateTaskExecuter.execute(ResolveAfterPreviousExecutionStateTaskExecuter.java:46) at org.gradle.api.internal.tasks.execution.CleanupStaleOutputsExecuter.execute(CleanupStaleOutputsExecuter.java:94) at org.gradle.api.internal.tasks.execution.FinalizePropertiesTaskExecuter.execute(FinalizePropertiesTaskExecuter.java:46) at org.gradle.api.internal.tasks.execution.ResolveTaskExecutionModeExecuter.execute(ResolveTaskExecutionModeExecuter.java:95) at org.gradle.api.internal.tasks.execution.SkipTaskWithNoActionsExecuter.execute(SkipTaskWithNoActionsExecuter.java:57) at org.gradle.api.internal.tasks.execution.SkipOnlyIfTaskExecuter.execute(SkipOnlyIfTaskExecuter.java:56) at org.gradle.api.internal.tasks.execution.CatchExceptionTaskExecuter.execute(CatchExceptionTaskExecuter.java:36) at org.gradle.api.internal.tasks.execution.EventFiringTaskExecuter$1.executeTask(EventFiringTaskExecuter.java:73) at org.gradle.api.internal.tasks.execution.EventFiringTaskExecuter$1.call(EventFiringTaskExecuter.java:52) at org.gradle.api.internal.tasks.execution.EventFiringTaskExecuter$1.call(EventFiringTaskExecuter.java:49) at org.gradle.internal.operations.DefaultBuildOperationExecutor$CallableBuildOperationWorker.execute(DefaultBuildOperationExecutor.java:416) at org.gradle.internal.operations.DefaultBuildOperationExecutor$CallableBuildOperationWorker.execute(DefaultBuildOperationExecutor.java:406) at org.gradle.internal.operations.DefaultBuildOperationExecutor$1.execute(DefaultBuildOperationExecutor.java:165) at org.gradle.internal.operations.DefaultBuildOperationExecutor.execute(DefaultBuildOperationExecutor.java:250) at org.gradle.internal.operations.DefaultBuildOperationExecutor.execute(DefaultBuildOperationExecutor.java:158) at org.gradle.internal.operations.DefaultBuildOperationExecutor.call(DefaultBuildOperationExecutor.java:102) at org.gradle.internal.operations.DelegatingBuildOperationExecutor.call(DelegatingBuildOperationExecutor.java:36) at org.gradle.api.internal.tasks.execution.EventFiringTaskExecuter.execute(EventFiringTaskExecuter.java:49) at org.gradle.execution.plan.LocalTaskNodeExecutor.execute(LocalTaskNodeExecutor.java:43) at org.gradle.execution.taskgraph.DefaultTaskExecutionGraph$InvokeNodeExecutorsAction.execute(DefaultTaskExecutionGraph.java:355) at org.gradle.execution.taskgraph.DefaultTaskExecutionGraph$InvokeNodeExecutorsAction.execute(DefaultTaskExecutionGraph.java:343) at org.gradle.execution.taskgraph.DefaultTaskExecutionGraph$BuildOperationAwareExecutionAction.execute(DefaultTaskExecutionGraph.java:336) at org.gradle.execution.taskgraph.DefaultTaskExecutionGraph$BuildOperationAwareExecutionAction.execute(DefaultTaskExecutionGraph.java:322) at org.gradle.execution.plan.DefaultPlanExecutor$ExecutorWorker$1.execute(DefaultPlanExecutor.java:134) at org.gradle.execution.plan.DefaultPlanExecutor$ExecutorWorker$1.execute(DefaultPlanExecutor.java:129) at org.gradle.execution.plan.DefaultPlanExecutor$ExecutorWorker.execute(DefaultPlanExecutor.java:202) at org.gradle.execution.plan.DefaultPlanExecutor$ExecutorWorker.executeNextNode(DefaultPlanExecutor.java:193) at org.gradle.execution.plan.DefaultPlanExecutor$ExecutorWorker.run(DefaultPlanExecutor.java:129) at org.gradle.internal.concurrent.ExecutorPolicy$CatchAndRecordFailures.onExecute(ExecutorPolicy.java:63) at org.gradle.internal.concurrent.ManagedExecutorImpl$1.run(ManagedExecutorImpl.java:46) at java.util.concurrent.ThreadPoolExecutor.runWorker(ThreadPoolExecutor.java:1149) at java.util.concurrent.ThreadPoolExecutor$Worker.run(ThreadPoolExecutor.java:624) at org.gradle.internal.concurrent.ThreadFactoryImpl$ManagedThreadRunnable.run(ThreadFactoryImpl.java:55) at java.lang.Thread.run(Thread.java:748)

android Studio运行出错,求解决

运行android Studio运行出错出错,报错为:这是怎么回事/////////////// ``` 错误:Execution failed for task ':app:buildInfoDebugLoader'. > Exception while loading build-info.xml : org.xml.sax.SAXParseException; lineNumber: 1; columnNumber: 1; 前言中不允许有内容。 at com.sun.org.apache.xerces.internal.parsers.DOMParser.parse(DOMParser.java:257) at com.sun.org.apache.xerces.internal.jaxp.DocumentBuilderImpl.parse(DocumentBuilderImpl.java:339) at com.android.utils.XmlUtils.parseUtfXmlFile(XmlUtils.java:514) at com.android.build.gradle.internal.incremental.InstantRunBuildContext.mergeFromFile(InstantRunBuildContext.java:676) at com.android.build.gradle.internal.incremental.BuildInfoLoaderTask.executeAction(BuildInfoLoaderTask.java:72) at sun.reflect.NativeMethodAccessorImpl.invoke0(Native Method) at sun.reflect.NativeMethodAccessorImpl.invoke(NativeMethodAccessorImpl.java:62) at sun.reflect.DelegatingMethodAccessorImpl.invoke(DelegatingMethodAccessorImpl.java:43) at java.lang.reflect.Method.invoke(Method.java:498) at org.gradle.internal.reflect.JavaMethod.invoke(JavaMethod.java:73) at org.gradle.api.internal.project.taskfactory.DefaultTaskClassInfoStore$StandardTaskAction.doExecute(DefaultTaskClassInfoStore.java:141) at org.gradle.api.internal.project.taskfactory.DefaultTaskClassInfoStore$StandardTaskAction.execute(DefaultTaskClassInfoStore.java:134) at org.gradle.api.internal.project.taskfactory.DefaultTaskClassInfoStore$StandardTaskAction.execute(DefaultTaskClassInfoStore.java:123) at org.gradle.api.internal.AbstractTask$TaskActionWrapper.execute(AbstractTask.java:632) at org.gradle.api.internal.AbstractTask$TaskActionWrapper.execute(AbstractTask.java:615) at org.gradle.api.internal.tasks.execution.ExecuteActionsTaskExecuter.executeAction(ExecuteActionsTaskExecuter.java:95) at org.gradle.api.internal.tasks.execution.ExecuteActionsTaskExecuter.executeActions(ExecuteActionsTaskExecuter.java:76) at org.gradle.api.internal.tasks.execution.ExecuteActionsTaskExecuter.execute(ExecuteActionsTaskExecuter.java:55) at org.gradle.api.internal.tasks.execution.SkipUpToDateTaskExecuter.execute(SkipUpToDateTaskExecuter.java:62) at org.gradle.api.internal.tasks.execution.ValidatingTaskExecuter.execute(ValidatingTaskExecuter.java:58) at org.gradle.api.internal.tasks.execution.SkipEmptySourceFilesTaskExecuter.execute(SkipEmptySourceFilesTaskExecuter.java:88) at org.gradle.api.internal.tasks.execution.ResolveTaskArtifactStateTaskExecuter.execute(ResolveTaskArtifactStateTaskExecuter.java:46) at org.gradle.api.internal.tasks.execution.SkipTaskWithNoActionsExecuter.execute(SkipTaskWithNoActionsExecuter.java:51) at org.gradle.api.internal.tasks.execution.SkipOnlyIfTaskExecuter.execute(SkipOnlyIfTaskExecuter.java:54) at org.gradle.api.internal.tasks.execution.ExecuteAtMostOnceTaskExecuter.execute(ExecuteAtMostOnceTaskExecuter.java:43) at org.gradle.api.internal.tasks.execution.CatchExceptionTaskExecuter.execute(CatchExceptionTaskExecuter.java:34) at org.gradle.execution.taskgraph.DefaultTaskGraphExecuter$EventFiringTaskWorker$1.execute(DefaultTaskGraphExecuter.java:236) at org.gradle.execution.taskgraph.DefaultTaskGraphExecuter$EventFiringTaskWorker$1.execute(DefaultTaskGraphExecuter.java:228) at org.gradle.internal.Transformers$4.transform(Transformers.java:169) at org.gradle.internal.progress.DefaultBuildOperationExecutor.run(DefaultBuildOperationExecutor.java:106) at org.gradle.internal.progress.DefaultBuildOperationExecutor.run(DefaultBuildOperationExecutor.java:61) at org.gradle.execution.taskgraph.DefaultTaskGraphExecuter$EventFiringTaskWorker.execute(DefaultTaskGraphExecuter.java:228) at org.gradle.execution.taskgraph.DefaultTaskGraphExecuter$EventFiringTaskWorker.execute(DefaultTaskGraphExecuter.java:215) at org.gradle.execution.taskgraph.AbstractTaskPlanExecutor$TaskExecutorWorker.processTask(AbstractTaskPlanExecutor.java:77) at org.gradle.execution.taskgraph.AbstractTaskPlanExecutor$TaskExecutorWorker.run(AbstractTaskPlanExecutor.java:58) at org.gradle.execution.taskgraph.DefaultTaskPlanExecutor.process(DefaultTaskPlanExecutor.java:32) at org.gradle.execution.taskgraph.DefaultTaskGraphExecuter.execute(DefaultTaskGraphExecuter.java:113) at org.gradle.execution.SelectedTaskExecutionAction.execute(SelectedTaskExecutionAction.java:37) at org.gradle.execution.DefaultBuildExecuter.execute(DefaultBuildExecuter.java:37) at org.gradle.execution.DefaultBuildExecuter.access$000(DefaultBuildExecuter.java:23) at org.gradle.execution.DefaultBuildExecuter$1.proceed(DefaultBuildExecuter.java:43) at org.gradle.execution.DryRunBuildExecutionAction.execute(DryRunBuildExecutionAction.java:32) at org.gradle.execution.DefaultBuildExecuter.execute(DefaultBuildExecuter.java:37) at org.gradle.execution.DefaultBuildExecuter.execute(DefaultBuildExecuter.java:30) at org.gradle.initialization.DefaultGradleLauncher$3.execute(DefaultGradleLauncher.java:196) at org.gradle.initialization.DefaultGradleLauncher$3.execute(DefaultGradleLauncher.java:193) at org.gradle.internal.Transformers$4.transform(Transformers.java:169) at org.gradle.internal.progress.DefaultBuildOperationExecutor.run(DefaultBuildOperationExecutor.java:106) at org.gradle.internal.progress.DefaultBuildOperationExecutor.run(DefaultBuildOperationExecutor.java:56) at org.gradle.initialization.DefaultGradleLauncher.doBuildStages(DefaultGradleLauncher.java:193) at org.gradle.initialization.DefaultGradleLauncher.doBuild(DefaultGradleLauncher.java:119) at org.gradle.initialization.DefaultGradleLauncher.run(DefaultGradleLauncher.java:102) at org.gradle.launcher.exec.GradleBuildController.run(GradleBuildController.java:71) at org.gradle.tooling.internal.provider.runner.BuildModelActionRunner.run(BuildModelActionRunner.java:50) at org.gradle.launcher.exec.ChainingBuildActionRunner.run(ChainingBuildActionRunner.java:35) at org.gradle.tooling.internal.provider.runner.RunAsBuildOperationBuildActionRunner$1.execute(RunAsBuildOperationBuildActionRunner.java:43) at org.gradle.tooling.internal.provider.runner.RunAsBuildOperationBuildActionRunner$1.execute(RunAsBuildOperationBuildActionRunner.java:40) at org.gradle.internal.Transformers$4.transform(Transformers.java:169) at org.gradle.internal.progress.DefaultBuildOperationExecutor.run(DefaultBuildOperationExecutor.java:106) at org.gradle.internal.progress.DefaultBuildOperationExecutor.run(DefaultBuildOperationExecutor.java:56) at org.gradle.tooling.internal.provider.runner.RunAsBuildOperationBuildActionRunner.run(RunAsBuildOperationBuildActionRunner.java:40) at org.gradle.tooling.internal.provider.runner.SubscribableBuildActionRunner.run(SubscribableBuildActionRunner.java:75) at org.gradle.launcher.exec.ChainingBuildActionRunner.run(ChainingBuildActionRunner.java:35) at org.gradle.launcher.exec.InProcessBuildActionExecuter.execute(InProcessBuildActionExecuter.java:41) at org.gradle.launcher.exec.InProcessBuildActionExecuter.execute(InProcessBuildActionExecuter.java:26) at org.gradle.tooling.internal.provider.ContinuousBuildActionExecuter.execute(ContinuousBuildActionExecuter.java:75) at org.gradle.tooling.internal.provider.ContinuousBuildActionExecuter.execute(ContinuousBuildActionExecuter.java:49) at org.gradle.tooling.internal.provider.ServicesSetupBuildActionExecuter.execute(ServicesSetupBuildActionExecuter.java:44) at org.gradle.tooling.internal.provider.ServicesSetupBuildActionExecuter.execute(ServicesSetupBuildActionExecuter.java:29) at org.gradle.launcher.daemon.server.exec.ExecuteBuild.doBuild(ExecuteBuild.java:67) at org.gradle.launcher.daemon.server.exec.BuildCommandOnly.execute(BuildCommandOnly.java:36) at org.gradle.launcher.daemon.server.api.DaemonCommandExecution.proceed(DaemonCommandExecution.java:120) at org.gradle.launcher.daemon.server.exec.WatchForDisconnection.execute(WatchForDisconnection.java:47) at org.gradle.launcher.daemon.server.api.DaemonCommandExecution.proceed(DaemonCommandExecution.java:120) at org.gradle.launcher.daemon.server.exec.ResetDeprecationLogger.execute(ResetDeprecationLogger.java:26) at org.gradle.launcher.daemon.server.api.DaemonCommandExecution.proceed(DaemonCommandExecution.java:120) at org.gradle.launcher.daemon.server.exec.RequestStopIfSingleUsedDaemon.execute(RequestStopIfSingleUsedDaemon.java:34) at org.gradle.launcher.daemon.server.api.DaemonCommandExecution.proceed(DaemonCommandExecution.java:120) at org.gradle.launcher.daemon.server.exec.ForwardClientInput$2.call(ForwardClientInput.java:74) at org.gradle.launcher.daemon.server.exec.ForwardClientInput$2.call(ForwardClientInput.java:72) at org.gradle.util.Swapper.swap(Swapper.java:38) at org.gradle.launcher.daemon.server.exec.ForwardClientInput.execute(ForwardClientInput.java:72) at org.gradle.launcher.daemon.server.api.DaemonCommandExecution.proceed(DaemonCommandExecution.java:120) at org.gradle.launcher.daemon.server.exec.LogAndCheckHealth.execute(LogAndCheckHealth.java:55) at org.gradle.launcher.daemon.server.api.DaemonCommandExecution.proceed(DaemonCommandExecution.java:120) at org.gradle.launcher.daemon.server.exec.LogToClient.doBuild(LogToClient.java:60) ```

android studio混淆批量打包编译出错问题,请大神来解答

各位大神,小弟刚刚接触android Studio,现在正在要开发做打包的工作,但是编译上却出了问题,希望大神帮忙解答,错误如下 FAILURE: Build failed with an exception. * What went wrong: A problem occurred configuring root project 'android'. > Could not resolve all dependencies for configuration ':classpath'. > Could not find com.android.tools.build:gradle:2.2.1. Searched in the following locations: http://maven.oschina.net/content/groups/public/com/android/tools/build/gradle/2.2.1/gradle-2.2.1.pom http://maven.oschina.net/content/groups/public/com/android/tools/build/gradle/2.2.1/gradle-2.2.1.jar Required by: :android:unspecified * Try: Run with --stacktrace option to get the stack trace. Run with --info or --debug option to get more log output. BUILD FAILED 希望大神能指出问题所在,谢谢了!

在中国程序员是青春饭吗?

今年,我也32了 ,为了不给大家误导,咨询了猎头、圈内好友,以及年过35岁的几位老程序员……舍了老脸去揭人家伤疤……希望能给大家以帮助,记得帮我点赞哦。 目录: 你以为的人生 一次又一次的伤害 猎头界的真相 如何应对互联网行业的「中年危机」 一、你以为的人生 刚入行时,拿着傲人的工资,想着好好干,以为我们的人生是这样的: 等真到了那一天,你会发现,你的人生很可能是这样的: ...

技术大佬:我去,你写的 switch 语句也太老土了吧

昨天早上通过远程的方式 review 了两名新来同事的代码,大部分代码都写得很漂亮,严谨的同时注释也很到位,这令我非常满意。但当我看到他们当中有一个人写的 switch 语句时,还是忍不住破口大骂:“我擦,小王,你丫写的 switch 语句也太老土了吧!” 来看看小王写的代码吧,看完不要骂我装逼啊。 private static String createPlayer(PlayerTypes p...

华为初面+综合面试(Java技术面)附上面试题

华为面试整体流程大致分为笔试,性格测试,面试,综合面试,回学校等结果。笔试来说,华为的难度较中等,选择题难度和网易腾讯差不多。最后的代码题,相比下来就简单很多,一共3道题目,前2题很容易就AC,题目已经记不太清楚,不过难度确实不大。最后一题最后提交的代码过了75%的样例,一直没有发现剩下的25%可能存在什么坑。 笔试部分太久远,我就不怎么回忆了。直接将面试。 面试 如果说腾讯的面试是挥金如土...

和黑客斗争的 6 天!

互联网公司工作,很难避免不和黑客们打交道,我呆过的两家互联网公司,几乎每月每天每分钟都有黑客在公司网站上扫描。有的是寻找 Sql 注入的缺口,有的是寻找线上服务器可能存在的漏洞,大部分都...

讲一个程序员如何副业月赚三万的真实故事

loonggg读完需要3分钟速读仅需 1 分钟大家好,我是你们的校长。我之前讲过,这年头,只要肯动脑,肯行动,程序员凭借自己的技术,赚钱的方式还是有很多种的。仅仅靠在公司出卖自己的劳动时...

win10暴力查看wifi密码

刚才邻居打了个电话说:喂小灰,你家wifi的密码是多少,我怎么连不上了。 我。。。 我也忘了哎,就找到了一个好办法,分享给大家: 第一种情况:已经连接上的wifi,怎么知道密码? 打开:控制面板\网络和 Internet\网络连接 然后右击wifi连接的无线网卡,选择状态 然后像下图一样: 第二种情况:前提是我不知道啊,但是我以前知道密码。 此时可以利用dos命令了 1、利用netsh wlan...

上班一个月,后悔当初着急入职的选择了

最近有个老铁,告诉我说,上班一个月,后悔当初着急入职现在公司了。他之前在美图做手机研发,今年美图那边今年也有一波组织优化调整,他是其中一个,在协商离职后,当时捉急找工作上班,因为有房贷供着,不能没有收入来源。所以匆忙选了一家公司,实际上是一个大型外包公司,主要派遣给其他手机厂商做外包项目。**当时承诺待遇还不错,所以就立马入职去上班了。但是后面入职后,发现薪酬待遇这块并不是HR所说那样,那个HR自...

总结了 150 余个神奇网站,你不来瞅瞅吗?

原博客再更新,可能就没了,之后将持续更新本篇博客。

副业收入是我做程序媛的3倍,工作外的B面人生是怎样的?

提到“程序员”,多数人脑海里首先想到的大约是:为人木讷、薪水超高、工作枯燥…… 然而,当离开工作岗位,撕去层层标签,脱下“程序员”这身外套,有的人生动又有趣,马上展现出了完全不同的A/B面人生! 不论是简单的爱好,还是正经的副业,他们都干得同样出色。偶尔,还能和程序员的特质结合,产生奇妙的“化学反应”。 @Charlotte:平日素颜示人,周末美妆博主 大家都以为程序媛也个个不修边幅,但我们也许...

如果你是老板,你会不会踢了这样的员工?

有个好朋友ZS,是技术总监,昨天问我:“有一个老下属,跟了我很多年,做事勤勤恳恳,主动性也很好。但随着公司的发展,他的进步速度,跟不上团队的步伐了,有点...

我入职阿里后,才知道原来简历这么写

私下里,有不少读者问我:“二哥,如何才能写出一份专业的技术简历呢?我总感觉自己写的简历太烂了,所以投了无数份,都石沉大海了。”说实话,我自己好多年没有写过简历了,但我认识的一个同行,他在阿里,给我说了一些他当年写简历的方法论,我感觉太牛逼了,实在是忍不住,就分享了出来,希望能够帮助到你。 01、简历的本质 作为简历的撰写者,你必须要搞清楚一点,简历的本质是什么,它就是为了来销售你的价值主张的。往深...

带了6个月的徒弟当了面试官,而身为高级工程师的我天天修Bug......

即将毕业的应届毕业生一枚,现在只拿到了两家offer,但最近听到一些消息,其中一个offer,我这个组据说客户很少,很有可能整组被裁掉。 想问大家: 如果我刚入职这个组就被裁了怎么办呢? 大家都是什么时候知道自己要被裁了的? 面试软技能指导: BQ/Project/Resume 试听内容: 除了刷题,还有哪些技能是拿到offer不可或缺的要素 如何提升面试软实力:简历, 行为面试,沟通能...

!大部分程序员只会写3年代码

如果世界上都是这种不思进取的软件公司,那别说大部分程序员只会写 3 年代码,恐怕就没有程序员这种职业。

离职半年了,老东家又发 offer,回不回?

有小伙伴问松哥这个问题,他在上海某公司,在离职了几个月后,前公司的领导联系到他,希望他能够返聘回去,他很纠结要不要回去? 俗话说好马不吃回头草,但是这个小伙伴既然感到纠结了,我觉得至少说明了两个问题:1.曾经的公司还不错;2.现在的日子也不是很如意。否则应该就不会纠结了。 老实说,松哥之前也有过类似的经历,今天就来和小伙伴们聊聊回头草到底吃不吃。 首先一个基本观点,就是离职了也没必要和老东家弄的苦...

HTTP与HTTPS的区别

面试官问HTTP与HTTPS的区别,我这样回答让他竖起大拇指!

程序员毕业去大公司好还是小公司好?

虽然大公司并不是人人都能进,但我仍建议还未毕业的同学,尽力地通过校招向大公司挤,但凡挤进去,你这一生会容易很多。 大公司哪里好?没能进大公司怎么办?答案都在这里了,记得帮我点赞哦。 目录: 技术氛围 内部晋升与跳槽 啥也没学会,公司倒闭了? 不同的人脉圈,注定会有不同的结果 没能去大厂怎么办? 一、技术氛围 纵观整个程序员技术领域,哪个在行业有所名气的大牛,不是在大厂? 而且众所...

程序员为什么千万不要瞎努力?

本文作者用对比非常鲜明的两个开发团队的故事,讲解了敏捷开发之道 —— 如果你的团队缺乏统一标准的环境,那么即使勤劳努力,不仅会极其耗时而且成果甚微,使用...

为什么程序员做外包会被瞧不起?

二哥,有个事想询问下您的意见,您觉得应届生值得去外包吗?公司虽然挺大的,中xx,但待遇感觉挺低,马上要报到,挺纠结的。

当HR压你价,说你只值7K,你该怎么回答?

当HR压你价,说你只值7K时,你可以流畅地回答,记住,是流畅,不能犹豫。 礼貌地说:“7K是吗?了解了。嗯~其实我对贵司的面试官印象很好。只不过,现在我的手头上已经有一份11K的offer。来面试,主要也是自己对贵司挺有兴趣的,所以过来看看……”(未完) 这段话主要是陪HR互诈的同时,从公司兴趣,公司职员印象上,都给予对方正面的肯定,既能提升HR的好感度,又能让谈判气氛融洽,为后面的发挥留足空间。...

面试:第十六章:Java中级开发(16k)

HashMap底层实现原理,红黑树,B+树,B树的结构原理 Spring的AOP和IOC是什么?它们常见的使用场景有哪些?Spring事务,事务的属性,传播行为,数据库隔离级别 Spring和SpringMVC,MyBatis以及SpringBoot的注解分别有哪些?SpringMVC的工作原理,SpringBoot框架的优点,MyBatis框架的优点 SpringCould组件有哪些,他们...

面试阿里p7,被按在地上摩擦,鬼知道我经历了什么?

面试阿里p7被问到的问题(当时我只知道第一个):@Conditional是做什么的?@Conditional多个条件是什么逻辑关系?条件判断在什么时候执...

终于懂了TCP和UDP协议区别

终于懂了TCP和UDP协议区别

Python爬虫,高清美图我全都要(彼岸桌面壁纸)

爬取彼岸桌面网站较为简单,用到了requests、lxml、Beautiful Soup4

无代码时代来临,程序员如何保住饭碗?

编程语言层出不穷,从最初的机器语言到如今2500种以上的高级语言,程序员们大呼“学到头秃”。程序员一边面临编程语言不断推陈出新,一边面临由于许多代码已存在,程序员编写新应用程序时存在重复“搬砖”的现象。 无代码/低代码编程应运而生。无代码/低代码是一种创建应用的方法,它可以让开发者使用最少的编码知识来快速开发应用程序。开发者通过图形界面中,可视化建模来组装和配置应用程序。这样一来,开发者直...

面试了一个 31 岁程序员,让我有所触动,30岁以上的程序员该何去何从?

最近面试了一个31岁8年经验的程序猿,让我有点感慨,大龄程序猿该何去何从。

大三实习生,字节跳动面经分享,已拿Offer

说实话,自己的算法,我一个不会,太难了吧

程序员垃圾简历长什么样?

已经连续五年参加大厂校招、社招的技术面试工作,简历看的不下于万份 这篇文章会用实例告诉你,什么是差的程序员简历! 疫情快要结束了,各个公司也都开始春招了,作为即将红遍大江南北的新晋UP主,那当然要为小伙伴们做点事(手动狗头)。 就在公众号里公开征简历,义务帮大家看,并一一点评。《启舰:春招在即,义务帮大家看看简历吧》 一石激起千层浪,三天收到两百多封简历。 花光了两个星期的所有空闲时...

美团面试,问了ThreadLocal原理,这个回答让我通过了

他想都想不到,ThreadLocal我烂熟于心

大牛都会用的IDEA调试技巧!!!

导读 前天面试了一个985高校的实习生,问了他平时用什么开发工具,他想也没想的说IDEA,于是我抛砖引玉的问了一下IDEA的调试用过吧,你说说怎么设置断点...

面试官:你连SSO都不懂,就别来面试了

大厂竟然要考我SSO,卧槽。

立即提问
相关内容推荐