Java IDEA 报错internal java compiler error

环境: Mac 10.10

IDEA版本: 2017.2.6

问题描述: 新建了maven项目,写了一个测试类,main方法运行报错Error:java: Compilation failed: internal java compiler error

已尝试的解决办法:在project和module中将JDK版本改成了1.8 且在setting中将Java Complier 改成了1.8 但在选择module的时候显示nothing to show故module的地方没有任何选择。继续运行还是报错。

相关图如下:

图片说明

图片说明

图片说明

4个回答

很显然jdk没有被认到,需要重新配置下
http://blog.csdn.net/qq_19707521/article/details/56333907
重新下载安装,配置好,检查环境变量也搞好以后,再File-->Setting...-->Build,Execution,Deployment-->Compiler-->Java Compiler 设置下。

问题解决,原因:Mac 下面的IDEA没有settings选项,之前误以为File > other srttings > default setttings..就是windows下IDEA的File > settings...其实不是。在Mac下顶栏IntelliJ IDEA > Preferences才是windows下的IDEA一直使用的settings,打开IntelliJ IDEA > Preferences然后选择Java Compiler,然后再点击+号就可以看到当前工程的module,添加module并选择jdk版本即可。如下图:

图片说明

图片说明

感谢 caozhy 积极回答问题,结帖了。

simplemanMYB
M-yb 有帮助,感谢
4 个月之前 回复
weixin_38350854
天降伟人武大狼 我也遇到一样问题,多亏了你!!!!!多谢
大约 2 年之前 回复

很奇怪为什么在choose module的时候会显示nothing to show.......

Csdn user default icon
上传中...
上传图片
插入图片
抄袭、复制答案,以达到刷声望分或其他目的的行为,在CSDN问答是严格禁止的,一经发现立刻封号。是时候展现真正的技术了!
其他相关推荐
idea改成eclipse编译报错Error:java: Internal error:

问题描述 **Error:java: Internal error:** java.lang.IllegalArgumentException at org.eclipse.jdt.internal.compiler.tool.EclipseFileManager.handleOption(EclipseFileManager.java:758) at java.compiler@11.0.3/javax.tools.ForwardingJavaFileManager.handleOption(ForwardingJavaFileManager.java:99) at org.jetbrains.jps.javac.JpsJavacFileManager.handleOption(JpsJavacFileManager.java:318) at org.jetbrains.jps.javac.JavacMain.compile(JavacMain.java:71) at org.jetbrains.jps.incremental.java.JavaBuilder.compileJava(JavaBuilder.java:460) at org.jetbrains.jps.incremental.java.JavaBuilder.compile(JavaBuilder.java:330) at org.jetbrains.jps.incremental.java.JavaBuilder.doBuild(JavaBuilder.java:255) at org.jetbrains.jps.incremental.java.JavaBuilder.build(JavaBuilder.java:213) at org.jetbrains.jps.incremental.IncProjectBuilder.runModuleLevelBuilders(IncProjectBuilder.java:1324) at org.jetbrains.jps.incremental.IncProjectBuilder.runBuildersForChunk(IncProjectBuilder.java:1004) at org.jetbrains.jps.incremental.IncProjectBuilder.buildTargetsChunk(IncProjectBuilder.java:1071) at org.jetbrains.jps.incremental.IncProjectBuilder.buildChunkIfAffected(IncProjectBuilder.java:965) at org.jetbrains.jps.incremental.IncProjectBuilder.buildChunks(IncProjectBuilder.java:794) at org.jetbrains.jps.incremental.IncProjectBuilder.runBuild(IncProjectBuilder.java:376) at org.jetbrains.jps.incremental.IncProjectBuilder.build(IncProjectBuilder.java:178) at org.jetbrains.jps.cmdline.BuildRunner.runBuild(BuildRunner.java:139) at org.jetbrains.jps.cmdline.BuildSession.runBuild(BuildSession.java:288) at org.jetbrains.jps.cmdline.BuildSession.run(BuildSession.java:121) at org.jetbrains.jps.cmdline.BuildMain$MyMessageHandler.lambda$channelRead0$0(BuildMain.java:228) at java.base/java.util.concurrent.ThreadPoolExecutor.runWorker(ThreadPoolExecutor.java:1128) at java.base/java.util.concurrent.ThreadPoolExecutor$Worker.run(ThreadPoolExecutor.java:628) at java.base/java.lang.Thread.run(Thread.java:834) 尝试的解决方法: 我所有Jdk版本都改过来了,如下 (https://blog.csdn.net/wo541075754/article/details/82119860 "") 还是不管用。 我用Javac能编译,不报这个错。但是这个项目必须用eclipse编译。 下面是我配置的版本 ![图片说明](https://img-ask.csdn.net/upload/201910/10/1570678333_670537.png)![图片说明](https://img-ask.csdn.net/upload/201910/10/1570678338_83497.png)![图片说明](https://img-ask.csdn.net/upload/201910/10/1570678344_612385.png)![图片说明](https://img-ask.csdn.net/upload/201910/10/1570678348_889029.png)

IDEA运行报错:Error:Internal error: (java.net.MalformedURLException) unknown protocol:

Error:Internal error: (java.net.MalformedURLException) unknown protocol: jrt java.net.MalformedURLException: unknown protocol: jrt at java.net.URL.<init>(URL.java:421) at java.net.URL.<init>(URL.java:310) at java.net.URL.<init>(URL.java:333) at com.intellij.compiler.instrumentation.InstrumentationClassFinder.createJDKPlatformUrl(InstrumentationClassFinder.java:61) at org.jetbrains.jps.incremental.instrumentation.ClassProcessingBuilder.createInstrumentationClassFinder(ClassProcessingBuilder.java:125) at org.jetbrains.jps.incremental.instrumentation.ClassProcessingBuilder.build(ClassProcessingBuilder.java:93) at org.jetbrains.jps.incremental.IncProjectBuilder.runModuleLevelBuilders(IncProjectBuilder.java:1246) at org.jetbrains.jps.incremental.IncProjectBuilder.runBuildersForChunk(IncProjectBuilder.java:923) at org.jetbrains.jps.incremental.IncProjectBuilder.buildTargetsChunk(IncProjectBuilder.java:995) at org.jetbrains.jps.incremental.IncProjectBuilder.buildChunkIfAffected(IncProjectBuilder.java:886) at org.jetbrains.jps.incremental.IncProjectBuilder.buildChunks(IncProjectBuilder.java:719) at org.jetbrains.jps.incremental.IncProjectBuilder.runBuild(IncProjectBuilder.java:371) at org.jetbrains.jps.incremental.IncProjectBuilder.build(IncProjectBuilder.java:178) at org.jetbrains.jps.cmdline.BuildRunner.runBuild(BuildRunner.java:138) at org.jetbrains.jps.cmdline.BuildSession.runBuild(BuildSession.java:308) at org.jetbrains.jps.cmdline.BuildSession.run(BuildSession.java:138) at org.jetbrains.jps.cmdline.BuildMain$MyMessageHandler.lambda$channelRead0$0(BuildMain.java:235) at org.jetbrains.jps.service.impl.SharedThreadPoolImpl.lambda$executeOnPooledThread$0(SharedThreadPoolImpl.java:42) at java.util.concurrent.Executors$RunnableAdapter.call(Executors.java:511) at java.util.concurrent.FutureTask.run(FutureTask.java:266) at java.util.concurrent.ThreadPoolExecutor.runWorker(ThreadPoolExecutor.java:1142) at java.util.concurrent.ThreadPoolExecutor$Worker.run(ThreadPoolExecutor.java:617) at java.lang.Thread.run(Thread.java:745) Please perform full project rebuild (Build | Rebuild Project)

java的报错是什么问题?

Exception in thread "main" javax.imageio.IIOException: Can't read input file! at javax.imageio.ImageIO.read(ImageIO.java:1301) at org.crazyit.ball.BallComponent.<init>(BallComponent.java:53) at org.crazyit.ball.Stick.<init>(Stick.java:34) at org.crazyit.ball.BallService.<init>(BallService.java:57) at org.crazyit.ball.BallFrame.initialize(BallFrame.java:67) at org.crazyit.ball.BallFrame.<init>(BallFrame.java:49) at org.crazyit.ball.BallGame.main(BallGame.java:24)

idea+tomcat启动java web 项目报错,有没有大神能帮忙看下,第一次用idea部署

Information:Eclipse compiler 4.10 was used to compile java sources Information:2019/8/25 15:55 - Build completed with 1 error and 0 warnings in 3 s 858 ms Error:java: Internal error: java.lang.IllegalArgumentException at org.eclipse.jdt.internal.compiler.tool.EclipseFileManager.handleOption(EclipseFileManager.java:758) at java.compiler@11.0.3/javax.tools.ForwardingJavaFileManager.handleOption(ForwardingJavaFileManager.java:99) at org.jetbrains.jps.javac.JpsJavacFileManager.handleOption(JpsJavacFileManager.java:318) at org.jetbrains.jps.javac.JavacMain.compile(JavacMain.java:71) at org.jetbrains.jps.incremental.java.JavaBuilder.compileJava(JavaBuilder.java:460) at org.jetbrains.jps.incremental.java.JavaBuilder.compile(JavaBuilder.java:330) at org.jetbrains.jps.incremental.java.JavaBuilder.doBuild(JavaBuilder.java:255) at org.jetbrains.jps.incremental.java.JavaBuilder.build(JavaBuilder.java:213) at org.jetbrains.jps.incremental.IncProjectBuilder.runModuleLevelBuilders(IncProjectBuilder.java:1324) at org.jetbrains.jps.incremental.IncProjectBuilder.runBuildersForChunk(IncProjectBuilder.java:1004) at org.jetbrains.jps.incremental.IncProjectBuilder.buildTargetsChunk(IncProjectBuilder.java:1071) at org.jetbrains.jps.incremental.IncProjectBuilder.buildChunkIfAffected(IncProjectBuilder.java:965) at org.jetbrains.jps.incremental.IncProjectBuilder.buildChunks(IncProjectBuilder.java:794) at org.jetbrains.jps.incremental.IncProjectBuilder.runBuild(IncProjectBuilder.java:376) at org.jetbrains.jps.incremental.IncProjectBuilder.build(IncProjectBuilder.java:178) at org.jetbrains.jps.cmdline.BuildRunner.runBuild(BuildRunner.java:139) at org.jetbrains.jps.cmdline.BuildSession.runBuild(BuildSession.java:288) at org.jetbrains.jps.cmdline.BuildSession.run(BuildSession.java:121) at org.jetbrains.jps.cmdline.BuildMain$MyMessageHandler.lambda$channelRead0$0(BuildMain.java:228) at java.base/java.util.concurrent.ThreadPoolExecutor.runWorker(ThreadPoolExecutor.java:1128) at java.base/java.util.concurrent.ThreadPoolExecutor$Worker.run(ThreadPoolExecutor.java:628) at java.base/java.lang.Thread.run(Thread.java:834) ![图片说明](https://img-ask.csdn.net/upload/201908/26/1566794972_394518.png) ![图片说明](https://img-ask.csdn.net/upload/201908/26/1566795064_36397.png)

intellij idea导入eclipse创建的maven web项目 jar包导入总是报错

** 软件环境**: spring+springMVC+mybatis+ mysql; tomcat服务器; maven项目 eclipse工具运行正常; **问题描述:** maven的jar包依赖没有导入成功,maven配置正常 沿用了阿里云的中心库eclipse可用; 报错截图1: ![图片说明](https://img-ask.csdn.net/upload/201811/12/1542032523_181718.png) ``` nformation:java: Errors occurred while compiling module 'miaolanghzong' Information:Eclipse compiler 4.7.2 was used to compile java sources Information:2018/11/12 21:56 - Compilation completed with 133 errors and 418 warnings in 29 s 620 ms D:\career\workspaceTest2\erzhentang\src\main\java\com\app\totalController\MemberBusinessController.java Error:Error:line (1)java: Syntax error on token "Invalid Character", delete this token Error:Error:line (13)java: The import javax.servlet.http.HttpServletRequest cannot be resolved Error:Error:line (14)java: The import javax.servlet.http.HttpServletResponse cannot be resolved Error:Error:line (47)java: The import com.google.gson cannot be resolved Error:Error:line (659)java: HttpServletRequest cannot be resolved to a type Error:Error:line (659)java: HttpServletResponse cannot be resolved to a type Error:Error:line (623)java: HttpServletRequest cannot be resolved to a type Error:Error:line (623)java: HttpServletResponse cannot be resolved to a type Error:Error:line (894)java: HttpServletRequest cannot be resolved to a type Error:Error:line (894)java: HttpServletResponse cannot be resolved to a type Error:Error:line (806)java: HttpServletRequest cannot be resolved to a type Error:Error:line (806)java: HttpServletResponse cannot be resolved to a type Error:Error:line (198)java: HttpServletRequest cannot be resolved to a type Error:Error:line (198)java: HttpServletResponse cannot be resolved to a type Error:Error:line (277)java: HttpServletRequest cannot be resolved to a type Error:Error:line (277)java: HttpServletResponse cannot be resolved to a type Error:Error:line (134)java: HttpServletRequest cannot be resolved to a type Error:Error:line (134)java: HttpServletResponse cannot be resolved to a type Error:Error:line (460)java: HttpServletRequest cannot be resolved to a type Error:Error:line (460)java: HttpServletResponse cannot be resolved to a type Error:Error:line (540)java: HttpServletRequest cannot be resolved to a type Error:Error:line (540)java: HttpServletResponse cannot be resolved to a type Error:Error:line (109)java: HttpServletRequest cannot be resolved to a type Error:Error:line (109)java: HttpServletResponse cannot be resolved to a type Error:Error:line (411)java: HttpServletRequest cannot be resolved to a type Error:Error:line (411)java: HttpServletResponse cannot be resolved to a type Warning:Warning:line (114)java: The static method sendCode(java.lang.String) from the type com.app.util.Alidayu should be accessed in a static way Warning:Warning:line (154)java: The static method md5Encode(java.lang.String) from the type com.app.util.MD5Util should be accessed in a static way Warning:Warning:line (207)java: The static method md5Encode(java.lang.String) from the type com.app.util.MD5Util should be accessed in a static way Warning:Warning:line (286)java: The static method md5Encode(java.lang.String) from the type com.app.util.MD5Util should be accessed in a static way Warning:Warning:line (421)java: The static method md5Encode(java.lang.String) from the type com.app.util.MD5Util should be accessed in a static way Warning:Warning:line (469)java: The static method md5Encode(java.lang.String) from the type com.app.util.MD5Util should be accessed in a static way Warning:Warning:line (549)java: The static method md5Encode(java.lang.String) from the type com.app.util.MD5Util should be accessed in a static way D:\career\workspaceTest2\erzhentang\src\main\java\com\app\common\LoginFilter.java Error:Error:line (23)java: Filter cannot be resolved to a type Error:Error:line (37)java: ServletException cannot be resolved to a type Error:Error:line (36)java: ServletRequest cannot be resolved to a type Error:Error:line (36)java: ServletResponse cannot be resolved to a type Error:Error:line (37)java: FilterChain cannot be resolved to a type Error:Error:line (106)java: ServletException cannot be resolved to a type Error:Error:line (106)java: FilterConfig cannot be resolved to a type Error:Error:line (7)java: The import javax.servlet.Filter cannot be resolved Error:Error:line (8)java: The import javax.servlet.FilterChain cannot be resolved Error:Error:line (9)java: The import javax.servlet.FilterConfig cannot be resolved Error:Error:line (10)java: The import javax.servlet.ServletException cannot be resolved Error:Error:line (11)java: The import javax.servlet.ServletRequest cannot be resolved Error:Error:line (12)java: The import javax.servlet.ServletResponse cannot be resolved Error:Error:line (13)java: The import javax.servlet.http.HttpServletRequest cannot be resolved Error:Error:line (14)java: The import javax.servlet.http.HttpServletResponse cannot be resolved Error:Error:line (15)java: The import javax.servlet.http.HttpSession cannot be resolved Error:Error:line (24)java: FilterConfig cannot be resolved to a type Warning:Warning:line (26)java: java.util.List is a raw type. References to generic type java.util.List<E> should be parameterized Warning:Warning:line (28)java: java.util.List is a raw type. References to generic type java.util.List<E> should be parameterized Error:Error:line (33)java: FilterConfig cannot be resolved to a type Error:Error:line (39)java: HttpServletRequest cannot be resolved to a type Error:Error:line (39)java: HttpServletRequest cannot be resolved to a type Error:Error:line (40)java: HttpServletResponse cannot be resolved to a type Error:Error:line (40)java: HttpServletResponse cannot be resolved to a type Error:Error:line (41)java: HttpSession cannot be resolved to a type Error:Error:line (107)java: FilterConfig cannot be resolved to a type Error:Error:line (108)java: FilterConfig cannot be resolved to a type Error:Error:line (113)java: FilterConfig cannot be resolved to a type D:\career\workspaceTest2\erzhentang\src\main\java\com\app\dao\impl\MemberDaoImpl.java Warning:Warning:line (42)java: java.util.Map is a raw type. References to generic type java.util.Map<K,V> should be parameterized Warning:Warning:line (63)java: java.util.Map is a raw type. References to generic type java.util.Map<K,V> should be parameterized Warning:Warning:line (110)java: java.util.Map is a raw type. References to generic type java.util.Map<K,V> should be parameterized Warning:Warning:line (9)java: The import com.app.bean.Menu is never used D:\career\workspaceTest2\erzhentang\src\main\java\com\app\dao\impl\EarProblemDaoImpl.java Warning:Warning:line (18)java: java.util.Map is a raw type. References to generic type java.util.Map<K,V> should be parameterized Warning:Warning:line (48)java: java.util.Map is a raw type. References to generic type java.util.Map<K,V> should be parameterized D:\career\workspaceTest2\erzhentang\src\main\java\com\app\dao\impl\BodyConclusionDaoImpl.java Warning:Warning:line (25)java: java.util.Map is a raw type. References to generic type java.util.Map<K,V> should be parameterized Warning:Warning:line (11)java: The import com.app.bean.BodyConclusionWuxing is never used D:\career\workspaceTest2\erzhentang\src\main\java\com\app\dao\mapper\EarDisease100Mapper.java Warning:Warning:line (14)java: java.util.Map is a raw type. References to generic type java.util.Map<K,V> should be parameterized D:\career\workspaceTest2\erzhentang\src\main\java\com\app\dao\BlueToochMacDao.java Warning:Warning:line (12)java: java.util.Map is a raw type. References to generic type java.util.Map<K,V> should be parameterized Warning:Warning:line (14)java: java.util.Map is a raw type. References to generic type java.util.Map<K,V> should be parameterized D:\career\workspaceTest2\erzhentang\src\main\java\com\app\dao\EarScanC ``` ![图片说明](https://img-ask.csdn.net/upload/201811/12/1542031436_513761.png) ![图片说明](https://img-ask.csdn.net/upload/201811/12/1542031687_784746.png) ![图片说明](https://img-ask.csdn.net/upload/201811/12/1542031723_457809.png) ![图片说明](https://img-ask.csdn.net/upload/201811/12/1542031745_434340.png) ![图片说明](https://img-ask.csdn.net/upload/201811/12/1542031762_172605.png) ![图片说明](https://img-ask.csdn.net/upload/201811/12/1542031776_649119.png)

idea项目突然编译不了了

Information:java: 编译器 (1.6.0_43) 中出现异常。 如果在 Bug Parade 中没有找到该错误,请在 Java Developer Connection (http://java.sun.com/webapps/bugreport) 对该错误进行归档。 请在报告中附上您的程序和以下诊断信息。谢谢您的合作。 Information:java: java.nio.BufferOverflowException Information:java: at java.nio.Buffer.nextPutIndex(Buffer.java:493) Information:java: at java.nio.HeapCharBuffer.put(HeapCharBuffer.java:145) Information:java: at org.jetbrains.jps.javac.OptimizedFileManager.decode(OptimizedFileManager.java:511) Information:java: at org.jetbrains.jps.javac.OptimizedFileManager.access$400(OptimizedFileManager.java:41) Information:java: at org.jetbrains.jps.javac.OptimizedFileManager$InputFileObject.loadFileContent(OptimizedFileManager.java:377) Information:java: at org.jetbrains.jps.javac.OptimizedFileManager$InputFileObject.getCharContent(OptimizedFileManager.java:367) Information:java: at org.jetbrains.jps.javac.OptimizedFileManager$InputFileObject.getCharContent(OptimizedFileManager.java:292) Information:java: at com.sun.tools.javac.main.JavaCompiler.readSource(JavaCompiler.java:483) Information:java: at com.sun.tools.javac.main.JavaCompiler.parse(JavaCompiler.java:550) Information:java: at com.sun.tools.javac.main.JavaCompiler.parseFiles(JavaCompiler.java:804) Information:java: at com.sun.tools.javac.main.JavaCompiler.compile(JavaCompiler.java:727) Information:java: at com.sun.tools.javac.main.Main.compile(Main.java:353) Information:java: at com.sun.tools.javac.api.JavacTaskImpl.call(JavacTaskImpl.java:113) Information:java: at org.jetbrains.jps.javac.JavacMain.compile(JavacMain.java:198) Information:java: at org.jetbrains.jps.javac.ExternalJavacProcess.compile(ExternalJavacProcess.java:195) Information:java: at org.jetbrains.jps.javac.ExternalJavacProcess.access$400(ExternalJavacProcess.java:47) Information:java: at org.jetbrains.jps.javac.ExternalJavacProcess$CompilationRequestsHandler$1.run(ExternalJavacProcess.java:262) Information:java: at java.util.concurrent.Executors$RunnableAdapter.call(Executors.java:439) Information:java: at java.util.concurrent.FutureTask$Sync.innerRun(FutureTask.java:303) Information:java: at java.util.concurrent.FutureTask.run(FutureTask.java:138) Information:java: at java.util.concurrent.ThreadPoolExecutor$Worker.runTask(ThreadPoolExecutor.java:895) Information:java: at java.util.concurrent.ThreadPoolExecutor$Worker.run(ThreadPoolExecutor.java:918) Information:java: at java.lang.Thread.run(Thread.java:662) Information:java: Errors occurred while compiling module 'SC-GJ-20140528' Information:javac 6 was used to compile java sources Information:Module "SC-GJ-20140528" was fully rebuilt due to project configuration/dependencies changes Information:2018/5/22 18:11 - Compilation completed with 1 error and 0 warnings in 1 m 18 s 530 ms Error:java: Compilation failed: internal java compiler error 前几天都还运行的好好的,今天突然编译都过不了,同事的都没问题

sbt报错scala.runtime in compiler mirror not found

用sbt编译kafka manager工程时报错如下信息: [info] Loading project definition from E:\workspace\idea\kafka-manager-master\project error: error while loading <root>, error in opening zip file scala.reflect.internal.MissingRequirementError: object scala.runtime in compiler mirror not found. at scala.reflect.internal.MissingRequirementError$.signal(MissingRequirementError.scala:16) at scala.reflect.internal.MissingRequirementError$.notFound(MissingRequirementError.scala:17) at scala.reflect.internal.Mirrors$RootsBase.getModuleOrClass(Mirrors.scala:48) at scala.reflect.internal.Mirrors$RootsBase.getModuleOrClass(Mirrors.scala:40) at scala.reflect.internal.Mirrors$RootsBase.getModuleOrClass(Mirrors.scala:61) at scala.reflect.internal.Mirrors$RootsBase.getPackage(Mirrors.scala:172) at scala.reflect.internal.Mirrors$RootsBase.getRequiredPackage(Mirrors.scala:175) at scala.reflect.internal.Definitions$DefinitionsClass.RuntimePackage$lzycompute(Definitions.scala:183) at scala.reflect.internal.Definitions$DefinitionsClass.RuntimePackage(Definitions.scala:183) at scala.reflect.internal.Definitions$DefinitionsClass.RuntimePackageClass$lzycompute(Definitions.scala:184) at scala.reflect.internal.Definitions$DefinitionsClass.RuntimePackageClass(Definitions.scala:184) at scala.reflect.internal.Definitions$DefinitionsClass.AnnotationDefaultAttr$lzycompute(Definitions.scala:1024) at scala.reflect.internal.Definitions$DefinitionsClass.AnnotationDefaultAttr(Definitions.scala:1023) at scala.reflect.internal.Definitions$DefinitionsClass.syntheticCoreClasses$lzycompute(Definitions.scala:1153) at scala.reflect.internal.Definitions$DefinitionsClass.syntheticCoreClasses(Definitions.scala:1152) at scala.reflect.internal.Definitions$DefinitionsClass.symbolsNotPresentInBytecode$lzycompute(Definitions.scala:1196) at scala.reflect.internal.Definitions$DefinitionsClass.symbolsNotPresentInBytecode(Definitions.scala:1196) at scala.reflect.internal.Definitions$DefinitionsClass.init(Definitions.scala:1261) at scala.tools.nsc.Global$Run.<init>(Global.scala:1290) at sbt.compiler.Eval$$anon$1.<init>(Eval.scala:141) at sbt.compiler.Eval.run$lzycompute$1(Eval.scala:141) at sbt.compiler.Eval.run$1(Eval.scala:141) at sbt.compiler.Eval.unlinkAll$1(Eval.scala:144) at sbt.compiler.Eval.evalCommon(Eval.scala:153) at sbt.compiler.Eval.evalDefinitions(Eval.scala:122) at sbt.EvaluateConfigurations$.evaluateDefinitions(EvaluateConfigurations.scala:271) at sbt.EvaluateConfigurations$.evaluateSbtFile(EvaluateConfigurations.scala:109) at sbt.Load$.sbt$Load$$loadSettingsFile$1(Load.scala:775) at sbt.Load$$anonfun$sbt$Load$$memoLoadSettingsFile$1$1.apply(Load.scala:781) at sbt.Load$$anonfun$sbt$Load$$memoLoadSettingsFile$1$1.apply(Load.scala:780) at scala.collection.MapLike$class.getOrElse(MapLike.scala:128) at scala.collection.AbstractMap.getOrElse(Map.scala:58) at sbt.Load$.sbt$Load$$memoLoadSettingsFile$1(Load.scala:780) at sbt.Load$$anonfun$loadFiles$1$2.apply(Load.scala:788) at sbt.Load$$anonfun$loadFiles$1$2.apply(Load.scala:788) at scala.collection.TraversableLike$$anonfun$map$1.apply(TraversableLike.scala:244) at scala.collection.TraversableLike$$anonfun$map$1.apply(TraversableLike.scala:244) at scala.collection.mutable.ResizableArray$class.foreach(ResizableArray.scala:59) at scala.collection.mutable.ArrayBuffer.foreach(ArrayBuffer.scala:47) at scala.collection.TraversableLike$class.map(TraversableLike.scala:244) at scala.collection.AbstractTraversable.map(Traversable.scala:105) at sbt.Load$.loadFiles$1(Load.scala:788) at sbt.Load$.discoverProjects(Load.scala:799) at sbt.Load$.discover$1(Load.scala:585) at sbt.Load$.sbt$Load$$loadTransitive(Load.scala:633) at sbt.Load$$anonfun$loadUnit$1.sbt$Load$$anonfun$$loadProjects$1(Load.scala:482) at sbt.Load$$anonfun$loadUnit$1$$anonfun$40.apply(Load.scala:485) at sbt.Load$$anonfun$loadUnit$1$$anonfun$40.apply(Load.scala:485) at sbt.Load$.timed(Load.scala:1025) at sbt.Load$$anonfun$loadUnit$1.apply(Load.scala:485) at sbt.Load$$anonfun$loadUnit$1.apply(Load.scala:459) at sbt.Load$.timed(Load.scala:1025) at sbt.Load$.loadUnit(Load.scala:459) at sbt.Load$$anonfun$25$$anonfun$apply$14.apply(Load.scala:311) at sbt.Load$$anonfun$25$$anonfun$apply$14.apply(Load.scala:310) at sbt.BuildLoader$$anonfun$componentLoader$1$$anonfun$apply$4$$anonfun$apply$5$$anonfun$apply$6.apply(BuildLoader.scala:91) at sbt.BuildLoader$$anonfun$componentLoader$1$$anonfun$apply$4$$anonfun$apply$5$$anonfun$apply$6.apply(BuildLoader.scala:90) at sbt.BuildLoader.apply(BuildLoader.scala:140) at sbt.Load$.loadAll(Load.scala:365) at sbt.Load$.loadURI(Load.scala:320) at sbt.Load$.load(Load.scala:316) at sbt.Load$.load(Load.scala:305) at sbt.Load$$anonfun$4.apply(Load.scala:146) at sbt.Load$$anonfun$4.apply(Load.scala:146) at sbt.Load$.timed(Load.scala:1025) at sbt.Load$.apply(Load.scala:146) at sbt.Load$.defaultLoad(Load.scala:39) at sbt.BuiltinCommands$.liftedTree1$1(Main.scala:496) at sbt.BuiltinCommands$.doLoadProject(Main.scala:496) at sbt.BuiltinCommands$$anonfun$loadProjectImpl$2.apply(Main.scala:488) at sbt.BuiltinCommands$$anonfun$loadProjectImpl$2.apply(Main.scala:488) at sbt.Command$$anonfun$applyEffect$1$$anonfun$apply$2.apply(Command.scala:59) at sbt.Command$$anonfun$applyEffect$1$$anonfun$apply$2.apply(Command.scala:59) at sbt.Command$$anonfun$applyEffect$2$$anonfun$apply$3.apply(Command.scala:61) at sbt.Command$$anonfun$applyEffect$2$$anonfun$apply$3.apply(Command.scala:61) at sbt.Command$.process(Command.scala:93) at sbt.MainLoop$$anonfun$1$$anonfun$apply$1.apply(MainLoop.scala:96) at sbt.MainLoop$$anonfun$1$$anonfun$apply$1.apply(MainLoop.scala:96) at sbt.State$$anon$1.process(State.scala:184) at sbt.MainLoop$$anonfun$1.apply(MainLoop.scala:96) at sbt.MainLoop$$anonfun$1.apply(MainLoop.scala:96) at sbt.ErrorHandling$.wideConvert(ErrorHandling.scala:17) at sbt.MainLoop$.next(MainLoop.scala:96) at sbt.MainLoop$.run(MainLoop.scala:89) at sbt.MainLoop$$anonfun$runWithNewLog$1.apply(MainLoop.scala:68) at sbt.MainLoop$$anonfun$runWithNewLog$1.apply(MainLoop.scala:63) at sbt.Using.apply(Using.scala:24) at sbt.MainLoop$.runWithNewLog(MainLoop.scala:63) at sbt.MainLoop$.runAndClearLast(MainLoop.scala:46) at sbt.MainLoop$.runLoggedLoop(MainLoop.scala:30) at sbt.MainLoop$.runLogged(MainLoop.scala:22) at sbt.StandardMain$.runManaged(Main.scala:57) at sbt.xMain.run(Main.scala:29) at xsbt.boot.Launch$$anonfun$run$1.apply(Launch.scala:109) at xsbt.boot.Launch$.withContextLoader(Launch.scala:128) at xsbt.boot.Launch$.run(Launch.scala:109) at xsbt.boot.Launch$$anonfun$apply$1.apply(Launch.scala:35) at xsbt.boot.Launch$.launch(Launch.scala:117) at xsbt.boot.Launch$.apply(Launch.scala:18) at xsbt.boot.Boot$.runImpl(Boot.scala:41) at xsbt.boot.Boot$.main(Boot.scala:17) at xsbt.boot.Boot.main(Boot.scala) [error] scala.reflect.internal.MissingRequirementError: object scala.runtime in compiler mirror not found. [error] Use 'last' for the full log. Java HotSpot(TM) 64-Bit Server VM warning: ignoring option MaxPermSize=768M; support was removed in 8.0

跪求解决:idea无法启动,启动报错

下面是idea打出来的报错日志,跪求大佬帮忙解决!谢谢 ``` OpenJDK 64-Bit Server VM warning: Sharing is only supported for boot loader classes because bootstrap classpath has been appended WARNING: An illegal reflective access operation has occurred WARNING: Illegal reflective access by com.intellij.util.ReflectionUtil to method sun.java2d.SunGraphicsEnvironment.isUIScaleEnabled() WARNING: Please consider reporting this to the maintainers of com.intellij.util.ReflectionUtil WARNING: Use --illegal-access=warn to enable warnings of further illegal reflective access operations WARNING: All illegal access operations will be denied in a future release SLF4J: Class path contains multiple SLF4J bindings. SLF4J: Found binding in [jar:file:/C:/Users/juchu/AppData/Roaming/JetBrains/IntelliJIdea2020.1/plugins/jr-ide-idea/lib/jr-ide-slf4j-2020.2.2.jar!/org/slf4j/impl/StaticLoggerBinder.class] SLF4J: Found binding in [jar:file:/C:/ProgramFiles/JetBrains/IntelliJ%20IDEA%202020.1.2/lib/slf4j-log4j12-1.7.25.jar!/org/slf4j/impl/StaticLoggerBinder.class] SLF4J: Found binding in [jar:file:/C:/ProgramFiles/JetBrains/IntelliJ%20IDEA%202020.1.2/plugins/maven/lib/maven36-server-impl.jar!/org/slf4j/impl/StaticLoggerBinder.class] SLF4J: See http://www.slf4j.org/codes.html#multiple_bindings for an explanation. SLF4J: Actual binding is of type [org.slf4j.impl.StaticLoggerBinder$StaticLoggerBinderFactory] 2020-06-17 07:03:26,972 [ 89789] WARN - Container.ComponentManagerImpl - Do not use constructor injection (requestorClass=org.sonarlint.intellij.core.SonarLintEngineManager) 2020-06-17 07:03:53,491 [ 116308] WARN - Container.ComponentManagerImpl - Do not use constructor injection (requestorClass=org.sonarlint.intellij.core.SonarLintEngineFactory) 2020-06-17 07:03:53,553 [ 116370] WARN - Container.ComponentManagerImpl - Do not use constructor injection (requestorClass=org.sonarlint.intellij.util.SonarLintActions) 2020-06-17 07:03:53,585 [ 116402] ERROR - tellij.diagnostic.LoadingState - Should be called at least in the state COMPONENTS_LOADED, the current state is: CONFIGURATION_STORE_INITIALIZED Current violators count: 1 java.lang.Throwable at com.intellij.diagnostic.LoadingState.logStateError(LoadingState.java:56) at com.intellij.diagnostic.LoadingState.checkOccurred(LoadingState.java:52) at com.intellij.openapi.actionSystem.impl.ActionManagerImpl.<init>(ActionManagerImpl.java:149) at java.base/jdk.internal.reflect.NativeConstructorAccessorImpl.newInstance0(Native Method) at java.base/jdk.internal.reflect.NativeConstructorAccessorImpl.newInstance(NativeConstructorAccessorImpl.java:62) at java.base/jdk.internal.reflect.DelegatingConstructorAccessorImpl.newInstance(DelegatingConstructorAccessorImpl.java:45) at java.base/java.lang.reflect.Constructor.newInstance(Constructor.java:490) at com.intellij.serviceContainer.ConstructorInjectionKt.instantiateUsingPicoContainer(constructorInjection.kt:48) at com.intellij.serviceContainer.ComponentManagerImpl.instantiateClassWithConstructorInjection(ComponentManagerImpl.kt:660) at com.intellij.serviceContainer.ServiceComponentAdapter.createAndInitialize(ServiceComponentAdapter.kt:54) at com.intellij.serviceContainer.ServiceComponentAdapter.access$createAndInitialize(ServiceComponentAdapter.kt:15) at com.intellij.serviceContainer.ServiceComponentAdapter$doCreateInstance$$inlined$use$lambda$1.run(ServiceComponentAdapter.kt:47) at com.intellij.openapi.progress.impl.CoreProgressManager.registerIndicatorAndRun(CoreProgressManager.java:627) at com.intellij.openapi.progress.impl.CoreProgressManager.executeProcessUnderProgress(CoreProgressManager.java:572) at com.intellij.openapi.progress.impl.ProgressManagerImpl.executeProcessUnderProgress(ProgressManagerImpl.java:61) at com.intellij.openapi.progress.impl.CoreProgressManager.executeNonCancelableSection(CoreProgressManager.java:188) at com.intellij.serviceContainer.ServiceComponentAdapter.doCreateInstance(ServiceComponentAdapter.kt:46) at com.intellij.serviceContainer.BaseComponentAdapter.getInstanceUncached(BaseComponentAdapter.kt:115) at com.intellij.serviceContainer.BaseComponentAdapter.getInstance(BaseComponentAdapter.kt:69) at com.intellij.serviceContainer.BaseComponentAdapter.getInstance$default(BaseComponentAdapter.kt:62) at com.intellij.serviceContainer.ConstructorParameterResolver.resolveInstance(ConstructorParameterResolver.kt:64) at com.intellij.serviceContainer.ConstructorInjectionKt.instantiateUsingPicoContainer(constructorInjection.kt:61) at com.intellij.serviceContainer.ComponentManagerImpl.instantiateClassWithConstructorInjection(ComponentManagerImpl.kt:660) at com.intellij.serviceContainer.MyComponentAdapter.doCreateInstance(MyComponentAdapter.kt:35) at com.intellij.serviceContainer.BaseComponentAdapter.getInstanceUncached(BaseComponentAdapter.kt:115) at com.intellij.serviceContainer.BaseComponentAdapter.getInstance(BaseComponentAdapter.kt:69) at com.intellij.serviceContainer.BaseComponentAdapter.getInstance$default(BaseComponentAdapter.kt:62) at com.intellij.serviceContainer.ComponentManagerImpl.createComponents(ComponentManagerImpl.kt:261) at com.intellij.openapi.application.impl.ApplicationImpl.lambda$loadComponents$5(ApplicationImpl.java:334) at com.intellij.openapi.progress.impl.CoreProgressManager.lambda$runProcess$2(CoreProgressManager.java:166) at com.intellij.openapi.progress.impl.CoreProgressManager.registerIndicatorAndRun(CoreProgressManager.java:627) at com.intellij.openapi.progress.impl.CoreProgressManager.executeProcessUnderProgress(CoreProgressManager.java:572) at com.intellij.openapi.progress.impl.ProgressManagerImpl.executeProcessUnderProgress(ProgressManagerImpl.java:61) at com.intellij.openapi.progress.impl.CoreProgressManager.runProcess(CoreProgressManager.java:153) at com.intellij.openapi.application.impl.ApplicationImpl.loadComponents(ApplicationImpl.java:334) at com.intellij.idea.ApplicationLoader$startApp$6$loadComponentInEdtFuture$1.run(ApplicationLoader.kt:184) at java.base/java.util.concurrent.CompletableFuture$AsyncRun.run(CompletableFuture.java:1736) at com.intellij.openapi.application.TransactionGuardImpl$2.run(TransactionGuardImpl.java:201) at com.intellij.openapi.application.impl.ApplicationImpl.runIntendedWriteActionOnCurrentThread(ApplicationImpl.java:831) at com.intellij.openapi.application.impl.ApplicationImpl.lambda$invokeLater$4(ApplicationImpl.java:310) at com.intellij.openapi.application.impl.FlushQueue.doRun(FlushQueue.java:80) at com.intellij.openapi.application.impl.FlushQueue.runNextEvent(FlushQueue.java:128) at com.intellij.openapi.application.impl.FlushQueue.flushNow(FlushQueue.java:46) at com.intellij.openapi.application.impl.FlushQueue$FlushNow.run(FlushQueue.java:184) at java.desktop/java.awt.event.InvocationEvent.dispatch(InvocationEvent.java:313) at java.desktop/java.awt.EventQueue.dispatchEventImpl(EventQueue.java:776) at java.desktop/java.awt.EventQueue$4.run(EventQueue.java:727) at java.desktop/java.awt.EventQueue$4.run(EventQueue.java:721) at java.base/java.security.AccessController.doPrivileged(Native Method) at java.base/java.security.ProtectionDomain$JavaSecurityAccessImpl.doIntersectionPrivilege(ProtectionDomain.java:85) at java.desktop/java.awt.EventQueue.dispatchEvent(EventQueue.java:746) at com.intellij.ide.IdeEventQueue.dispatchEvent(IdeEventQueue.java:416) at java.desktop/java.awt.EventDispatchThread.pumpOneEventForFilters(EventDispatchThread.java:203) at java.desktop/java.awt.EventDispatchThread.pumpEventsForFilter(EventDispatchThread.java:124) at java.desktop/java.awt.EventDispatchThread.pumpEventsForHierarchy(EventDispatchThread.java:113) at java.desktop/java.awt.EventDispatchThread.pumpEvents(EventDispatchThread.java:109) at java.desktop/java.awt.EventDispatchThread.pumpEvents(EventDispatchThread.java:101) at java.desktop/java.awt.EventDispatchThread.run(EventDispatchThread.java:90) 2020-06-17 07:03:53,600 [ 116417] ERROR - tellij.diagnostic.LoadingState - IntelliJ IDEA 2020.1.2 Build #IU-201.7846.76 2020-06-17 07:03:53,616 [ 116433] ERROR - tellij.diagnostic.LoadingState - JDK: 11.0.7; VM: OpenJDK 64-Bit Server VM; Vendor: JetBrains s.r.o. 2020-06-17 07:03:53,616 [ 116433] ERROR - tellij.diagnostic.LoadingState - OS: Windows 10 2020-06-17 07:03:53,616 [ 116433] ERROR - nSystem.impl.ActionManagerImpl - Assertion failed java.lang.Throwable: Assertion failed at com.intellij.openapi.diagnostic.Logger.assertTrue(Logger.java:182) at com.intellij.openapi.diagnostic.Logger.assertTrue(Logger.java:191) at com.intellij.openapi.actionSystem.impl.ActionManagerImpl.<init>(ActionManagerImpl.java:152) at java.base/jdk.internal.reflect.NativeConstructorAccessorImpl.newInstance0(Native Method) at java.base/jdk.internal.reflect.NativeConstructorAccessorImpl.newInstance(NativeConstructorAccessorImpl.java:62) at java.base/jdk.internal.reflect.DelegatingConstructorAccessorImpl.newInstance(DelegatingConstructorAccessorImpl.java:45) at java.base/java.lang.reflect.Constructor.newInstance(Constructor.java:490) at com.intellij.serviceContainer.ConstructorInjectionKt.instantiateUsingPicoContainer(constructorInjection.kt:48) at com.intellij.serviceContainer.ComponentManagerImpl.instantiateClassWithConstructorInjection(ComponentManagerImpl.kt:660) at com.intellij.serviceContainer.ServiceComponentAdapter.createAndInitialize(ServiceComponentAdapter.kt:54) at com.intellij.serviceContainer.ServiceComponentAdapter.access$createAndInitialize(ServiceComponentAdapter.kt:15) at com.intellij.serviceContainer.ServiceComponentAdapter$doCreateInstance$$inlined$use$lambda$1.run(ServiceComponentAdapter.kt:47) at com.intellij.openapi.progress.impl.CoreProgressManager.registerIndicatorAndRun(CoreProgressManager.java:627) at com.intellij.openapi.progress.impl.CoreProgressManager.executeProcessUnderProgress(CoreProgressManager.java:572) at com.intellij.openapi.progress.impl.ProgressManagerImpl.executeProcessUnderProgress(ProgressManagerImpl.java:61) at com.intellij.openapi.progress.impl.CoreProgressManager.executeNonCancelableSection(CoreProgressManager.java:188) at com.intellij.serviceContainer.ServiceComponentAdapter.doCreateInstance(ServiceComponentAdapter.kt:46) at com.intellij.serviceContainer.BaseComponentAdapter.getInstanceUncached(BaseComponentAdapter.kt:115) at com.intellij.serviceContainer.BaseComponentAdapter.getInstance(BaseComponentAdapter.kt:69) at com.intellij.serviceContainer.BaseComponentAdapter.getInstance$default(BaseComponentAdapter.kt:62) at com.intellij.serviceContainer.ConstructorParameterResolver.resolveInstance(ConstructorParameterResolver.kt:64) at com.intellij.serviceContainer.ConstructorInjectionKt.instantiateUsingPicoContainer(constructorInjection.kt:61) at com.intellij.serviceContainer.ComponentManagerImpl.instantiateClassWithConstructorInjection(ComponentManagerImpl.kt:660) at com.intellij.serviceContainer.MyComponentAdapter.doCreateInstance(MyComponentAdapter.kt:35) at com.intellij.serviceContainer.BaseComponentAdapter.getInstanceUncached(BaseComponentAdapter.kt:115) at com.intellij.serviceContainer.BaseComponentAdapter.getInstance(BaseComponentAdapter.kt:69) at com.intellij.serviceContainer.BaseComponentAdapter.getInstance$default(BaseComponentAdapter.kt:62) at com.intellij.serviceContainer.ComponentManagerImpl.createComponents(ComponentManagerImpl.kt:261) at com.intellij.openapi.application.impl.ApplicationImpl.lambda$loadComponents$5(ApplicationImpl.java:334) at com.intellij.openapi.progress.impl.CoreProgressManager.lambda$runProcess$2(CoreProgressManager.java:166) at com.intellij.openapi.progress.impl.CoreProgressManager.registerIndicatorAndRun(CoreProgressManager.java:627) at com.intellij.openapi.progress.impl.CoreProgressManager.executeProcessUnderProgress(CoreProgressManager.java:572) at com.intellij.openapi.progress.impl.ProgressManagerImpl.executeProcessUnderProgress(ProgressManagerImpl.java:61) at com.intellij.openapi.progress.impl.CoreProgressManager.runProcess(CoreProgressManager.java:153) at com.intellij.openapi.application.impl.ApplicationImpl.loadComponents(ApplicationImpl.java:334) at com.intellij.idea.ApplicationLoader$startApp$6$loadComponentInEdtFuture$1.run(ApplicationLoader.kt:184) at java.base/java.util.concurrent.CompletableFuture$AsyncRun.run(CompletableFuture.java:1736) at com.intellij.openapi.application.TransactionGuardImpl$2.run(TransactionGuardImpl.java:201) at com.intellij.openapi.application.impl.ApplicationImpl.runIntendedWriteActionOnCurrentThread(ApplicationImpl.java:831) at com.intellij.openapi.application.impl.ApplicationImpl.lambda$invokeLater$4(ApplicationImpl.java:310) at com.intellij.openapi.application.impl.FlushQueue.doRun(FlushQueue.java:80) at com.intellij.openapi.application.impl.FlushQueue.runNextEvent(FlushQueue.java:128) at com.intellij.openapi.application.impl.FlushQueue.flushNow(FlushQueue.java:46) at com.intellij.openapi.application.impl.FlushQueue$FlushNow.run(FlushQueue.java:184) at java.desktop/java.awt.event.InvocationEvent.dispatch(InvocationEvent.java:313) at java.desktop/java.awt.EventQueue.dispatchEventImpl(EventQueue.java:776) at java.desktop/java.awt.EventQueue$4.run(EventQueue.java:727) at java.desktop/java.awt.EventQueue$4.run(EventQueue.java:721) at java.base/java.security.AccessController.doPrivileged(Native Method) at java.base/java.security.ProtectionDomain$JavaSecurityAccessImpl.doIntersectionPrivilege(ProtectionDomain.java:85) at java.desktop/java.awt.EventQueue.dispatchEvent(EventQueue.java:746) at com.intellij.ide.IdeEventQueue.dispatchEvent(IdeEventQueue.java:416) at java.desktop/java.awt.EventDispatchThread.pumpOneEventForFilters(EventDispatchThread.java:203) at java.desktop/java.awt.EventDispatchThread.pumpEventsForFilter(EventDispatchThread.java:124) at java.desktop/java.awt.EventDispatchThread.pumpEventsForHierarchy(EventDispatchThread.java:113) at java.desktop/java.awt.EventDispatchThread.pumpEvents(EventDispatchThread.java:109) at java.desktop/java.awt.EventDispatchThread.pumpEvents(EventDispatchThread.java:101) at java.desktop/java.awt.EventDispatchThread.run(EventDispatchThread.java:90) 2020-06-17 07:03:53,631 [ 116448] ERROR - nSystem.impl.ActionManagerImpl - IntelliJ IDEA 2020.1.2 Build #IU-201.7846.76 2020-06-17 07:03:53,631 [ 116448] ERROR - nSystem.impl.ActionManagerImpl - JDK: 11.0.7; VM: OpenJDK 64-Bit Server VM; Vendor: JetBrains s.r.o. 2020-06-17 07:03:53,631 [ 116448] ERROR - nSystem.impl.ActionManagerImpl - OS: Windows 10 2020-06-17 07:03:58,208 [ 121025] WARN - Container.ComponentManagerImpl - Do not use constructor injection (requestorClass=org.sonarlint.intellij.telemetry.SonarLintTelemetryImpl) 2020-06-17 07:03:58,208 [ 121025] WARN - Container.ComponentManagerImpl - Do not use constructor injection (requestorClass=org.sonarlint.intellij.telemetry.TelemetryManagerProvider) ```

用maven进行install的时候报错Error injecting: org.apache.maven.plugin.install.InstallMojo

[code="java"] ------------------------------------------------------- T E S T S ------------------------------------------------------- There are no tests to run. Results : Tests run: 0, Failures: 0, Errors: 0, Skipped: 0 [INFO] [INFO] --- maven-war-plugin:2.1.1:war (default-war) @ llemaicai --- [INFO] Packaging webapp [INFO] Assembling webapp [llemaicai] in [E:\dev\maicai\pro\llemaicai\target\llemaicai] [INFO] Processing war project [INFO] Copying webapp resources [E:\dev\maicai\pro\llemaicai\src\main\webapp] [INFO] Webapp assembled in [35 msecs] [INFO] Building war: E:\dev\maicai\pro\llemaicai\target\llemaicai.war [WARNING] Warning: selected war files include a WEB-INF/web.xml which will be ignored (webxml attribute is missing from war task, or ignoreWebxml attribute is specified as 'true') [INFO] [INFO] --- maven-install-plugin:2.3.1:install (default-install) @ llemaicai --- [WARNING] The POM for org.codehaus.plexus:plexus-digest:jar:1.0 is invalid, transitive dependencies (if any) will not be available, enable debug logging for more details 2013-2-20 14:41:14 org.sonatype.guice.bean.reflect.LoadedClass 警告: Error injecting: org.apache.maven.plugin.install.InstallMojo java.lang.NoClassDefFoundError: org/codehaus/plexus/digest/DigesterException at java.lang.Class.getDeclaredConstructors0(Native Method) at java.lang.Class.privateGetDeclaredConstructors(Class.java:2389) at java.lang.Class.getDeclaredConstructors(Class.java:1836) at com.google.inject.spi.InjectionPoint.forConstructorOf(InjectionPoint.java:243) at com.google.inject.internal.ConstructorBindingImpl.create(ConstructorBindingImpl.java:96) at com.google.inject.internal.InjectorImpl.createUninitializedBinding(InjectorImpl.java:628) at com.google.inject.internal.InjectorImpl.createJustInTimeBinding(InjectorImpl.java:835) at com.google.inject.internal.InjectorImpl.createJustInTimeBindingRecursive(InjectorImpl.java:769) at com.google.inject.internal.InjectorImpl.getJustInTimeBinding(InjectorImpl.java:254) at com.google.inject.internal.InjectorImpl.getBindingOrThrow(InjectorImpl.java:205) at com.google.inject.internal.InjectorImpl.getInternalFactory(InjectorImpl.java:843) at com.google.inject.internal.InjectorImpl.getProviderOrThrow(InjectorImpl.java:957) at com.google.inject.internal.InjectorImpl.getProvider(InjectorImpl.java:990) at com.google.inject.internal.InjectorImpl.getProvider(InjectorImpl.java:951) at com.google.inject.internal.InjectorImpl.getInstance(InjectorImpl.java:1003) at org.sonatype.guice.bean.reflect.AbstractDeferredClass.get(AbstractDeferredClass.java:47) at com.google.inject.internal.InternalFactoryToProviderAdapter.get(InternalFactoryToProviderAdapter.java:40) at com.google.inject.internal.InjectorImpl$4$1.call(InjectorImpl.java:968) at com.google.inject.internal.InjectorImpl.callInContext(InjectorImpl.java:1014) at com.google.inject.internal.InjectorImpl$4.get(InjectorImpl.java:964) at com.google.inject.Scopes$1$1.get(Scopes.java:59) at org.sonatype.guice.bean.locators.LazyBeanEntry.getValue(LazyBeanEntry.java:79) at org.sonatype.guice.plexus.locators.LazyPlexusBean.getValue(LazyPlexusBean.java:53) at org.codehaus.plexus.DefaultPlexusContainer.lookup(DefaultPlexusContainer.java:243) at org.codehaus.plexus.DefaultPlexusContainer.lookup(DefaultPlexusContainer.java:235) at org.apache.maven.plugin.internal.DefaultMavenPluginManager.getConfiguredMojo(DefaultMavenPluginManager.java:455) at org.apache.maven.plugin.DefaultBuildPluginManager.executeMojo(DefaultBuildPluginManager.java:92) at org.apache.maven.lifecycle.internal.MojoExecutor.execute(MojoExecutor.java:209) at org.apache.maven.lifecycle.internal.MojoExecutor.execute(MojoExecutor.java:153) at org.apache.maven.lifecycle.internal.MojoExecutor.execute(MojoExecutor.java:145) at org.apache.maven.lifecycle.internal.LifecycleModuleBuilder.buildProject(LifecycleModuleBuilder.java:84) at org.apache.maven.lifecycle.internal.LifecycleModuleBuilder.buildProject(LifecycleModuleBuilder.java:59) at org.apache.maven.lifecycle.internal.LifecycleStarter.singleThreadedBuild(LifecycleStarter.java:183) at org.apache.maven.lifecycle.internal.LifecycleStarter.execute(LifecycleStarter.java:161) at org.apache.maven.DefaultMaven.doExecute(DefaultMaven.java:319) at org.apache.maven.DefaultMaven.execute(DefaultMaven.java:156) at org.apache.maven.cli.MavenCli.execute(MavenCli.java:537) at org.apache.maven.cli.MavenCli.doMain(MavenCli.java:196) at org.apache.maven.cli.MavenCli.main(MavenCli.java:141) at sun.reflect.NativeMethodAccessorImpl.invoke0(Native Method) at sun.reflect.NativeMethodAccessorImpl.invoke(NativeMethodAccessorImpl.java:39) at sun.reflect.DelegatingMethodAccessorImpl.invoke(DelegatingMethodAccessorImpl.java:25) at java.lang.reflect.Method.invoke(Method.java:597) at org.codehaus.plexus.classworlds.launcher.Launcher.launchEnhanced(Launcher.java:290) at org.codehaus.plexus.classworlds.launcher.Launcher.launch(Launcher.java:230) at org.codehaus.plexus.classworlds.launcher.Launcher.mainWithExitCode(Launcher.java:409) at org.codehaus.plexus.classworlds.launcher.Launcher.main(Launcher.java:352) Caused by: java.lang.ClassNotFoundException: org.codehaus.plexus.digest.DigesterException at org.codehaus.plexus.classworlds.strategy.SelfFirstStrategy.loadClass(SelfFirstStrategy.java:50) at org.codehaus.plexus.classworlds.realm.ClassRealm.loadClass(ClassRealm.java:244) at org.codehaus.plexus.classworlds.realm.ClassRealm.loadClass(ClassRealm.java:230) ... 47 more [INFO] ------------------------------------------------------------------------ [INFO] BUILD FAILURE [INFO] ------------------------------------------------------------------------ [INFO] Total time: 1.669s [INFO] Finished at: Wed Feb 20 14:41:14 CST 2013 [INFO] Final Memory: 4M/15M [INFO] ------------------------------------------------------------------------ [ERROR] Failed to execute goal org.apache.maven.plugins:maven-install-plugin:2.3.1:install (default-install) on project llemaicai: Execution default-install of goal org.apache.maven.plugins:maven-install-plugin:2.3.1:install failed: Unable to load the mojo 'install' in the plugin 'org.apache.maven.plugins:maven-install-plugin:2.3.1'. A required class is missing: org/codehaus/plexus/digest/DigesterException [ERROR] ----------------------------------------------------- [ERROR] realm = plugin>org.apache.maven.plugins:maven-install-plugin:2.3.1 [ERROR] strategy = org.codehaus.plexus.classworlds.strategy.SelfFirstStrategy [ERROR] urls[0] = file:/D:/javalib/repository/org/apache/maven/plugins/maven-install-plugin/2.3.1/maven-install-plugin-2.3.1.jar [ERROR] urls[1] = file:/D:/javalib/repository/junit/junit/3.8.1/junit-3.8.1.jar [ERROR] urls[2] = file:/D:/javalib/repository/org/codehaus/plexus/plexus-utils/2.0.5/plexus-utils-2.0.5.jar [ERROR] urls[3] = file:/D:/javalib/repository/org/codehaus/plexus/plexus-digest/1.0/plexus-digest-1.0.jar [ERROR] Number of foreign imports: 1 [ERROR] import: Entry[import from realm ClassRealm[maven.api, parent: null]] [ERROR] [ERROR] -----------------------------------------------------: org.codehaus.plexus.digest.DigesterException [ERROR] -> [Help 1] [ERROR] [ERROR] To see the full stack trace of the errors, re-run Maven with the -e switch. [ERROR] Re-run Maven using the -X switch to enable full debug logging. [ERROR] [ERROR] For more information about the errors and possible solutions, please read the following articles: [ERROR] [Help 1] http://cwiki.apache.org/confluence/display/MAVEN/PluginContainerException [/code]

IDEA 新建model项目,运行报java.lang.NoSuchMethodError

由于项目需要,重新new了一个model子项目,pom.xml文件和其他配置都是直接搬用的其他可正常运行的model,新建model运行时报错,网上找了下有说是版本冲突的,找了下也没找到合适的解决方案,求解 运行是异常信息: 2017-11-21 14:48:54:054 ERROR org.springframework.web.context.ContextLoader.initWebApplicationContext(ContextLoader.java:356) > Context initialization failed java.lang.NoSuchMethodError: org.springframework.util.ReflectionUtils.clearCache()V at org.springframework.context.support.AbstractApplicationContext.resetCommonCaches(AbstractApplicationContext.java:906) at org.springframework.context.support.AbstractApplicationContext.refresh(AbstractApplicationContext.java:567) at org.springframework.web.context.ContextLoader.configureAndRefreshWebApplicationContext(ContextLoader.java:444) at org.springframework.web.context.ContextLoader.initWebApplicationContext(ContextLoader.java:326) at org.springframework.web.context.ContextLoaderListener.contextInitialized(ContextLoaderListener.java:107) at org.apache.catalina.core.StandardContext.listenerStart(StandardContext.java:4643) at org.apache.catalina.core.StandardContext.startInternal(StandardContext.java:5105) at org.apache.catalina.util.LifecycleBase.start(LifecycleBase.java:183) at org.apache.catalina.core.ContainerBase.addChildInternal(ContainerBase.java:740) at org.apache.catalina.core.ContainerBase.addChild(ContainerBase.java:716) at org.apache.catalina.core.StandardHost.addChild(StandardHost.java:703) at org.apache.catalina.startup.HostConfig.manageApp(HostConfig.java:1729) at sun.reflect.NativeMethodAccessorImpl.invoke0(Native Method) at sun.reflect.NativeMethodAccessorImpl.invoke(NativeMethodAccessorImpl.java:62) at sun.reflect.DelegatingMethodAccessorImpl.invoke(DelegatingMethodAccessorImpl.java:43) at java.lang.reflect.Method.invoke(Method.java:498) at org.apache.tomcat.util.modeler.BaseModelMBean.invoke(BaseModelMBean.java:287) at com.sun.jmx.interceptor.DefaultMBeanServerInterceptor.invoke(DefaultMBeanServerInterceptor.java:819) at com.sun.jmx.mbeanserver.JmxMBeanServer.invoke(JmxMBeanServer.java:801) at org.apache.catalina.mbeans.MBeanFactory.createStandardContext(MBeanFactory.java:456) at org.apache.catalina.mbeans.MBeanFactory.createStandardContext(MBeanFactory.java:405) at sun.reflect.NativeMethodAccessorImpl.invoke0(Native Method) at sun.reflect.NativeMethodAccessorImpl.invoke(NativeMethodAccessorImpl.java:62) at sun.reflect.DelegatingMethodAccessorImpl.invoke(DelegatingMethodAccessorImpl.java:43) at java.lang.reflect.Method.invoke(Method.java:498) at org.apache.tomcat.util.modeler.BaseModelMBean.invoke(BaseModelMBean.java:287) at com.sun.jmx.interceptor.DefaultMBeanServerInterceptor.invoke(DefaultMBeanServerInterceptor.java:819) at com.sun.jmx.mbeanserver.JmxMBeanServer.invoke(JmxMBeanServer.java:801) at javax.management.remote.rmi.RMIConnectionImpl.doOperation(RMIConnectionImpl.java:1468) at javax.management.remote.rmi.RMIConnectionImpl.access$300(RMIConnectionImpl.java:76) at javax.management.remote.rmi.RMIConnectionImpl$PrivilegedOperation.run(RMIConnectionImpl.java:1309) at javax.management.remote.rmi.RMIConnectionImpl.doPrivilegedOperation(RMIConnectionImpl.java:1401) at javax.management.remote.rmi.RMIConnectionImpl.invoke(RMIConnectionImpl.java:829) at sun.reflect.NativeMethodAccessorImpl.invoke0(Native Method) at sun.reflect.NativeMethodAccessorImpl.invoke(NativeMethodAccessorImpl.java:62) at sun.reflect.DelegatingMethodAccessorImpl.invoke(DelegatingMethodAccessorImpl.java:43) at java.lang.reflect.Method.invoke(Method.java:498) at sun.rmi.server.UnicastServerRef.dispatch(UnicastServerRef.java:357) at sun.rmi.transport.Transport$1.run(Transport.java:200) at sun.rmi.transport.Transport$1.run(Transport.java:197) at java.security.AccessController.doPrivileged(Native Method) at sun.rmi.transport.Transport.serviceCall(Transport.java:196) at sun.rmi.transport.tcp.TCPTransport.handleMessages(TCPTransport.java:568) at sun.rmi.transport.tcp.TCPTransport$ConnectionHandler.run0(TCPTransport.java:826) at sun.rmi.transport.tcp.TCPTransport$ConnectionHandler.lambda$run$0(TCPTransport.java:683) at java.security.AccessController.doPrivileged(Native Method) at sun.rmi.transport.tcp.TCPTransport$ConnectionHandler.run(TCPTransport.java:682) at java.util.concurrent.ThreadPoolExecutor.runWorker(ThreadPoolExecutor.java:1149) at java.util.concurrent.ThreadPoolExecutor$Worker.run(ThreadPoolExecutor.java:624) at java.lang.Thread.run(Thread.java:748) 21-Nov-2017 14:48:54.183 严重 [RMI TCP Connection(3)-127.0.0.1] org.apache.catalina.core.StandardContext.startInternal One or more listeners failed to start. Full details will be found in the appropriate container log file 21-Nov-2017 14:48:54.184 严重 [RMI TCP Connection(3)-127.0.0.1] org.apache.catalina.core.StandardContext.startInternal Context [/pingxx-pay] startup failed due to previous errors 2017-11-21 14:48:54:054 INFO org.springframework.context.support.AbstractApplicationContext.doClose(AbstractApplicationContext.java:987) > Closing Root WebApplicationContext: startup date [Tue Nov 21 14:48:53 CST 2017]; root of context hierarchy 2017-11-21 14:48:54:054 WARN org.springframework.context.support.AbstractApplicationContext.doClose(AbstractApplicationContext.java:1005) > Exception thrown from LifecycleProcessor on context close java.lang.IllegalStateException: LifecycleProcessor not initialized - call 'refresh' before invoking lifecycle methods via the context: Root WebApplicationContext: startup date [Tue Nov 21 14:48:53 CST 2017]; root of context hierarchy at org.springframework.context.support.AbstractApplicationContext.getLifecycleProcessor(AbstractApplicationContext.java:417) at org.springframework.context.support.AbstractApplicationContext.doClose(AbstractApplicationContext.java:1002) at org.springframework.context.support.AbstractApplicationContext.close(AbstractApplicationContext.java:961) at org.springframework.web.context.ContextLoader.closeWebApplicationContext(ContextLoader.java:581) at org.springframework.web.context.ContextLoaderListener.contextDestroyed(ContextLoaderListener.java:116) at org.apache.catalina.core.StandardContext.listenerStop(StandardContext.java:4690) at org.apache.catalina.core.StandardContext.stopInternal(StandardContext.java:5327) at org.apache.catalina.util.LifecycleBase.stop(LifecycleBase.java:257) at org.apache.catalina.util.LifecycleBase.start(LifecycleBase.java:187) at org.apache.catalina.core.ContainerBase.addChildInternal(ContainerBase.java:740) at org.apache.catalina.core.ContainerBase.addChild(ContainerBase.java:716) at org.apache.catalina.core.StandardHost.addChild(StandardHost.java:703) at org.apache.catalina.startup.HostConfig.manageApp(HostConfig.java:1729) at sun.reflect.NativeMethodAccessorImpl.invoke0(Native Method) at sun.reflect.NativeMethodAccessorImpl.invoke(NativeMethodAccessorImpl.java:62) at sun.reflect.DelegatingMethodAccessorImpl.invoke(DelegatingMethodAccessorImpl.java:43) at java.lang.reflect.Method.invoke(Method.java:498) at org.apache.tomcat.util.modeler.BaseModelMBean.invoke(BaseModelMBean.java:287) at com.sun.jmx.interceptor.DefaultMBeanServerInterceptor.invoke(DefaultMBeanServerInterceptor.java:819) at com.sun.jmx.mbeanserver.JmxMBeanServer.invoke(JmxMBeanServer.java:801) at org.apache.catalina.mbeans.MBeanFactory.createStandardContext(MBeanFactory.java:456) at org.apache.catalina.mbeans.MBeanFactory.createStandardContext(MBeanFactory.java:405) at sun.reflect.NativeMethodAccessorImpl.invoke0(Native Method) at sun.reflect.NativeMethodAccessorImpl.invoke(NativeMethodAccessorImpl.java:62) at sun.reflect.DelegatingMethodAccessorImpl.invoke(DelegatingMethodAccessorImpl.java:43) at java.lang.reflect.Method.invoke(Method.java:498) at org.apache.tomcat.util.modeler.BaseModelMBean.invoke(BaseModelMBean.java:287) at com.sun.jmx.interceptor.DefaultMBeanServerInterceptor.invoke(DefaultMBeanServerInterceptor.java:819) at com.sun.jmx.mbeanserver.JmxMBeanServer.invoke(JmxMBeanServer.java:801) at javax.management.remote.rmi.RMIConnectionImpl.doOperation(RMIConnectionImpl.java:1468) at javax.management.remote.rmi.RMIConnectionImpl.access$300(RMIConnectionImpl.java:76) at javax.management.remote.rmi.RMIConnectionImpl$PrivilegedOperation.run(RMIConnectionImpl.java:1309) at javax.management.remote.rmi.RMIConnectionImpl.doPrivilegedOperation(RMIConnectionImpl.java:1401) at javax.management.remote.rmi.RMIConnectionImpl.invoke(RMIConnectionImpl.java:829) at sun.reflect.NativeMethodAccessorImpl.invoke0(Native Method) at sun.reflect.NativeMethodAccessorImpl.invoke(NativeMethodAccessorImpl.java:62) at sun.reflect.DelegatingMethodAccessorImpl.invoke(DelegatingMethodAccessorImpl.java:43) at java.lang.reflect.Method.invoke(Method.java:498) at sun.rmi.server.UnicastServerRef.dispatch(UnicastServerRef.java:357) at sun.rmi.transport.Transport$1.run(Transport.java:200) at sun.rmi.transport.Transport$1.run(Transport.java:197) at java.security.AccessController.doPrivileged(Native Method) at sun.rmi.transport.Transport.serviceCall(Transport.java:196) at sun.rmi.transport.tcp.TCPTransport.handleMessages(TCPTransport.java:568) at sun.rmi.transport.tcp.TCPTransport$ConnectionHandler.run0(TCPTransport.java:826) at sun.rmi.transport.tcp.TCPTransport$ConnectionHandler.lambda$run$0(TCPTransport.java:683) at java.security.AccessController.doPrivileged(Native Method) at sun.rmi.transport.tcp.TCPTransport$ConnectionHandler.run(TCPTransport.java:682) at java.util.concurrent.ThreadPoolExecutor.runWorker(ThreadPoolExecutor.java:1149) at java.util.concurrent.ThreadPoolExecutor$Worker.run(ThreadPoolExecutor.java:624) at java.lang.Thread.run(Thread.java:748) [2017-11-21 02:48:54,219] Artifact qmcs2-pingxx-pay:war exploded: Error during artifact deployment. See server log for details.

java.net.MalformedURLException: unknown protocol: jrt

win7 64位 官网下载jdk11 idea 2017 ```java public class Test { public static void main(String[] args) { System.out.println(11); } } ``` 异常 ``` Error:Internal error: (java.net.MalformedURLException) unknown protocol: jrt java.net.MalformedURLException: unknown protocol: jrt at java.net.URL.<init>(URL.java:421) at java.net.URL.<init>(URL.java:310) at java.net.URL.<init>(URL.java:333) at com.intellij.compiler.instrumentation.InstrumentationClassFinder.createJDKPlatformUrl(InstrumentationClassFinder.java:61) at org.jetbrains.jps.incremental.instrumentation.ClassProcessingBuilder.createInstrumentationClassFinder(ClassProcessingBuilder.java:125) at org.jetbrains.jps.incremental.instrumentation.ClassProcessingBuilder.build(ClassProcessingBuilder.java:93) at org.jetbrains.jps.incremental.IncProjectBuilder.runModuleLevelBuilders(IncProjectBuilder.java:1246) at org.jetbrains.jps.incremental.IncProjectBuilder.runBuildersForChunk(IncProjectBuilder.java:923) at org.jetbrains.jps.incremental.IncProjectBuilder.buildTargetsChunk(IncProjectBuilder.java:995) at org.jetbrains.jps.incremental.IncProjectBuilder.buildChunkIfAffected(IncProjectBuilder.java:886) at org.jetbrains.jps.incremental.IncProjectBuilder.buildChunks(IncProjectBuilder.java:719) at org.jetbrains.jps.incremental.IncProjectBuilder.runBuild(IncProjectBuilder.java:371) at org.jetbrains.jps.incremental.IncProjectBuilder.build(IncProjectBuilder.java:178) at org.jetbrains.jps.cmdline.BuildRunner.runBuild(BuildRunner.java:138) at org.jetbrains.jps.cmdline.BuildSession.runBuild(BuildSession.java:308) at org.jetbrains.jps.cmdline.BuildSession.run(BuildSession.java:138) at org.jetbrains.jps.cmdline.BuildMain$MyMessageHandler.lambda$channelRead0$0(BuildMain.java:235) at org.jetbrains.jps.service.impl.SharedThreadPoolImpl.lambda$executeOnPooledThread$0(SharedThreadPoolImpl.java:42) at java.util.concurrent.Executors$RunnableAdapter.call(Executors.java:511) at java.util.concurrent.FutureTask.run(FutureTask.java:266) at java.util.concurrent.ThreadPoolExecutor.runWorker(ThreadPoolExecutor.java:1142) at java.util.concurrent.ThreadPoolExecutor$Worker.run(ThreadPoolExecutor.java:617) at java.lang.Thread.run(Thread.java:745) Please perform full project rebuild (Build | Rebuild Project) ```

运行报错,大佬们帮忙看看什么原因java.util.concurrent.ExecutionException

"C:\Program Files\Java\jdk1.8.0_201\bin\java" "-Dmaven.multiModuleProjectDirectory=C:\Users\Administrator\Desktop\travel - 副本" -Dfile.encoding=gb2312 "-Dmaven.home=C:\Program Files\JetBrains\IntelliJ IDEA 2017.2.6\plugins\maven\lib\maven3" "-Dclassworlds.conf=C:\Program Files\JetBrains\IntelliJ IDEA 2017.2.6\plugins\maven\lib\maven3\bin\m2.conf" "-javaagent:C:\Program Files\JetBrains\IntelliJ IDEA 2017.2.6\lib\idea_rt.jar=51249:C:\Program Files\JetBrains\IntelliJ IDEA 2017.2.6\bin" -classpath "C:\Program Files\JetBrains\IntelliJ IDEA 2017.2.6\plugins\maven\lib\maven3\boot\plexus-classworlds-2.5.2.jar" org.codehaus.classworlds.Launcher -Didea.version=2017.2.6 tomcat7:run [INFO] Scanning for projects... [WARNING] [WARNING] Some problems were encountered while building the effective model for cn.itcast:travel:war:1.0-SNAPSHOT [WARNING] 'build.plugins.plugin.version' for org.apache.maven.plugins:maven-compiler-plugin is missing. @ line 131, column 21 [WARNING] [WARNING] It is highly recommended to fix these problems because they threaten the stability of your build. [WARNING] [WARNING] For this reason, future Maven versions might no longer support building such malformed projects. [WARNING] [INFO] [INFO] ------------------------------------------------------------------------ [INFO] Building travel 1.0-SNAPSHOT [INFO] ------------------------------------------------------------------------ [INFO] [INFO] >>> tomcat7-maven-plugin:2.1:run (default-cli) > process-classes @ travel >>> [INFO] [INFO] --- maven-resources-plugin:2.6:resources (default-resources) @ travel --- [WARNING] Using platform encoding (gb2312 actually) to copy filtered resources, i.e. build is platform dependent! [INFO] Copying 3 resources [INFO] [INFO] --- maven-compiler-plugin:3.1:compile (default-compile) @ travel --- [INFO] Changes detected - recompiling the module! [INFO] Compiling 40 source files to C:\Users\Administrator\Desktop\travel - 副本\target\classes [WARNING] /C:/Users/Administrator/Desktop/travel - 副本/src/main/java/cn/itcast/travel/dao/impl/FindDaoImpl.java: 某些输入文件使用了未经检查或不安全的操作。 [WARNING] /C:/Users/Administrator/Desktop/travel - 副本/src/main/java/cn/itcast/travel/dao/impl/FindDaoImpl.java: 有关详细信息, 请使用 -Xlint:unchecked 重新编译。 [INFO] [INFO] <<< tomcat7-maven-plugin:2.1:run (default-cli) < process-classes @ travel <<< [INFO] [INFO] --- tomcat7-maven-plugin:2.1:run (default-cli) @ travel --- [INFO] Running war on http://localhost:80/travel [INFO] Using existing Tomcat server configuration at C:\Users\Administrator\Desktop\travel - 副本\target\tomcat [INFO] create webapp with contextPath: /travel 七月 21, 2019 5:00:20 下午 org.apache.coyote.AbstractProtocol init 信息: Initializing ProtocolHandler ["http-bio-80"] 七月 21, 2019 5:00:20 下午 org.apache.catalina.core.StandardService startInternal 信息: Starting service Tomcat 七月 21, 2019 5:00:20 下午 org.apache.catalina.core.StandardEngine startInternal 信息: Starting Servlet Engine: Apache Tomcat/7.0.37 七月 21, 2019 5:00:21 下午 org.apache.catalina.core.ContainerBase startInternal 严重: A child container failed during start java.util.concurrent.ExecutionException: org.apache.catalina.LifecycleException: Failed to start component [StandardEngine[Tomcat].StandardHost[localhost].StandardContext[/travel]] at java.util.concurrent.FutureTask.report(FutureTask.java:122) at java.util.concurrent.FutureTask.get(FutureTask.java:192) at org.apache.catalina.core.ContainerBase.startInternal(ContainerBase.java:1123) at org.apache.catalina.core.StandardHost.startInternal(StandardHost.java:800) at org.apache.catalina.util.LifecycleBase.start(LifecycleBase.java:150) at org.apache.catalina.core.ContainerBase$StartChild.call(ContainerBase.java:1559) at org.apache.catalina.core.ContainerBase$StartChild.call(ContainerBase.java:1549) at java.util.concurrent.FutureTask.run(FutureTask.java:266) at java.util.concurrent.ThreadPoolExecutor.runWorker(ThreadPoolExecutor.java:1149) at java.util.concurrent.ThreadPoolExecutor$Worker.run(ThreadPoolExecutor.java:624) at java.lang.Thread.run(Thread.java:748) Caused by: org.apache.catalina.LifecycleException: Failed to start component [StandardEngine[Tomcat].StandardHost[localhost].StandardContext[/travel]] at org.apache.catalina.util.LifecycleBase.start(LifecycleBase.java:154) ... 6 more Caused by: java.lang.IllegalArgumentException: Invalid <url-pattern> #write/* in servlet mapping at org.apache.catalina.core.StandardContext.addServletMapping(StandardContext.java:3223) at org.apache.catalina.core.StandardContext.addServletMapping(StandardContext.java:3198) at org.apache.catalina.deploy.WebXml.configureContext(WebXml.java:1366) at org.apache.catalina.startup.ContextConfig.webConfig(ContextConfig.java:1353) at org.apache.catalina.startup.ContextConfig.configureStart(ContextConfig.java:878) at org.apache.catalina.startup.ContextConfig.lifecycleEvent(ContextConfig.java:369) at org.apache.catalina.util.LifecycleSupport.fireLifecycleEvent(LifecycleSupport.java:119) at org.apache.catalina.util.LifecycleBase.fireLifecycleEvent(LifecycleBase.java:90) at org.apache.catalina.core.StandardContext.startInternal(StandardContext.java:5179) at org.apache.catalina.util.LifecycleBase.start(LifecycleBase.java:150) ... 6 more 七月 21, 2019 5:00:21 下午 org.apache.catalina.core.ContainerBase startInternal 严重: A child container failed during start java.util.concurrent.ExecutionException: org.apache.catalina.LifecycleException: Failed to start component [StandardEngine[Tomcat].StandardHost[localhost]] at java.util.concurrent.FutureTask.report(FutureTask.java:122) at java.util.concurrent.FutureTask.get(FutureTask.java:192) at org.apache.catalina.core.ContainerBase.startInternal(ContainerBase.java:1123) at org.apache.catalina.core.StandardEngine.startInternal(StandardEngine.java:302) at org.apache.catalina.util.LifecycleBase.start(LifecycleBase.java:150) at org.apache.catalina.core.StandardService.startInternal(StandardService.java:443) at org.apache.catalina.util.LifecycleBase.start(LifecycleBase.java:150) at org.apache.catalina.core.StandardServer.startInternal(StandardServer.java:732) at org.apache.catalina.util.LifecycleBase.start(LifecycleBase.java:150) at org.apache.catalina.startup.Tomcat.start(Tomcat.java:335) at org.apache.tomcat.maven.plugin.tomcat7.run.AbstractRunMojo.startContainer(AbstractRunMojo.java:1091) at org.apache.tomcat.maven.plugin.tomcat7.run.AbstractRunMojo.execute(AbstractRunMojo.java:512) at org.apache.maven.plugin.DefaultBuildPluginManager.executeMojo(DefaultBuildPluginManager.java:134) at org.apache.maven.lifecycle.internal.MojoExecutor.execute(MojoExecutor.java:207) at org.apache.maven.lifecycle.internal.MojoExecutor.execute(MojoExecutor.java:153) at org.apache.maven.lifecycle.internal.MojoExecutor.execute(MojoExecutor.java:145) at org.apache.maven.lifecycle.internal.LifecycleModuleBuilder.buildProject(LifecycleModuleBuilder.java:116) at org.apache.maven.lifecycle.internal.LifecycleModuleBuilder.buildProject(LifecycleModuleBuilder.java:80) at org.apache.maven.lifecycle.internal.builder.singlethreaded.SingleThreadedBuilder.build(SingleThreadedBuilder.java:51) at org.apache.maven.lifecycle.internal.LifecycleStarter.execute(LifecycleStarter.java:128) at org.apache.maven.DefaultMaven.doExecute(DefaultMaven.java:307) at org.apache.maven.DefaultMaven.doExecute(DefaultMaven.java:193) at org.apache.maven.DefaultMaven.execute(DefaultMaven.java:106) at org.apache.maven.cli.MavenCli.execute(MavenCli.java:863) at org.apache.maven.cli.MavenCli.doMain(MavenCli.java:288) at org.apache.maven.cli.MavenCli.main(MavenCli.java:199) at sun.reflect.NativeMethodAccessorImpl.invoke0(Native Method) at sun.reflect.NativeMethodAccessorImpl.invoke(NativeMethodAccessorImpl.java:62) at sun.reflect.DelegatingMethodAccessorImpl.invoke(DelegatingMethodAccessorImpl.java:43) at java.lang.reflect.Method.invoke(Method.java:498) at org.codehaus.plexus.classworlds.launcher.Launcher.launchEnhanced(Launcher.java:289) at org.codehaus.plexus.classworlds.launcher.Launcher.launch(Launcher.java:229) at org.codehaus.plexus.classworlds.launcher.Launcher.mainWithExitCode(Launcher.java:415) at org.codehaus.plexus.classworlds.launcher.Launcher.main(Launcher.java:356) at org.codehaus.classworlds.Launcher.main(Launcher.java:47) Caused by: org.apache.catalina.LifecycleException: Failed to start component [StandardEngine[Tomcat].StandardHost[localhost]] at org.apache.catalina.util.LifecycleBase.start(LifecycleBase.java:154) at org.apache.catalina.core.ContainerBase$StartChild.call(ContainerBase.java:1559) at org.apache.catalina.core.ContainerBase$StartChild.call(ContainerBase.java:1549) at java.util.concurrent.FutureTask.run(FutureTask.java:266) at java.util.concurrent.ThreadPoolExecutor.runWorker(ThreadPoolExecutor.java:1149) at java.util.concurrent.ThreadPoolExecutor$Worker.run(ThreadPoolExecutor.java:624) at java.lang.Thread.run(Thread.java:748) Caused by: org.apache.catalina.LifecycleException: A child container failed during start at org.apache.catalina.core.ContainerBase.startInternal(ContainerBase.java:1131) at org.apache.catalina.core.StandardHost.startInternal(StandardHost.java:800) at org.apache.catalina.util.LifecycleBase.start(LifecycleBase.java:150) ... 6 more [INFO] ------------------------------------------------------------------------ [INFO] BUILD FAILURE [INFO] ------------------------------------------------------------------------ [INFO] Total time: 3.989 s [INFO] Finished at: 2019-07-21T17:00:21+08:00 [INFO] Final Memory: 32M/279M [INFO] ------------------------------------------------------------------------ [ERROR] Failed to execute goal org.apache.tomcat.maven:tomcat7-maven-plugin:2.1:run (default-cli) on project travel: Could not start Tomcat: Failed to start component [StandardServer[-1]]: Failed to start component [StandardService[Tomcat]]: Failed to start component [StandardEngine[Tomcat]]: A child container failed during start -> [Help 1] [ERROR] [ERROR] To see the full stack trace of the errors, re-run Maven with the -e switch. [ERROR] Re-run Maven using the -X switch to enable full debug logging. [ERROR] [ERROR] For more information about the errors and possible solutions, please read the following articles: [ERROR] [Help 1] http://cwiki.apache.org/confluence/display/MAVEN/MojoExecutionException Process finished with exit code 1

编译spring5.2源码出错, 一直提示这个错误, 虽然知道是冲突问题, 但是不知道怎么解决, 在线求大佬.

``` Kotlin: [Internal Error] java.lang.LinkageError: loader constraint violation: loader (instance of org/jetbrains/kotlin/cli/jvm/plugins/PluginURLClassLoader$SelfThenParentURLClassLoader) previously initiated loading for a different type with name "kotlin/sequences/Sequence" at java.lang.ClassLoader.defineClass1(Native Method) at java.lang.ClassLoader.defineClass(ClassLoader.java:763) at java.security.SecureClassLoader.defineClass(SecureClassLoader.java:142) at java.net.URLClassLoader.defineClass(URLClassLoader.java:467) at java.net.URLClassLoader.access$100(URLClassLoader.java:73) at java.net.URLClassLoader$1.run(URLClassLoader.java:368) at java.net.URLClassLoader$1.run(URLClassLoader.java:362) at java.security.AccessController.doPrivileged(Native Method) at java.net.URLClassLoader.findClass(URLClassLoader.java:361) at org.jetbrains.kotlin.cli.jvm.plugins.PluginURLClassLoader$SelfThenParentURLClassLoader.findClass(PluginURLClassLoader.kt:46) at java.lang.ClassLoader.loadClass(ClassLoader.java:424) at java.lang.ClassLoader.loadClass(ClassLoader.java:357) at java.lang.ClassLoader.defineClass1(Native Method) at java.lang.ClassLoader.defineClass(ClassLoader.java:763) at java.security.SecureClassLoader.defineClass(SecureClassLoader.java:142) at java.net.URLClassLoader.defineClass(URLClassLoader.java:467) at java.net.URLClassLoader.access$100(URLClassLoader.java:73) at java.net.URLClassLoader$1.run(URLClassLoader.java:368) at java.net.URLClassLoader$1.run(URLClassLoader.java:362) at java.security.AccessController.doPrivileged(Native Method) at java.net.URLClassLoader.findClass(URLClassLoader.java:361) at org.jetbrains.kotlin.cli.jvm.plugins.PluginURLClassLoader$SelfThenParentURLClassLoader.findClass(PluginURLClassLoader.kt:46) at java.lang.ClassLoader.loadClass(ClassLoader.java:424) at java.lang.ClassLoader.loadClass(ClassLoader.java:357) at kotlin.coroutines.experimental.SequenceBuilderKt__SequenceBuilderKt.buildSequence(SequenceBuilder.kt:24) at org.jetbrains.kotlin.scripting.compiler.plugin.ScriptiDefinitionsFromClasspathDiscoverySourceKt.discoverScriptTemplatesInClasspath(ScriptiDefinitionsFromClasspathDiscoverySource.kt:48) at org.jetbrains.kotlin.scripting.compiler.plugin.ScriptDefinitionsFromClasspathDiscoverySource.<init>(ScriptiDefinitionsFromClasspathDiscoverySource.kt:34) at org.jetbrains.kotlin.scripting.compiler.plugin.ScriptingCompilerConfigurationExtension.updateConfiguration(ScriptingCompilerConfigurationExtension.kt:56) at org.jetbrains.kotlin.cli.jvm.compiler.KotlinCoreEnvironment.<init>(KotlinCoreEnvironment.kt:218) at org.jetbrains.kotlin.cli.jvm.compiler.KotlinCoreEnvironment.<init>(KotlinCoreEnvironment.kt:121) at org.jetbrains.kotlin.cli.jvm.compiler.KotlinCoreEnvironment$Companion.createForProduction(KotlinCoreEnvironment.kt:513) at org.jetbrains.kotlin.cli.jvm.K2JVMCompiler.createCoreEnvironment(K2JVMCompiler.kt:302) at org.jetbrains.kotlin.cli.jvm.K2JVMCompiler.doExecute(K2JVMCompiler.kt:154) at org.jetbrains.kotlin.cli.jvm.K2JVMCompiler.doExecute(K2JVMCompiler.kt:57) at org.jetbrains.kotlin.cli.common.CLICompiler.execImpl(CLICompiler.java:96) at org.jetbrains.kotlin.cli.common.CLICompiler.execImpl(CLICompiler.java:52) at org.jetbrains.kotlin.cli.common.CLITool.exec(CLITool.kt:93) at org.jetbrains.kotlin.daemon.CompileServiceImpl$compile$$inlined$ifAlive$lambda$1.invoke(CompileServiceImpl.kt:436) at org.jetbrains.kotlin.daemon.CompileServiceImpl$compile$$inlined$ifAlive$lambda$1.invoke(CompileServiceImpl.kt:102) at org.jetbrains.kotlin.daemon.CompileServiceImpl$doCompile$$inlined$ifAlive$lambda$2.invoke(CompileServiceImpl.kt:1029) at org.jetbrains.kotlin.daemon.CompileServiceImpl$doCompile$$inlined$ifAlive$lambda$2.invoke(CompileServiceImpl.kt:102) at org.jetbrains.kotlin.daemon.common.DummyProfiler.withMeasure(PerfUtils.kt:137) at org.jetbrains.kotlin.daemon.CompileServiceImpl.checkedCompile(CompileServiceImpl.kt:1071) at org.jetbrains.kotlin.daemon.CompileServiceImpl.doCompile(CompileServiceImpl.kt:1028) at org.jetbrains.kotlin.daemon.CompileServiceImpl.compile(CompileServiceImpl.kt:434) at sun.reflect.NativeMethodAccessorImpl.invoke0(Native Method) at sun.reflect.NativeMethodAccessorImpl.invoke(NativeMethodAccessorImpl.java:62) at sun.reflect.DelegatingMethodAccessorImpl.invoke(DelegatingMethodAccessorImpl.java:43) at java.lang.reflect.Method.invoke(Method.java:498) at sun.rmi.server.UnicastServerRef.dispatch(UnicastServerRef.java:357) at sun.rmi.transport.Transport$1.run(Transport.java:200) at sun.rmi.transport.Transport$1.run(Transport.java:197) at java.security.AccessController.doPrivileged(Native Method) at sun.rmi.transport.Transport.serviceCall(Transport.java:196) at sun.rmi.transport.tcp.TCPTransport.handleMessages(TCPTransport.java:573) at sun.rmi.transport.tcp.TCPTransport$ConnectionHandler.run0(TCPTransport.java:834) at sun.rmi.transport.tcp.TCPTransport$ConnectionHandler.lambda$run$0(TCPTransport.java:688) at java.security.AccessController.doPrivileged(Native Method) at sun.rmi.transport.tcp.TCPTransport$ConnectionHandler.run(TCPTransport.java:687) at java.util.concurrent.ThreadPoolExecutor.runWorker(ThreadPoolExecutor.java:1149) at java.util.concurrent.ThreadPoolExecutor$Worker.run(ThreadPoolExecutor.java:624) at java.lang.Thread.run(Thread.java:748) ``` idea 2018.2.2 gradle 5.5 Kotlin 是idea 的插件

IDEA 启动web项目报错,各位帮忙看看

每次开始都是好好地,但是用了几个小时再run、或者debug就会出现下面的情况,重启一下IDEA就好了,各位知不知道什么问题; ``` Error:Abnormal build process termination: "C:\Program Files\Java\jdk1.8.0_121\bin\java" -Xmx700m -Djava.awt.headless=true -Djava.endorsed.dirs=\"\" -Djdt.compiler.useSingleThread=true -Dpreload.project.path=D:/ide/workspace/niuwan-root -Dpreload.config.path=C:/Users/relieved/.IntelliJIdea2017.1/config/options -Dcompile.parallel=false -Drebuild.on.dependency.change=true -Djava.net.preferIPv4Stack=true -Dio.netty.initialSeedUniquifier=-900763217256069649 -Dfile.encoding=GBK -Djps.file.types.component.name=FileTypeManager -Duser.language=zh -Duser.country=CN -Didea.paths.selector=IntelliJIdea2017.1 "-Didea.home.path=D:\Program Files\JetBrains\IntelliJ IDEA 2017.1.1" -Didea.config.path=C:\Users\relieved\.IntelliJIdea2017.1\config -Didea.plugins.path=C:\Users\relieved\.IntelliJIdea2017.1\config\plugins -Djps.log.dir=C:/Users/relieved/.IntelliJIdea2017.1/system/log/build-log "-Djps.fallback.jdk.home=D:/Program Files/JetBrains/IntelliJ IDEA 2017.1.1/jre64" ```

maven配置私服打包报错Failed to execute goal org.apache.maven.plugins:maven-compiler-plugin:3.5:compile

直接使用阿里云镜像仓库打包没问题,替换为私服镜像仓库后报错: 就是pom.xml中的plugin报错 ``` <plugin> <groupId>org.apache.maven.plugins</groupId> <artifactId>maven-compiler-plugin</artifactId> <version>3.5</version> <configuration> <source>1.8</source> <target>1.8</target> <encoding>UTF-8</encoding> </configuration> </plugin> ``` 网上找了半天说这个指定的jdk版本的问题,查了一下版本没问题都是1.8 报错内容: [ERROR] Failed to execute goal org.apache.maven.plugins:maven-compiler-plugin:3.5:compile (default-compile) on project mytest-web: Execution default-compile of goal org.apache.maven.plugins:maven-compiler-plugin:3.5:compile failed: Plugin org.apache.maven.plugins:maven-compiler-plugin:3.5 or one of its dependencies could not be resolved: Failed to collect dependencies at org.apache.maven.plugins:maven-compiler-plugin:jar:3.5 -> org.apache.maven:maven-toolchain:jar:2.2.1 -> org.apache.maven:maven-core:jar:2.2.1 -> commons-cli:commons-cli:jar:1.2: Failed to read artifact descriptor for commons-cli:commons-cli:jar:1.2: Failure to find org.apache:apache:pom:4 in http://localhost:8081/nexus/content/groups/public/ was cached in the local repository, resolution will not be reattempted until the update interval of public has elapsed or updates are forced -> [Help 1] org.apache.maven.lifecycle.LifecycleExecutionException: Failed to execute goal org.apache.maven.plugins:maven-compiler-plugin:3.5:compile (default-compile) on project mytest-web: Execution default-compile of goal org.apache.maven.plugins:maven-compiler-plugin:3.5:compile failed: Plugin org.apache.maven.plugins:maven-compiler-plugin:3.5 or one of its dependencies could not be resolved: Failed to collect dependencies at org.apache.maven.plugins:maven-compiler-plugin:jar:3.5 -> org.apache.maven:maven-toolchain:jar:2.2.1 -> org.apache.maven:maven-core:jar:2.2.1 -> commons-cli:commons-cli:jar:1.2 at org.apache.maven.lifecycle.internal.MojoExecutor.execute(MojoExecutor.java:213) at org.apache.maven.lifecycle.internal.MojoExecutor.execute(MojoExecutor.java:154) at org.apache.maven.lifecycle.internal.MojoExecutor.execute(MojoExecutor.java:146) at org.apache.maven.lifecycle.internal.LifecycleModuleBuilder.buildProject(LifecycleModuleBuilder.java:117) at org.apache.maven.lifecycle.internal.LifecycleModuleBuilder.buildProject(LifecycleModuleBuilder.java:81) at org.apache.maven.lifecycle.internal.builder.singlethreaded.SingleThreadedBuilder.build(SingleThreadedBuilder.java:51) at org.apache.maven.lifecycle.internal.LifecycleStarter.execute(LifecycleStarter.java:128) at org.apache.maven.DefaultMaven.doExecute(DefaultMaven.java:309) at org.apache.maven.DefaultMaven.doExecute(DefaultMaven.java:194) at org.apache.maven.DefaultMaven.execute(DefaultMaven.java:107) at org.apache.maven.cli.MavenCli.execute(MavenCli.java:993) at org.apache.maven.cli.MavenCli.doMain(MavenCli.java:345) at org.apache.maven.cli.MavenCli.main(MavenCli.java:191) at sun.reflect.NativeMethodAccessorImpl.invoke0(Native Method) at sun.reflect.NativeMethodAccessorImpl.invoke(NativeMethodAccessorImpl.java:62) at sun.reflect.DelegatingMethodAccessorImpl.invoke(DelegatingMethodAccessorImpl.java:43) at java.lang.reflect.Method.invoke(Method.java:498) at org.codehaus.plexus.classworlds.launcher.Launcher.launchEnhanced(Launcher.java:289) at org.codehaus.plexus.classworlds.launcher.Launcher.launch(Launcher.java:229) at org.codehaus.plexus.classworlds.launcher.Launcher.mainWithExitCode(Launcher.java:415) at org.codehaus.plexus.classworlds.launcher.Launcher.main(Launcher.java:356) Caused by: org.apache.maven.plugin.PluginExecutionException: Execution default-compile of goal org.apache.maven.plugins:maven-compiler-plugin:3.5:compile failed: Plugin org.apache.maven.plugins:maven-compiler-plugin:3.5 or one of its dependencies could not be resolved: Failed to collect dependencies at org.apache.maven.plugins:maven-compiler-plugin:jar:3.5 -> org.apache.maven:maven-toolchain:jar:2.2.1 -> org.apache.maven:maven-core:jar:2.2.1 -> commons-cli:commons-cli:jar:1.2 at org.apache.maven.plugin.DefaultBuildPluginManager.executeMojo(DefaultBuildPluginManager.java:106) at org.apache.maven.lifecycle.internal.MojoExecutor.execute(MojoExecutor.java:208) ... 20 more Caused by: org.apache.maven.plugin.PluginResolutionException: Plugin org.apache.maven.plugins:maven-compiler-plugin:3.5 or one of its dependencies could not be resolved: Failed to collect dependencies at org.apache.maven.plugins:maven-compiler-plugin:jar:3.5 -> org.apache.maven:maven-toolchain:jar:2.2.1 -> org.apache.maven:maven-core:jar:2.2.1 -> commons-cli:commons-cli:jar:1.2 at org.apache.maven.plugin.internal.DefaultPluginDependenciesResolver.resolveInternal(DefaultPluginDependenciesResolver.java:214) at org.apache.maven.plugin.internal.DefaultPluginDependenciesResolver.resolve(DefaultPluginDependenciesResolver.java:149) at org.apache.maven.plugin.internal.DefaultMavenPluginManager.createPluginRealm(DefaultMavenPluginManager.java:402) at org.apache.maven.plugin.internal.DefaultMavenPluginManager.setupPluginRealm(DefaultMavenPluginManager.java:374) at org.apache.maven.plugin.DefaultBuildPluginManager.getPluginRealm(DefaultBuildPluginManager.java:231) at org.apache.maven.plugin.DefaultBuildPluginManager.executeMojo(DefaultBuildPluginManager.java:102) ... 21 more Caused by: org.eclipse.aether.collection.DependencyCollectionException: Failed to collect dependencies at org.apache.maven.plugins:maven-compiler-plugin:jar:3.5 -> org.apache.maven:maven-toolchain:jar:2.2.1 -> org.apache.maven:maven-core:jar:2.2.1 -> commons-cli:commons-cli:jar:1.2 at org.eclipse.aether.internal.impl.DefaultDependencyCollector.collectDependencies(DefaultDependencyCollector.java:300) at org.eclipse.aether.internal.impl.DefaultRepositorySystem.collectDependencies(DefaultRepositorySystem.java:325) at org.apache.maven.plugin.internal.DefaultPluginDependenciesResolver.resolveInternal(DefaultPluginDependenciesResolver.java:202) ... 26 more Caused by: org.eclipse.aether.resolution.ArtifactDescriptorException: Failed to read artifact descriptor for commons-cli:commons-cli:jar:1.2 at org.apache.maven.repository.internal.DefaultArtifactDescriptorReader.loadPom(DefaultArtifactDescriptorReader.java:330) at org.apache.maven.repository.internal.DefaultArtifactDescriptorReader.readArtifactDescriptor(DefaultArtifactDescriptorReader.java:199) at org.eclipse.aether.internal.impl.DefaultDependencyCollector.resolveCachedArtifactDescriptor(DefaultDependencyCollector.java:544) at org.eclipse.aether.internal.impl.DefaultDependencyCollector.getArtifactDescriptorResult(DefaultDependencyCollector.java:528) at org.eclipse.aether.internal.impl.DefaultDependencyCollector.processDependency(DefaultDependencyCollector.java:418) at org.eclipse.aether.internal.impl.DefaultDependencyCollector.processDependency(DefaultDependencyCollector.java:372) at org.eclipse.aether.internal.impl.DefaultDependencyCollector.process(DefaultDependencyCollector.java:360) at org.eclipse.aether.internal.impl.DefaultDependencyCollector.doRecurse(DefaultDependencyCollector.java:513) at org.eclipse.aether.internal.impl.DefaultDependencyCollector.processDependency(DefaultDependencyCollector.java:467) at org.eclipse.aether.internal.impl.DefaultDependencyCollector.processDependency(DefaultDependencyCollector.java:372) at org.eclipse.aether.internal.impl.DefaultDependencyCollector.process(DefaultDependencyCollector.java:360) at org.eclipse.aether.internal.impl.DefaultDependencyCollector.doRecurse(DefaultDependencyCollector.java:513) at org.eclipse.aether.internal.impl.DefaultDependencyCollector.processDependency(DefaultDependencyCollector.java:467) at org.eclipse.aether.internal.impl.DefaultDependencyCollector.processDependency(DefaultDependencyCollector.java:372) at org.eclipse.aether.internal.impl.DefaultDependencyCollector.process(DefaultDependencyCollector.java:360) at org.eclipse.aether.internal.impl.DefaultDependencyCollector.collectDependencies(DefaultDependencyCollector.java:263) ... 28 more Caused by: org.apache.maven.model.resolution.UnresolvableModelException: Failure to find org.apache:apache:pom:4 in http://localhost:8081/nexus/content/groups/public/ was cached in the local repository, resolution will not be reattempted until the update interval of public has elapsed or updates are forced at org.apache.maven.repository.internal.DefaultModelResolver.resolveModel(DefaultModelResolver.java:178) at org.apache.maven.repository.internal.DefaultModelResolver.resolveModel(DefaultModelResolver.java:224) at org.apache.maven.model.building.DefaultModelBuilder.readParentExternally(DefaultModelBuilder.java:1051) at org.apache.maven.model.building.DefaultModelBuilder.readParent(DefaultModelBuilder.java:829) at org.apache.maven.model.building.DefaultModelBuilder.build(DefaultModelBuilder.java:331) at org.apache.maven.repository.internal.DefaultArtifactDescriptorReader.loadPom(DefaultArtifactDescriptorReader.java:321) ... 43 more Caused by: org.eclipse.aether.resolution.ArtifactResolutionException: Failure to find org.apache:apache:pom:4 in http://localhost:8081/nexus/content/groups/public/ was cached in the local repository, resolution will not be reattempted until the update interval of public has elapsed or updates are forced at org.eclipse.aether.internal.impl.DefaultArtifactResolver.resolve(DefaultArtifactResolver.java:453) at org.eclipse.aether.internal.impl.DefaultArtifactResolver.resolveArtifacts(DefaultArtifactResolver.java:255) at org.eclipse.aether.internal.impl.DefaultArtifactResolver.resolveArtifact(DefaultArtifactResolver.java:232) at org.apache.maven.repository.internal.DefaultModelResolver.resolveModel(DefaultModelResolver.java:174) ... 48 more Caused by: org.eclipse.aether.transfer.ArtifactNotFoundException: Failure to find org.apache:apache:pom:4 in http://localhost:8081/nexus/content/groups/public/ was cached in the local repository, resolution will not be reattempted until the update interval of public has elapsed or updates are forced at org.eclipse.aether.internal.impl.DefaultUpdateCheckManager.newException(DefaultUpdateCheckManager.java:240) at org.eclipse.aether.internal.impl.DefaultUpdateCheckManager.checkArtifact(DefaultUpdateCheckManager.java:215) at org.eclipse.aether.internal.impl.DefaultArtifactResolver.gatherDownloads(DefaultArtifactResolver.java:594) at org.eclipse.aether.internal.impl.DefaultArtifactResolver.performDownloads(DefaultArtifactResolver.java:512) at org.eclipse.aether.internal.impl.DefaultArtifactResolver.resolve(DefaultArtifactResolver.java:430) ... 51 more [ERROR] [ERROR] Re-run Maven using the -X switch to enable full debug logging. [ERROR] [ERROR] For more information about the errors and possible solutions, please read the following articles: [ERROR] [Help 1] http://cwiki.apache.org/confluence/display/MAVEN/PluginResolutionException

IDEA用Maven的Spring集成的Tomcat启动后报错

``` 六月 04, 2020 4:57:47 下午 org.apache.coyote.AbstractProtocol init 信息: Initializing ProtocolHandler ["http-bio-9101"] 六月 04, 2020 4:57:47 下午 org.apache.catalina.core.StandardService startInternal 信息: Starting service Tomcat 六月 04, 2020 4:57:47 下午 org.apache.catalina.core.StandardEngine startInternal 信息: Starting Servlet Engine: Apache Tomcat/7.0.47 六月 04, 2020 4:57:48 下午 org.apache.catalina.core.StandardContext listenerStart 严重: Error configuring application listener of class org.springframework.web.context.ContextLoaderListener java.lang.ClassNotFoundException: org.springframework.web.context.ContextLoaderListener at org.apache.catalina.loader.WebappClassLoader.loadClass(WebappClassLoader.java:1702) at org.apache.catalina.loader.WebappClassLoader.loadClass(WebappClassLoader.java:1547) at org.apache.catalina.core.DefaultInstanceManager.loadClass(DefaultInstanceManager.java:532) at org.apache.catalina.core.DefaultInstanceManager.loadClassMaybePrivileged(DefaultInstanceManager.java:514) at org.apache.catalina.core.DefaultInstanceManager.newInstance(DefaultInstanceManager.java:142) at org.apache.catalina.core.StandardContext.listenerStart(StandardContext.java:4854) at org.apache.catalina.core.StandardContext.startInternal(StandardContext.java:5434) at org.apache.catalina.util.LifecycleBase.start(LifecycleBase.java:150) at org.apache.catalina.core.ContainerBase$StartChild.call(ContainerBase.java:1559) at org.apache.catalina.core.ContainerBase$StartChild.call(ContainerBase.java:1549) at java.util.concurrent.FutureTask.run(FutureTask.java:266) at java.util.concurrent.ThreadPoolExecutor.runWorker(ThreadPoolExecutor.java:1149) at java.util.concurrent.ThreadPoolExecutor$Worker.run(ThreadPoolExecutor.java:624) at java.lang.Thread.run(Thread.java:748) 六月 04, 2020 4:57:48 下午 org.apache.catalina.core.StandardContext listenerStart 严重: Skipped installing application listeners due to previous error(s) 六月 04, 2020 4:57:48 下午 org.apache.catalina.core.StandardContext startInternal 严重: Error listenerStart 六月 04, 2020 4:57:48 下午 org.apache.catalina.core.StandardContext startInternal 严重: Context [] startup failed due to previous errors 六月 04, 2020 4:57:48 下午 org.apache.coyote.AbstractProtocol start 信息: Starting ProtocolHandler ["http-bio-9101"] ``` 从maven-Plugins-tomcat7-tomcat7:run启动的 IDEA2020.1 maven3.5.2 jdk1.8 IDEA右键没有 properties![图片说明](https://img-ask.csdn.net/upload/202006/04/1591262663_357460.png) 求大佬帮助

IDEA 运行 scala.class文件后报错

IDEA 运行 scala.class文件后报错 ![图片说明](https://img-ask.csdn.net/upload/202005/04/1588569501_448365.png)

线上发布时某个jsp报错

在IDEA+tomcat时能正常使用,打了war包发布到了线上就报错,WEB/lib里也有jstl.jar包的 ``` HTTP Status 500 - The absolute uri: http://java.sun.com/jsp/jstl/core cannot be resolved in either web.xml or the jar files deployed with this application type Exception report message The absolute uri: http://java.sun.com/jsp/jstl/core cannot be resolved in either web.xml or the jar files deployed with this application description The server encountered an internal error that prevented it from fulfilling this request. exception org.apache.jasper.JasperException: The absolute uri: http://java.sun.com/jsp/jstl/core cannot be resolved in either web.xml or the jar files deployed with this application org.apache.jasper.compiler.DefaultErrorHandler.jspError(DefaultErrorHandler.java:56) org.apache.jasper.compiler.ErrorDispatcher.dispatch(ErrorDispatcher.java:445) org.apache.jasper.compiler.ErrorDispatcher.jspError(ErrorDispatcher.java:117) org.apache.jasper.compiler.TagLibraryInfoImpl.generateTLDLocation(TagLibraryInfoImpl.java:325) org.apache.jasper.compiler.TagLibraryInfoImpl.<init>(TagLibraryInfoImpl.java:154) org.apache.jasper.compiler.Parser.parseTaglibDirective(Parser.java:419) org.apache.jasper.compiler.Parser.parseDirective(Parser.java:484) org.apache.jasper.compiler.Parser.parseElements(Parser.java:1421) org.apache.jasper.compiler.Parser.parse(Parser.java:138) org.apache.jasper.compiler.ParserController.doParse(ParserController.java:242) org.apache.jasper.compiler.ParserController.parse(ParserController.java:102) org.apache.jasper.compiler.Compiler.generateJava(Compiler.java:199) org.apache.jasper.compiler.Compiler.compile(Compiler.java:374) org.apache.jasper.compiler.Compiler.compile(Compiler.java:354) org.apache.jasper.compiler.Compiler.compile(Compiler.java:341) org.apache.jasper.JspCompilationContext.compile(JspCompilationContext.java:662) org.apache.jasper.servlet.JspServletWrapper.service(JspServletWrapper.java:364) org.apache.jasper.servlet.JspServlet.serviceJspFile(JspServlet.java:395) org.apache.jasper.servlet.JspServlet.service(JspServlet.java:339) javax.servlet.http.HttpServlet.service(HttpServlet.java:731) org.apache.tomcat.websocket.server.WsFilter.doFilter(WsFilter.java:52) note The full stack trace of the root cause is available in the Apache Tomcat/7.0.76 logs. ```

idea导入安卓项目时出现错误

Process 'command 'C:\Users\daiyuhe\AppData\Local\Android\Sdk\build-tools\28.0.3\aapt.exe'' finished with non-zero exit value 1 org.gradle.initialization.ReportedException: org.gradle.internal.exceptions.LocationAwareException: Execution failed for task ':processDebugResources'. at org.gradle.initialization.DefaultGradleLauncher.doBuildStages(DefaultGradleLauncher.java:137) at org.gradle.initialization.DefaultGradleLauncher.executeTasks(DefaultGradleLauncher.java:107) at org.gradle.internal.invocation.GradleBuildController$1.call(GradleBuildController.java:78) at org.gradle.internal.invocation.GradleBuildController$1.call(GradleBuildController.java:75) at org.gradle.internal.work.DefaultWorkerLeaseService.withLocks(DefaultWorkerLeaseService.java:152) at org.gradle.internal.invocation.GradleBuildController.doBuild(GradleBuildController.java:100) at org.gradle.internal.invocation.GradleBuildController.run(GradleBuildController.java:75) at org.gradle.tooling.internal.provider.runner.BuildModelActionRunner.run(BuildModelActionRunner.java:53) at org.gradle.launcher.exec.ChainingBuildActionRunner.run(ChainingBuildActionRunner.java:35) at org.gradle.launcher.exec.ChainingBuildActionRunner.run(ChainingBuildActionRunner.java:35) at org.gradle.tooling.internal.provider.ValidatingBuildActionRunner.run(ValidatingBuildActionRunner.java:32) at org.gradle.launcher.exec.RunAsBuildOperationBuildActionRunner$1.run(RunAsBuildOperationBuildActionRunner.java:43) at org.gradle.internal.progress.DefaultBuildOperationExecutor$RunnableBuildOperationWorker.execute(DefaultBuildOperationExecutor.java:336) at org.gradle.internal.progress.DefaultBuildOperationExecutor$RunnableBuildOperationWorker.execute(DefaultBuildOperationExecutor.java:328) at org.gradle.internal.progress.DefaultBuildOperationExecutor.execute(DefaultBuildOperationExecutor.java:197) at org.gradle.internal.progress.DefaultBuildOperationExecutor.run(DefaultBuildOperationExecutor.java:107) at org.gradle.launcher.exec.RunAsBuildOperationBuildActionRunner.run(RunAsBuildOperationBuildActionRunner.java:40) at org.gradle.tooling.internal.provider.SubscribableBuildActionRunner.run(SubscribableBuildActionRunner.java:51) at org.gradle.launcher.exec.InProcessBuildActionExecuter.execute(InProcessBuildActionExecuter.java:45) at org.gradle.launcher.exec.InProcessBuildActionExecuter.execute(InProcessBuildActionExecuter.java:29) at org.gradle.launcher.exec.BuildTreeScopeBuildActionExecuter.execute(BuildTreeScopeBuildActionExecuter.java:39) at org.gradle.launcher.exec.BuildTreeScopeBuildActionExecuter.execute(BuildTreeScopeBuildActionExecuter.java:25) at org.gradle.tooling.internal.provider.ContinuousBuildActionExecuter.execute(ContinuousBuildActionExecuter.java:71) at org.gradle.tooling.internal.provider.ContinuousBuildActionExecuter.execute(ContinuousBuildActionExecuter.java:45) at org.gradle.tooling.internal.provider.ServicesSetupBuildActionExecuter.execute(ServicesSetupBuildActionExecuter.java:51) at org.gradle.tooling.internal.provider.ServicesSetupBuildActionExecuter.execute(ServicesSetupBuildActionExecuter.java:32) at org.gradle.tooling.internal.provider.GradleThreadBuildActionExecuter.execute(GradleThreadBuildActionExecuter.java:36) at org.gradle.tooling.internal.provider.GradleThreadBuildActionExecuter.execute(GradleThreadBuildActionExecuter.java:25) at org.gradle.tooling.internal.provider.ParallelismConfigurationBuildActionExecuter.execute(ParallelismConfigurationBuildActionExecuter.java:43) at org.gradle.tooling.internal.provider.ParallelismConfigurationBuildActionExecuter.execute(ParallelismConfigurationBuildActionExecuter.java:29) at org.gradle.tooling.internal.provider.StartParamsValidatingActionExecuter.execute(StartParamsValidatingActionExecuter.java:64) at org.gradle.tooling.internal.provider.StartParamsValidatingActionExecuter.execute(StartParamsValidatingActionExecuter.java:29) at org.gradle.tooling.internal.provider.SessionFailureReportingActionExecuter.execute(SessionFailureReportingActionExecuter.java:55) at org.gradle.tooling.internal.provider.SessionFailureReportingActionExecuter.execute(SessionFailureReportingActionExecuter.java:42) at org.gradle.tooling.internal.provider.SetupLoggingActionExecuter.execute(SetupLoggingActionExecuter.java:58) at org.gradle.tooling.internal.provider.SetupLoggingActionExecuter.execute(SetupLoggingActionExecuter.java:33) at org.gradle.launcher.daemon.server.exec.ExecuteBuild.doBuild(ExecuteBuild.java:67) at org.gradle.launcher.daemon.server.exec.BuildCommandOnly.execute(BuildCommandOnly.java:36) at org.gradle.launcher.daemon.server.api.DaemonCommandExecution.proceed(DaemonCommandExecution.java:120) at org.gradle.launcher.daemon.server.exec.WatchForDisconnection.execute(WatchForDisconnection.java:37) at org.gradle.launcher.daemon.server.api.DaemonCommandExecution.proceed(DaemonCommandExecution.java:120) at org.gradle.launcher.daemon.server.exec.ResetDeprecationLogger.execute(ResetDeprecationLogger.java:26) at org.gradle.launcher.daemon.server.api.DaemonCommandExecution.proceed(DaemonCommandExecution.java:120) at org.gradle.launcher.daemon.server.exec.RequestStopIfSingleUsedDaemon.execute(RequestStopIfSingleUsedDaemon.java:34) at org.gradle.launcher.daemon.server.api.DaemonCommandExecution.proceed(DaemonCommandExecution.java:120) at org.gradle.launcher.daemon.server.exec.ForwardClientInput$2.call(ForwardClientInput.java:74) at org.gradle.launcher.daemon.server.exec.ForwardClientInput$2.call(ForwardClientInput.java:72) at org.gradle.util.Swapper.swap(Swapper.java:38) at org.gradle.launcher.daemon.server.exec.ForwardClientInput.execute(ForwardClientInput.java:72) at org.gradle.launcher.daemon.server.api.DaemonCommandExecution.proceed(DaemonCommandExecution.java:120) at org.gradle.launcher.daemon.server.exec.LogAndCheckHealth.execute(LogAndCheckHealth.java:55) at org.gradle.launcher.daemon.server.api.DaemonCommandExecution.proceed(DaemonCommandExecution.java:120) at org.gradle.launcher.daemon.server.exec.LogToClient.doBuild(LogToClient.java:62) at org.gradle.launcher.daemon.server.exec.BuildCommandOnly.execute(BuildCommandOnly.java:36) at org.gradle.launcher.daemon.server.api.DaemonCommandExecution.proceed(DaemonCommandExecution.java:120) at org.gradle.launcher.daemon.server.exec.EstablishBuildEnvironment.doBuild(EstablishBuildEnvironment.java:82) at org.gradle.launcher.daemon.server.exec.BuildCommandOnly.execute(BuildCommandOnly.java:36) at org.gradle.launcher.daemon.server.api.DaemonCommandExecution.proceed(DaemonCommandExecution.java:120) at org.gradle.launcher.daemon.server.exec.StartBuildOrRespondWithBusy$1.run(StartBuildOrRespondWithBusy.java:50) at org.gradle.launcher.daemon.server.DaemonStateCoordinator$1.run(DaemonStateCoordinator.java:297) at org.gradle.internal.concurrent.ExecutorPolicy$CatchAndRecordFailures.onExecute(ExecutorPolicy.java:63) at org.gradle.internal.concurrent.ManagedExecutorImpl$1.run(ManagedExecutorImpl.java:46) at java.util.concurrent.ThreadPoolExecutor.runWorker(ThreadPoolExecutor.java:1149) at java.util.concurrent.ThreadPoolExecutor$Worker.run(ThreadPoolExecutor.java:624) at org.gradle.internal.concurrent.ThreadFactoryImpl$ManagedThreadRunnable.run(ThreadFactoryImpl.java:55) at java.lang.Thread.run(Thread.java:748) Caused by: org.gradle.internal.exceptions.LocationAwareException: Execution failed for task ':processDebugResources'. at org.gradle.initialization.DefaultExceptionAnalyser.transform(DefaultExceptionAnalyser.java:74) at org.gradle.initialization.MultipleBuildFailuresExceptionAnalyser.transform(MultipleBuildFailuresExceptionAnalyser.java:47) at org.gradle.initialization.StackTraceSanitizingExceptionAnalyser.transform(StackTraceSanitizingExceptionAnalyser.java:30) at org.gradle.initialization.DefaultGradleLauncher.doBuildStages(DefaultGradleLauncher.java:135) at org.gradle.initialization.DefaultGradleLauncher.executeTasks(DefaultGradleLauncher.java:107) at org.gradle.internal.invocation.GradleBuildController$1.call(GradleBuildController.java:78) at org.gradle.internal.invocation.GradleBuildController$1.call(GradleBuildController.java:75) at org.gradle.internal.work.DefaultWorkerLeaseService.withLocks(DefaultWorkerLeaseService.java:152) at org.gradle.internal.invocation.GradleBuildController.doBuild(GradleBuildController.java:100) at org.gradle.internal.invocation.GradleBuildController.run(GradleBuildController.java:75) at org.gradle.tooling.internal.provider.runner.BuildModelActionRunner.run(BuildModelActionRunner.java:53) at org.gradle.launcher.exec.ChainingBuildActionRunner.run(ChainingBuildActionRunner.java:35) at org.gradle.launcher.exec.ChainingBuildActionRunner.run(ChainingBuildActionRunner.java:35) at org.gradle.tooling.internal.provider.ValidatingBuildActionRunner.run(ValidatingBuildActionRunner.java:32) at org.gradle.launcher.exec.RunAsBuildOperationBuildActionRunner$1.run(RunAsBuildOperationBuildActionRunner.java:43) at org.gradle.internal.progress.DefaultBuildOperationExecutor$RunnableBuildOperationWorker.execute(DefaultBuildOperationExecutor.java:336) at org.gradle.internal.progress.DefaultBuildOperationExecutor$RunnableBuildOperationWorker.execute(DefaultBuildOperationExecutor.java:328) at org.gradle.internal.progress.DefaultBuildOperationExecutor.execute(DefaultBuildOperationExecutor.java:197) at org.gradle.internal.progress.DefaultBuildOperationExecutor.run(DefaultBuildOperationExecutor.java:107) at org.gradle.launcher.exec.RunAsBuildOperationBuildActionRunner.run(RunAsBuildOperationBuildActionRunner.java:40) at org.gradle.tooling.internal.provider.SubscribableBuildActionRunner.run(SubscribableBuildActionRunner.java:51) at org.gradle.launcher.exec.InProcessBuildActionExecuter.execute(InProcessBuildActionExecuter.java:45) at org.gradle.launcher.exec.InProcessBuildActionExecuter.execute(InProcessBuildActionExecuter.java:29) at org.gradle.launcher.exec.BuildTreeScopeBuildActionExecuter.execute(BuildTreeScopeBuildActionExecuter.java:39) at org.gradle.launcher.exec.BuildTreeScopeBuildActionExecuter.execute(BuildTreeScopeBuildActionExecuter.java:25) at org.gradle.tooling.internal.provider.ContinuousBuildActionExecuter.execute(ContinuousBuildActionExecuter.java:71) at org.gradle.tooling.internal.provider.ContinuousBuildActionExecuter.execute(ContinuousBuildActionExecuter.java:45) at org.gradle.tooling.internal.provider.ServicesSetupBuildActionExecuter.execute(ServicesSetupBuildActionExecuter.java:51) at org.gradle.tooling.internal.provider.ServicesSetupBuildActionExecuter.execute(ServicesSetupBuildActionExecuter.java:32) at org.gradle.tooling.internal.provider.GradleThreadBuildActionExecuter.execute(GradleThreadBuildActionExecuter.java:36) at org.gradle.tooling.internal.provider.GradleThreadBuildActionExecuter.execute(GradleThreadBuildActionExecuter.java:25) at org.gradle.tooling.internal.provider.ParallelismConfigurationBuildActionExecuter.execute(ParallelismConfigurationBuildActionExecuter.java:43) at org.gradle.tooling.internal.provider.ParallelismConfigurationBuildActionExecuter.execute(ParallelismConfigurationBuildActionExecuter.java:29) at org.gradle.tooling.internal.provider.StartParamsValidatingActionExecuter.execute(StartParamsValidatingActionExecuter.java:64) at org.gradle.tooling.internal.provider.StartParamsValidatingActionExecuter.execute(StartParamsValidatingActionExecuter.java:29) at org.gradle.tooling.internal.provider.SessionFailureReportingActionExecuter.execute(SessionFailureReportingActionExecuter.java:55) at org.gradle.tooling.internal.provider.SessionFailureReportingActionExecuter.execute(SessionFailureReportingActionExecuter.java:42) at org.gradle.tooling.internal.provider.SetupLoggingActionExecuter.execute(SetupLoggingActionExecuter.java:58) at org.gradle.tooling.internal.provider.SetupLoggingActionExecuter.execute(SetupLoggingActionExecuter.java:33) at org.gradle.launcher.daemon.server.exec.ExecuteBuild.doBuild(ExecuteBuild.java:67) at org.gradle.launcher.daemon.server.exec.BuildCommandOnly.execute(BuildCommandOnly.java:36) at org.gradle.launcher.daemon.server.api.DaemonCommandExecution.proceed(DaemonCommandExecution.java:120) at org.gradle.launcher.daemon.server.exec.WatchForDisconnection.execute(WatchForDisconnection.java:37) at org.gradle.launcher.daemon.server.api.DaemonCommandExecution.proceed(DaemonCommandExecution.java:120) at org.gradle.launcher.daemon.server.exec.ResetDeprecationLogger.execute(ResetDeprecationLogger.java:26) at org.gradle.launcher.daemon.server.api.DaemonCommandExecution.proceed(DaemonCommandExecution.java:120) at org.gradle.launcher.daemon.server.exec.RequestStopIfSingleUsedDaemon.execute(RequestStopIfSingleUsedDaemon.java:34) at org.gradle.launcher.daemon.server.api.DaemonCommandExecution.proceed(DaemonCommandExecution.java:120) at org.gradle.launcher.daemon.server.exec.ForwardClientInput$2.call(ForwardClientInput.java:74) at org.gradle.launcher.daemon.server.exec.ForwardClientInput$2.call(ForwardClientInput.java:72) at org.gradle.util.Swapper.swap(Swapper.java:38) at org.gradle.launcher.daemon.server.exec.ForwardClientInput.execute(ForwardClientInput.java:72) at org.gradle.launcher.daemon.server.api.DaemonCommandExecution.proceed(DaemonCommandExecution.java:120) at org.gradle.launcher.daemon.server.exec.LogAndCheckHealth.execute(LogAndCheckHealth.java:55) at org.gradle.launcher.daemon.server.api.DaemonCommandExecution.proceed(DaemonCommandExecution.java:120) at org.gradle.launcher.daemon.server.exec.LogToClient.doBuild(LogToClient.java:62) at org.gradle.launcher.daemon.server.exec.BuildCommandOnly.execute(BuildCommandOnly.java:36) at org.gradle.launcher.daemon.server.api.DaemonCommandExecution.proceed(DaemonCommandExecution.java:120) at org.gradle.launcher.daemon.server.exec.EstablishBuildEnvironment.doBuild(EstablishBuildEnvironment.java:82) at org.gradle.launcher.daemon.server.exec.BuildCommandOnly.execute(BuildCommandOnly.java:36) at org.gradle.launcher.daemon.server.api.DaemonCommandExecution.proceed(DaemonCommandExecution.java:120) at org.gradle.launcher.daemon.server.exec.StartBuildOrRespondWithBusy$1.run(StartBuildOrRespondWithBusy.java:50) at org.gradle.launcher.daemon.server.DaemonStateCoordinator$1.run(DaemonStateCoordinator.java:297) at org.gradle.internal.concurrent.ExecutorPolicy$CatchAndRecordFailures.onExecute(ExecutorPolicy.java:63) at org.gradle.internal.concurrent.ManagedExecutorImpl$1.run(ManagedExecutorImpl.java:46) at org.gradle.internal.concurrent.ThreadFactoryImpl$ManagedThreadRunnable.run(ThreadFactoryImpl.java:55) Caused by: org.gradle.api.tasks.TaskExecutionException: Execution failed for task ':processDebugResources'. at org.gradle.api.internal.tasks.execution.ExecuteActionsTaskExecuter.executeActions(ExecuteActionsTaskExecuter.java:100) at org.gradle.api.internal.tasks.execution.ExecuteActionsTaskExecuter.execute(ExecuteActionsTaskExecuter.java:70) at org.gradle.api.internal.tasks.execution.SkipUpToDateTaskExecuter.execute(SkipUpToDateTaskExecuter.java:63) at org.gradle.api.internal.tasks.execution.ResolveTaskOutputCachingStateExecuter.execute(ResolveTaskOutputCachingStateExecuter.java:54) at org.gradle.api.internal.tasks.execution.ValidatingTaskExecuter.execute(ValidatingTaskExecuter.java:58) at org.gradle.api.internal.tasks.execution.SkipEmptySourceFilesTaskExecuter.execute(SkipEmptySourceFilesTaskExecuter.java:88) at org.gradle.api.internal.tasks.execution.ResolveTaskArtifactStateTaskExecuter.execute(ResolveTaskArtifactStateTaskExecuter.java:52) at org.gradle.api.internal.tasks.execution.SkipTaskWithNoActionsExecuter.execute(SkipTaskWithNoActionsExecuter.java:52) at org.gradle.api.internal.tasks.execution.SkipOnlyIfTaskExecuter.execute(SkipOnlyIfTaskExecuter.java:54) at org.gradle.api.internal.tasks.execution.ExecuteAtMostOnceTaskExecuter.execute(ExecuteAtMostOnceTaskExecuter.java:43) at org.gradle.api.internal.tasks.execution.CatchExceptionTaskExecuter.execute(CatchExceptionTaskExecuter.java:34) at org.gradle.execution.taskgraph.DefaultTaskGraphExecuter$EventFiringTaskWorker$1.run(DefaultTaskGraphExecuter.java:248) at org.gradle.internal.progress.DefaultBuildOperationExecutor$RunnableBuildOperationWorker.execute(DefaultBuildOperationExecutor.java:336) at org.gradle.internal.progress.DefaultBuildOperationExecutor$RunnableBuildOperationWorker.execute(DefaultBuildOperationExecutor.java:328) at org.gradle.internal.progress.DefaultBuildOperationExecutor.execute(DefaultBuildOperationExecutor.java:197) at org.gradle.internal.progress.DefaultBuildOperationExecutor.run(DefaultBuildOperationExecutor.java:107) at org.gradle.execution.taskgraph.DefaultTaskGraphExecuter$EventFiringTaskWorker.execute(DefaultTaskGraphExecuter.java:241) at org.gradle.execution.taskgraph.DefaultTaskGraphExecuter$EventFiringTaskWorker.execute(DefaultTaskGraphExecuter.java:230) at org.gradle.execution.taskgraph.DefaultTaskPlanExecutor$TaskExecutorWorker.processTask(DefaultTaskPlanExecutor.java:124) at org.gradle.execution.taskgraph.DefaultTaskPlanExecutor$TaskExecutorWorker.access$200(DefaultTaskPlanExecutor.java:80) at org.gradle.execution.taskgraph.DefaultTaskPlanExecutor$TaskExecutorWorker$1.execute(DefaultTaskPlanExecutor.java:105) at org.gradle.execution.taskgraph.DefaultTaskPlanExecutor$TaskExecutorWorker$1.execute(DefaultTaskPlanExecutor.java:99) at org.gradle.execution.taskgraph.DefaultTaskExecutionPlan.execute(DefaultTaskExecutionPlan.java:625) at org.gradle.execution.taskgraph.DefaultTaskExecutionPlan.executeWithTask(DefaultTaskExecutionPlan.java:580) at org.gradle.execution.taskgraph.DefaultTaskPlanExecutor$TaskExecutorWorker.run(DefaultTaskPlanExecutor.java:99) ... 3 more Caused by: java.lang.RuntimeException: com.android.ide.common.process.ProcessException: Failed to execute aapt at com.android.build.gradle.tasks.ProcessAndroidResources.doFullTaskAction(ProcessAndroidResources.java:201) at com.android.build.gradle.internal.tasks.IncrementalTask.taskAction(IncrementalTask.java:82) at org.gradle.internal.reflect.JavaMethod.invoke(JavaMethod.java:73) at org.gradle.api.internal.project.taskfactory.DefaultTaskClassInfoStore$IncrementalTaskAction.doExecute(DefaultTaskClassInfoStore.java:173) at org.gradle.api.internal.project.taskfactory.DefaultTaskClassInfoStore$StandardTaskAction.execute(DefaultTaskClassInfoStore.java:134) at org.gradle.api.internal.project.taskfactory.DefaultTaskClassInfoStore$StandardTaskAction.execute(DefaultTaskClassInfoStore.java:121) at org.gradle.api.internal.tasks.execution.ExecuteActionsTaskExecuter$1.run(ExecuteActionsTaskExecuter.java:122) at org.gradle.internal.progress.DefaultBuildOperationExecutor$RunnableBuildOperationWorker.execute(DefaultBuildOperationExecutor.java:336) at org.gradle.internal.progress.DefaultBuildOperationExecutor$RunnableBuildOperationWorker.execute(DefaultBuildOperationExecutor.java:328) at org.gradle.internal.progress.DefaultBuildOperationExecutor.execute(DefaultBuildOperationExecutor.java:197) at org.gradle.internal.progress.DefaultBuildOperationExecutor.run(DefaultBuildOperationExecutor.java:107) at org.gradle.api.internal.tasks.execution.ExecuteActionsTaskExecuter.executeAction(ExecuteActionsTaskExecuter.java:111) at org.gradle.api.internal.tasks.execution.ExecuteActionsTaskExecuter.executeActions(ExecuteActionsTaskExecuter.java:92) ... 27 more Caused by: com.android.ide.common.process.ProcessException: Failed to execute aapt at com.android.builder.core.AndroidBuilder.processResources(AndroidBuilder.java:867) at com.android.build.gradle.tasks.ProcessAndroidResources.doFullTaskAction(ProcessAndroidResources.java:194) ... 39 more Caused by: java.util.concurrent.ExecutionException: com.android.ide.common.process.ProcessException: Error while executing process C:\Users\daiyuhe\AppData\Local\Android\Sdk\build-tools\28.0.3\aapt.exe with arguments {package -f --no-crunch -I C:\Users\daiyuhe\AppData\Local\Android\Sdk\platforms\android-28\android.jar -M \\?\C:\Users\daiyuhe\Documents\Java_workspace\Calculator\build\intermediates\manifests\full\debug\AndroidManifest.xml -S C:\Users\daiyuhe\Documents\Java_workspace\Calculator\build\intermediates\res\merged\debug -m -J \\?\C:\Users\daiyuhe\Documents\Java_workspace\Calculator\build\generated\source\r\debug -F C:\Users\daiyuhe\Documents\Java_workspace\Calculator\build\intermediates\res\resources-debug.ap_ --debug-mode --custom-package com.daiyuhe.app.calculator -0 apk --output-text-symbols \\?\C:\Users\daiyuhe\Documents\Java_workspace\Calculator\build\intermediates\symbols\debug --no-version-vectors} at com.google.common.util.concurrent.AbstractFuture$Sync.getValue(AbstractFuture.java:299) at com.google.common.util.concurrent.AbstractFuture$Sync.get(AbstractFuture.java:286) at com.google.common.util.concurrent.AbstractFuture.get(AbstractFuture.java:116) at com.android.builder.core.AndroidBuilder.processResources(AndroidBuilder.java:865) ... 40 more Caused by: com.android.ide.common.process.ProcessException: Error while executing process C:\Users\daiyuhe\AppData\Local\Android\Sdk\build-tools\28.0.3\aapt.exe with arguments {package -f --no-crunch -I C:\Users\daiyuhe\AppData\Local\Android\Sdk\platforms\android-28\android.jar -M \\?\C:\Users\daiyuhe\Documents\Java_workspace\Calculator\build\intermediates\manifests\full\debug\AndroidManifest.xml -S C:\Users\daiyuhe\Documents\Java_workspace\Calculator\build\intermediates\res\merged\debug -m -J \\?\C:\Users\daiyuhe\Documents\Java_workspace\Calculator\build\generated\source\r\debug -F C:\Users\daiyuhe\Documents\Java_workspace\Calculator\build\intermediates\res\resources-debug.ap_ --debug-mode --custom-package com.daiyuhe.app.calculator -0 apk --output-text-symbols \\?\C:\Users\daiyuhe\Documents\Java_workspace\Calculator\build\intermediates\symbols\debug --no-version-vectors} at com.android.build.gradle.internal.process.GradleProcessResult.buildProcessException(GradleProcessResult.java:74) at com.android.build.gradle.internal.process.GradleProcessResult.assertNormalExitValue(GradleProcessResult.java:49) at com.android.builder.internal.aapt.AbstractProcessExecutionAapt$1.onSuccess(AbstractProcessExecutionAapt.java:78) at com.android.builder.internal.aapt.AbstractProcessExecutionAapt$1.onSuccess(AbstractProcessExecutionAapt.java:74) at com.google.common.util.concurrent.Futures$6.run(Futures.java:1319) at com.google.common.util.concurrent.MoreExecutors$DirectExecutor.execute(MoreExecutors.java:457) at com.google.common.util.concurrent.ExecutionList.executeListener(ExecutionList.java:156) at com.google.common.util.concurrent.ExecutionList.execute(ExecutionList.java:145) at com.google.common.util.concurrent.AbstractFuture.set(AbstractFuture.java:185) at com.google.common.util.concurrent.SettableFuture.set(SettableFuture.java:53) at com.android.build.gradle.internal.process.GradleProcessExecutor$1.run(GradleProcessExecutor.java:60) Caused by: org.gradle.process.internal.ExecException: Process 'command 'C:\Users\daiyuhe\AppData\Local\Android\Sdk\build-tools\28.0.3\aapt.exe'' finished with non-zero exit value 1 at org.gradle.process.internal.DefaultExecHandle$ExecResultImpl.assertNormalExitValue(DefaultExecHandle.java:380) at com.android.build.gradle.internal.process.GradleProcessResult.assertNormalExitValue(GradleProcessResult.java:47) ... 9 more

MySQL 8.0.19安装教程(windows 64位)

话不多说直接开干 目录 1-先去官网下载点击的MySQL的下载​ 2-配置初始化的my.ini文件的文件 3-初始化MySQL 4-安装MySQL服务 + 启动MySQL 服务 5-连接MySQL + 修改密码 先去官网下载点击的MySQL的下载 下载完成后解压 解压完是这个样子 配置初始化的my.ini文件的文件 ...

Python+OpenCV计算机视觉

Python+OpenCV计算机视觉系统全面的介绍。

Vue.js 2.0之全家桶系列视频课程

基于新的Vue.js 2.3版本, 目前新全的Vue.js教学视频,让你少走弯路,直达技术前沿! 1. 包含Vue.js全家桶(vue.js、vue-router、axios、vuex、vue-cli、webpack、ElementUI等) 2. 采用笔记+代码案例的形式讲解,通俗易懂

navicat(内含激活码)

navicat支持mysql的可视化操作,内涵激活码,不用再忍受弹框的痛苦。

HTML期末大作业

这是我自己做的HTML期末大作业,花了很多时间,稍加修改就可以作为自己的作业了,而且也可以作为学习参考

150讲轻松搞定Python网络爬虫

【为什么学爬虫?】 &nbsp; &nbsp; &nbsp; &nbsp;1、爬虫入手容易,但是深入较难,如何写出高效率的爬虫,如何写出灵活性高可扩展的爬虫都是一项技术活。另外在爬虫过程中,经常容易遇到被反爬虫,比如字体反爬、IP识别、验证码等,如何层层攻克难点拿到想要的数据,这门课程,你都能学到! &nbsp; &nbsp; &nbsp; &nbsp;2、如果是作为一个其他行业的开发者,比如app开发,web开发,学习爬虫能让你加强对技术的认知,能够开发出更加安全的软件和网站 【课程设计】 一个完整的爬虫程序,无论大小,总体来说可以分成三个步骤,分别是: 网络请求:模拟浏览器的行为从网上抓取数据。 数据解析:将请求下来的数据进行过滤,提取我们想要的数据。 数据存储:将提取到的数据存储到硬盘或者内存中。比如用mysql数据库或者redis等。 那么本课程也是按照这几个步骤循序渐进的进行讲解,带领学生完整的掌握每个步骤的技术。另外,因为爬虫的多样性,在爬取的过程中可能会发生被反爬、效率低下等。因此我们又增加了两个章节用来提高爬虫程序的灵活性,分别是: 爬虫进阶:包括IP代理,多线程爬虫,图形验证码识别、JS加密解密、动态网页爬虫、字体反爬识别等。 Scrapy和分布式爬虫:Scrapy框架、Scrapy-redis组件、分布式爬虫等。 通过爬虫进阶的知识点我们能应付大量的反爬网站,而Scrapy框架作为一个专业的爬虫框架,使用他可以快速提高我们编写爬虫程序的效率和速度。另外如果一台机器不能满足你的需求,我们可以用分布式爬虫让多台机器帮助你快速爬取数据。 &nbsp; 从基础爬虫到商业化应用爬虫,本套课程满足您的所有需求! 【课程服务】 专属付费社群+每周三讨论会+1v1答疑

三个项目玩转深度学习(附1G源码)

从事大数据与人工智能开发与实践约十年,钱老师亲自见证了大数据行业的发展与人工智能的从冷到热。事实证明,计算机技术的发展,算力突破,海量数据,机器人技术等,开启了第四次工业革命的序章。深度学习图像分类一直是人工智能的经典任务,是智慧零售、安防、无人驾驶等机器视觉应用领域的核心技术之一,掌握图像分类技术是机器视觉学习的重中之重。针对现有线上学习的特点与实际需求,我们开发了人工智能案例实战系列课程。打造:以项目案例实践为驱动的课程学习方式,覆盖了智能零售,智慧交通等常见领域,通过基础学习、项目案例实践、社群答疑,三维立体的方式,打造最好的学习效果。

基于STM32的电子时钟设计

时钟功能 还有闹钟功能,温湿度功能,整点报时功能 你值得拥有

学生成绩管理系统(PHP + MYSQL)

做的是数据库课程设计,使用的php + MySQL,本来是黄金搭配也就没啥说的,推荐使用wamp服务器,里面有详细的使用说明,带有界面的啊!呵呵 不行的话,可以给我留言!

面试了一个 31 岁程序员,让我有所触动,30岁以上的程序员该何去何从?

最近面试了一个31岁8年经验的程序猿,让我有点感慨,大龄程序猿该何去何从。

程序员的兼职技能课

获取讲师答疑方式: 在付费视频第一节(触摸命令_ALL)片头有二维码及加群流程介绍 限时福利 原价99元,今日仅需39元!购课添加小助手(微信号:itxy41)按提示还可领取价值800元的编程大礼包! 讲师介绍: 苏奕嘉&nbsp;前阿里UC项目工程师 脚本开发平台官方认证满级(六级)开发者。 我将如何教会你通过【定制脚本】赚到你人生的第一桶金? 零基础程序定制脚本开发课程,是完全针对零脚本开发经验的小白而设计,课程内容共分为3大阶段: ①前期将带你掌握Q开发语言和界面交互开发能力; ②中期通过实战来制作有具体需求的定制脚本; ③后期将解锁脚本的更高阶玩法,打通任督二脉; ④应用定制脚本合法赚取额外收入的完整经验分享,带你通过程序定制脚本开发这项副业,赚取到你的第一桶金!

实用主义学Python(小白也容易上手的Python实用案例)

原价169,限时立减100元! 系统掌握Python核心语法16点,轻松应对工作中80%以上的Python使用场景! 69元=72讲+源码+社群答疑+讲师社群分享会&nbsp; 【哪些人适合学习这门课程?】 1)大学生,平时只学习了Python理论,并未接触Python实战问题; 2)对Python实用技能掌握薄弱的人,自动化、爬虫、数据分析能让你快速提高工作效率; 3)想学习新技术,如:人工智能、机器学习、深度学习等,这门课程是你的必修课程; 4)想修炼更好的编程内功,优秀的工程师肯定不能只会一门语言,Python语言功能强大、使用高效、简单易学。 【超实用技能】 从零开始 自动生成工作周报 职场升级 豆瓣电影数据爬取 实用案例 奥运冠军数据分析 自动化办公:通过Python自动化分析Excel数据并自动操作Word文档,最终获得一份基于Excel表格的数据分析报告。 豆瓣电影爬虫:通过Python自动爬取豆瓣电影信息并将电影图片保存到本地。 奥运会数据分析实战 简介:通过Python分析120年间奥运会的数据,从不同角度入手分析,从而得出一些有趣的结论。 【超人气老师】 二两 中国人工智能协会高级会员 生成对抗神经网络研究者 《深入浅出生成对抗网络:原理剖析与TensorFlow实现》一书作者 阿里云大学云学院导师 前大型游戏公司后端工程师 【超丰富实用案例】 0)图片背景去除案例 1)自动生成工作周报案例 2)豆瓣电影数据爬取案例 3)奥运会数据分析案例 4)自动处理邮件案例 5)github信息爬取/更新提醒案例 6)B站百大UP信息爬取与分析案例 7)构建自己的论文网站案例

Java8零基础入门视频教程

这门课程基于主流的java8平台,由浅入深的详细讲解了java SE的开发技术,可以使java方向的入门学员,快速扎实的掌握java开发技术!

Python数据挖掘简易入门

&nbsp; &nbsp; &nbsp; &nbsp; 本课程为Python数据挖掘方向的入门课程,课程主要以真实数据为基础,详细介绍数据挖掘入门的流程和使用Python实现pandas与numpy在数据挖掘方向的运用,并深入学习如何运用scikit-learn调用常用的数据挖掘算法解决数据挖掘问题,为进一步深入学习数据挖掘打下扎实的基础。

零基础学C#编程—C#从小白到大咖

本课程从初学者角度出发,提供了C#从入门到成为程序开发高手所需要掌握的各方面知识和技术。 【课程特点】 1 由浅入深,编排合理; 2 视频讲解,精彩详尽; 3 丰富实例,轻松易学; 4 每章总结配有难点解析文档。 15大章节,228课时,1756分钟与你一同进步!

MySQL数据库面试题(2020最新版)

文章目录数据库基础知识为什么要使用数据库什么是SQL?什么是MySQL?数据库三大范式是什么mysql有关权限的表都有哪几个MySQL的binlog有有几种录入格式?分别有什么区别?数据类型mysql有哪些数据类型引擎MySQL存储引擎MyISAM与InnoDB区别MyISAM索引与InnoDB索引的区别?InnoDB引擎的4大特性存储引擎选择索引什么是索引?索引有哪些优缺点?索引使用场景(重点)...

多功能数字钟.zip

利用数字电子计数知识设计并制作的数字电子钟(含multisim仿真),该数字钟具有显示星期、24小时制时间、闹铃、整点报时、时间校准功能

极简JAVA学习营第四期(报名以后加助教微信:eduxy-1)

想学好JAVA必须要报两万的培训班吗? Java大神勿入 如果你: 零基础想学JAVA却不知道从何入手 看了一堆书和视频却还是连JAVA的环境都搭建不起来 囊中羞涩面对两万起的JAVA培训班不忍直视 在职没有每天大块的时间专门学习JAVA 那么恭喜你找到组织了,在这里有: 1. 一群志同道合立志学好JAVA的同学一起学习讨论JAVA 2. 灵活机动的学习时间完成特定学习任务+每日编程实战练习 3. 热心助人的助教和讲师及时帮你解决问题,不按时完成作业小心助教老师的家访哦 上一张图看看前辈的感悟: &nbsp; &nbsp; 大家一定迫不及待想知道什么是极简JAVA学习营了吧,下面就来给大家说道说道: 什么是极简JAVA学习营? 1. 针对Java小白或者初级Java学习者; 2. 利用9天时间,每天1个小时时间; 3.通过 每日作业 / 组队PK / 助教答疑 / 实战编程 / 项目答辩 / 社群讨论 / 趣味知识抢答等方式让学员爱上学习编程 , 最终实现能独立开发一个基于控制台的‘库存管理系统’ 的学习模式 极简JAVA学习营是怎么学习的? &nbsp; 如何报名? 只要购买了极简JAVA一:JAVA入门就算报名成功! &nbsp;本期为第四期极简JAVA学习营,我们来看看往期学员的学习状态: 作业看这里~ &nbsp; 助教的作业报告是不是很专业 不交作业打屁屁 助教答疑是不是很用心 &nbsp; 有奖抢答大家玩的很嗨啊 &nbsp; &nbsp; 项目答辩终于开始啦 &nbsp; 优秀者的获奖感言 &nbsp; 这是答辩项目的效果 &nbsp; &nbsp; 这么细致的服务,这么好的氛围,这样的学习效果,需要多少钱呢? 不要1999,不要199,不要99,只要9.9 是的你没听错,只要9.9以上所有就都属于你了 如果你: 1、&nbsp;想学JAVA没有基础 2、&nbsp;想学JAVA没有整块的时间 3、&nbsp;想学JAVA没有足够的预算 还等什么?赶紧报名吧,抓紧抢位,本期只招300人,错过只有等时间待定的下一期了 &nbsp; 报名请加小助手微信:eduxy-1 &nbsp; &nbsp;

Python可以这样学(第一季:Python内功修炼)

董付国系列教材《Python程序设计基础》、《Python程序设计(第2版)》、《Python可以这样学》配套视频,讲解Python 3.5.x和3.6.x语法、内置对象用法、选择与循环以及函数设计与使用、lambda表达式用法、字符串与正则表达式应用、面向对象编程、文本文件与二进制文件操作、目录操作与系统运维、异常处理结构。

Java基础知识面试题(2020最新版)

文章目录Java概述何为编程什么是Javajdk1.5之后的三大版本JVM、JRE和JDK的关系什么是跨平台性?原理是什么Java语言有哪些特点什么是字节码?采用字节码的最大好处是什么什么是Java程序的主类?应用程序和小程序的主类有何不同?Java应用程序与小程序之间有那些差别?Java和C++的区别Oracle JDK 和 OpenJDK 的对比基础语法数据类型Java有哪些数据类型switc...

机器学习实战系列套餐(必备基础+经典算法+案例实战)

机器学习实战系列套餐以实战为出发点,帮助同学们快速掌握机器学习领域必备经典算法原理并结合Python工具包进行实战应用。建议学习顺序:1.Python必备工具包:掌握实战工具 2.机器学习算法与实战应用:数学原理与应用方法都是必备技能 3.数据挖掘实战:通过真实数据集进行项目实战。按照下列课程顺序学习即可! 课程风格通俗易懂,用最接地气的方式带领大家轻松进军机器学习!提供所有课程代码,PPT与实战数据,有任何问题欢迎随时与我讨论。

Java面试题大全(2020版)

发现网上很多Java面试题都没有答案,所以花了很长时间搜集整理出来了这套Java面试题大全,希望对大家有帮助哈~ 本套Java面试题大全,全的不能再全,哈哈~ 一、Java 基础 1. JDK 和 JRE 有什么区别? JDK:Java Development Kit 的简称,java 开发工具包,提供了 java 的开发环境和运行环境。 JRE:Java Runtime Environ...

程序员垃圾简历长什么样?

已经连续五年参加大厂校招、社招的技术面试工作,简历看的不下于万份 这篇文章会用实例告诉你,什么是差的程序员简历! 疫情快要结束了,各个公司也都开始春招了,作为即将红遍大江南北的新晋UP主,那当然要为小伙伴们做点事(手动狗头)。 就在公众号里公开征简历,义务帮大家看,并一一点评。《启舰:春招在即,义务帮大家看看简历吧》 一石激起千层浪,三天收到两百多封简历。 花光了两个星期的所有空闲时...

深度学习原理+项目实战+算法详解+主流框架(套餐)

深度学习系列课程从深度学习基础知识点开始讲解一步步进入神经网络的世界再到卷积和递归神经网络,详解各大经典网络架构。实战部分选择当下最火爆深度学习框架PyTorch与Tensorflow/Keras,全程实战演示框架核心使用与建模方法。项目实战部分选择计算机视觉与自然语言处理领域经典项目,从零开始详解算法原理,debug模式逐行代码解读。适合准备就业和转行的同学们加入学习! 建议按照下列课程顺序来进行学习 (1)掌握深度学习必备经典网络架构 (2)深度框架实战方法 (3)计算机视觉与自然语言处理项目实战。(按照课程排列顺序即可)

HoloLens2开发入门教程

本课程为HoloLens2开发入门教程,讲解部署开发环境,安装VS2019,Unity版本,Windows SDK,创建Unity项目,讲解如何使用MRTK,编辑器模拟手势交互,打包VS工程并编译部署应用到HoloLens上等。

几率大的Redis面试题(含答案)

本文的面试题如下: Redis 持久化机制 缓存雪崩、缓存穿透、缓存预热、缓存更新、缓存降级等问题 热点数据和冷数据是什么 Memcache与Redis的区别都有哪些? 单线程的redis为什么这么快 redis的数据类型,以及每种数据类型的使用场景,Redis 内部结构 redis的过期策略以及内存淘汰机制【~】 Redis 为什么是单线程的,优点 如何解决redis的并发竞争key问题 Red...

MFC一站式终极全套课程包

该套餐共包含从C小白到C++到MFC的全部课程,整套学下来绝对成为一名C++大牛!!!

【数据结构与算法综合实验】欢乐连连看(C++ & MFC)案例

这是武汉理工大学计算机学院数据结构与算法综合实验课程的第三次项目:欢乐连连看(C++ & MFC)迭代开发代码。运行环境:VS2017。已经实现功能:开始游戏、消子、判断胜负、提示、重排、计时、帮助。

YOLOv3目标检测实战:训练自己的数据集

YOLOv3是一种基于深度学习的端到端实时目标检测方法,以速度快见长。本课程将手把手地教大家使用labelImg标注和使用YOLOv3训练自己的数据集。课程分为三个小项目:足球目标检测(单目标检测)、梅西目标检测(单目标检测)、足球和梅西同时目标检测(两目标检测)。 本课程的YOLOv3使用Darknet,在Ubuntu系统上做项目演示。包括:安装Darknet、给自己的数据集打标签、整理自己的数据集、修改配置文件、训练自己的数据集、测试训练出的网络模型、性能统计(mAP计算和画出PR曲线)和先验框聚类。 Darknet是使用C语言实现的轻型开源深度学习框架,依赖少,可移植性好,值得深入探究。 除本课程《YOLOv3目标检测实战:训练自己的数据集》外,本人推出了有关YOLOv3目标检测的系列课程,请持续关注该系列的其它课程视频,包括: 《YOLOv3目标检测实战:交通标志识别》 《YOLOv3目标检测:原理与源码解析》 《YOLOv3目标检测:网络模型改进方法》 敬请关注并选择学习!

u-boot-2015.07.tar.bz2

uboot-2015-07最新代码,喜欢的朋友请拿去

相关热词 c# 解析cad c#数字格式化万 c#int转byte c#格式化日期 c# wpf 表格 c# 实现ad域验证登录 c#心跳包机制 c#使用fmod.dll c#dll vb 调用 c# outlook
立即提问
相关内容推荐