Lib编译和使用的问题,帮忙解释一下,谢谢!

#include
#include
#include "..\Win32_Lib\lib.h"
#pragma comment(lib,"..\Debug\Win32_Lib.lib")

int main(int argc, char *argv[])
{
printf("Hello Word!--[%d]\n",MyAdd(1,2));
return 0;
}

运行后老是提示:error C3861: 'MyAdd': identifier not found

Lib:
#include "stdafx.h"
#define _MyLib_OWNER //这个一定要在lib.h之前,原因就是展开内容先代替
#include "lib.h"

MY_LIB_API int MyAdd(int a ,int b)
{
__asm
{
mov eax,eax;
mov eax,eax;
}
return (a+b);
}

lib.h
#ifdef _MyLib_OWNER
#define MY_LIB_API extern "C" __declspec(dllexport)
#else
#define MY_LIB_API extern "C" __declspec(dllimport)
#endif

int MyAdd();

9个回答

error C3861: 'MyAdd': identifier not found
从提示看是编译问题, 原因是你包含的头文件没有MyAdd方法

错误提示: 标识符没找到, 就是MyAdd这个标识符没有找到声明或者识别错误,如大小写不一致,或宏开关没打开等类似问题
欢迎追问。

cn8610000
Student_2017 lib.h 里面加上后,显示的是'MyAdd' : function does not take 2 arguments
大约 2 年之前 回复
qq_41666142
折腾的小飞 lib包里面没有包含MyAdd方法,所以报错了 .....
大约 2 年之前 回复
wanfustudio
飞哥 回复飞哥: 我说的是lib.h文件内,如未解决,可发送至wanfu.liu@163.com
大约 2 年之前 回复
wanfustudio
飞哥 回复Student_2017: #include "..\Win32_Lib\lib.h" 这个文件里面有呗 ?
大约 2 年之前 回复
cn8610000
Student_2017 lib里面包含了啊
大约 2 年之前 回复

lib包里面没有包含MyAdd方法,所以报错了

cn8610000
Student_2017 lib里面包含了这个方法啊
大约 2 年之前 回复

头文件的包含有问题,没有发现MyAdd类, 如果我回答正确就给我c币吧

lib包里面没有包含MyAdd方法,所以报错了 .....

没有发现MyAdd类

lib包里面没有包含MyAdd方法

缺少对类MyAdd的引用

lib包里面没有包含MyAdd方发

没有MyAdd的相关引用

Csdn user default icon
上传中...
上传图片
插入图片
抄袭、复制答案,以达到刷声望分或其他目的的行为,在CSDN问答是严格禁止的,一经发现立刻封号。是时候展现真正的技术了!
其他相关推荐
DLL文件包含自己生成的lib文件,编译错误
1. 我先用空项目 添加了lua的文件 生成了 lua.lib文件 2. 我创建了一个MFC_DLL文件 1)在项目->属性->C/C++->附加包含目录里包含了 lua所有.h .c的文件夹 2)在项目->属性->连接器->常规->附加库目录里包含了lua.lib的文件夹 3)在项目->属性->连接器->输入->附加依赖项里输入了lua.lib 我创建的 .h文件的代码 #infndef LUASSSS_H #define LUASSSS_H #include <windows.h> extern "C" { #include "lua.h" #include "lualib.h" #include "lauxlib.h" } extern lua_State *L; #endif 我创建的 .cpp文件的代码 #include "StdAfx.h" #include "Luassss.h" lua_State *L = luaL_newstate(); 代码显示无错误 但是编译的时候出现各种错误 请问是我哪里出错了????? 谢谢帮忙 我自己摸索了2天都没搞定 头都大了 error LNK2005: _strstr 已经在 libcmtd.lib(strstr.obj) 中定义 error LNK2005: _strchr 已经在 libcmtd.lib(strchr.obj) 中定义 error LNK2005: _fclose 已经在 libcmtd.lib(fclose.obj) 中定义 error LNK2005: _ferror 已经在 libcmtd.lib(feoferr.obj) 中定义 error LNK2005: _ungetc 已经在 libcmtd.lib(ungetc.obj) 中定义 error LNK2005: ___iob_func 已经在 libcmtd.lib(_file.obj) 中定义 error LNK2005: _fread 已经在 libcmtd.lib(fread.obj) 中定义 error LNK2005: _feof 已经在 libcmtd.lib(feoferr.obj) 中定义 error LNK2005: __errno 已经在 libcmtd.lib(dosmap.obj) 中定义 error LNK2005: _realloc 已经在 libcmtd.lib(dbgrealloc.obj) 中定义 error LNK2005: _free 已经在 libcmtd.lib(dbgfree.obj) 中定义 1>MSVCRTD.lib(MSVCR100D.dll) : error LNK2005: _exit 已经在 libcmtd.lib(crt0dat.obj) 中定义 1>MSVCRTD.lib(MSVCR100D.dll) : error LNK2005: _isspace 已经在 libcmtd.lib(_ctype.obj) 中定义 1>MSVCRTD.lib(MSVCR100D.dll) : error LNK2005: _strtoul 已经在 libcmtd.lib(strtol.obj) 中定义 1>MSVCRTD.lib(MSVCR100D.dll) : error LNK2005: _strtod 已经在 libcmtd.lib(strtod.obj) 中定义 1>MSVCRTD.lib(MSVCR100D.dll) : error LNK2005: _sprintf 已经在 libcmtd.lib(sprintf.obj) 中定义 1>MSVCRTD.lib(MSVCR100D.dll) : error LNK2005: _strcspn 已经在 libcmtd.lib(strcspn.obj) 中定义 1>MSVCRTD.lib(MSVCR100D.dll) : error LNK2005: _strcoll 已经在 libcmtd.lib(strcoll.obj) 中定义 1>MSVCRTD.lib(MSVCR100D.dll) : error LNK2005: _floor 已经在 libcmtd.lib(_floor_pentium4_.obj) 中定义 1>MSVCRTD.lib(MSVCR100D.dll) : error LNK2005: _iscntrl 已经在 libcmtd.lib(_ctype.obj) 中定义 1>MSVCRTD.lib(MSVCR100D.dll) : error LNK2005: _isalnum 已经在 libcmtd.lib(_ctype.obj) 中定义 1>MSVCRTD.lib(MSVCR100D.dll) : error LNK2005: _isalpha 已经在 libcmtd.lib(_ctype.obj) 中定义 1>MSVCRTD.lib(MSVCR100D.dll) : error LNK2005: _isdigit 已经在 libcmtd.lib(_ctype.obj) 中定义 1>MSVCRTD.lib(MSVCR100D.dll) : error LNK2005: _localeconv 已经在 libcmtd.lib(lconv.obj) 中定义 1>MSVCRTD.lib(ti_inst.obj) : error LNK2005: "private: __thiscall type_info::type_info(class type_info const &)" (??0type_info@@AAE@ABV0@@Z) 已经在 libcmtd.lib(typinfo.obj) 中定义 1>MSVCRTD.lib(ti_inst.obj) : error LNK2005: "private: class type_info & __thiscall type_info::operator=(class type_info const &)" (??4type_info@@AAEAAV0@ABV0@@Z) 已经在 libcmtd.lib(typinfo.obj) 中定义 1> 正在创建库 ..\test\testdll.lib 和对象 ..\test\testdll.exp 1>LINK : warning LNK4098: 默认库“MSVCRTD”与其他库的使用冲突;请使用 /NODEFAULTLIB:library 1>..\test\testdll.dll : fatal error LNK1169: 找到一个或多个多重定义的符号 1> 1>生成失败。 1> 1>已用时间 00:00:01.05 ========== 生成: 成功 0 个,失败 1 个,最新 0 个,跳过 0 个 ==========
关于Tomcat jar包问题,帮忙看下,不胜感激
今天在启动Tomcat时遇到了恼人的问题,请大家帮忙讲解一下。 环境:myEclipse tomcat 5.5; 有个javaee.jar和servlet-api.jar的包,是在tomcat的common下的lib里,但是我在MyEclipse里编写程序的时候需要用到servlet-api.jar里的类,否则无法编译;但是我把相应的包放到Classpath里,这样部署这个项目的时候,这两个包就会被发布到项目的lib目录下,这样启动tomcat时会出错,意思好像是不允许这两个包放到项目的lib目录里。 我现在的疑问是,但是我的程序编译不过去;如果程序编译过去了,tomcat不会启动成功,请教下这是什么问题; PS:如果把servlet-api包放到 tomcat的common的lib目录里,在编译程序的时候需要该jar包里的类 怎么办? 刚入门的人,对tomcat这里有点疑惑,请大家帮忙了,谢谢!!
vs2010 拒绝访问 无法打开lib dll error LNK1104
错误如图所示,我用的环境是VS2010,重新编译后还是这个问题,这个lib是我自己新建的。但是链接器里都配置好了。每次把电脑重启之后运行代码就能成功,可是运行个三四次后有出现这个问题了,不知道是怎么回事,还麻烦各位大神帮忙看一下,谢谢~![图片说明](https://img-ask.csdn.net/upload/201805/13/1526226918_840533.jpg)
android 源码中使用System.loadLibrary加载第三方库
我在android源码中编译一个apk,使用了几个第三方库文件,下面是Android.mk文件内容: LOCAL_PATH:= $(call my-dir) include $(CLEAR_VARS) LOCAL_MODULE_TAGS := debug optional eng LOCAL_SRC_FILES := $(call all-java-files-under, src) LOCAL_PACKAGE_NAME := SDLgui LOCAL_CERTIFICATE := platform LOCAL_JNI_SHARED_LIBRARIES := libbarcodereader libbarcodereader43 libbarcodereader44 libIAL libSDL include $(BUILD_PACKAGE) ################################################## include $(CLEAR_VARS) LOCAL_PREBUILT_LIBS := libs/armeabi/libbarcodereader.so \ libs/armeabi/libbarcodereader43.so \ libs/armeabi/libbarcodereader44.so \ libs/armeabi/libIAL.so \ libs/armeabi/libSDL.so LOCAL_MODULE_TAGS := debug optional eng include $(BUILD_MULTI_PREBUILT) # Use the following include to make our testapk. include $(callall-makefiles-under,$(LOCAL_PATH)) 编译OK,并且在out/.../system/lib/文件夹下和out/.../obj/lib/文件夹下生成了相应的库,但是APK在运行的时候报错,提示 java.lang.NoSuchFieldError: no field with name='mNativeContext' signature='I' in class Lcom/zebra/adc/decoder/BarCodeReader.... 定位到代码中是System.loadLibrary的地方报错。 请高手帮忙解答,谢谢!
从main函数进入执行编译java代码的方法与从servelet进入执行编译java代码的方法的区别
在tomcat用main执行代码 <br />public static void main(String[] args) throws Exception { <br /> compile(); <br /> <br /> } <br />private synchronized static File compile() throws Exception { <br /> String[] args = new String[] { "-d", System.getProperty("user.dir") , <br /> System.getProperty("user.dir") + "\\Model2007082016080001.java"}; <br /> System.out.println(System.getProperty("user.dir")); <br /> int status = javac.compile(args); <br /> System.out.println(status); <br /> return null; <br /> } <br />用上面的代码编译已经存在的java代码,java 代码用到的类包已经导进了工程,从main入口进入可以成功编译指定的java代码。 <br /> <br />但是在tomcat下执行servelet,执行compile()方法,就会编译失败,报错: <br />D:\Administrator\workspace\a\Model2007082016080001.java:3: 找不到符号 <br />符号: 类 AbstractPackedModel <br />位置: 软件包 com.tool.servelet <br />import com.tool.servelet.AbstractPackedModel; <br /> <br />不知道什么原因 <br /> <br /><br /><strong>问题补充</strong><br />System.getProperty("user.dir") 执行main函数的时候他的值是当前的工程目录,但是在执行servelet是他的值是tomcat下的bin目录,我用System.setProperty ("user.dir", "D:\\Administrator\\workspace\\a");它改成工程目录,运行还是报错。请大家帮忙!<br /><strong>问题补充</strong><br />我把类 AbstractPackedModel类所在的包路径放到classpath中,还是不行 <br /> <br />再看一次报错信息: <br />Source: D:\Administrator\workspace\a\Model2007082016080001.java <br />Message: D:\Administrator\workspace\a\Model2007082016080001.java:3: 找不到符号 <br />符号: 类 AbstractPackedModel <br />位置: 软件包 com.tool.servelet <br />Code: compiler.err.cant.resolve <br />Kind: ERROR <br />Position: 146 <br />Start Position: 146 <br />End Position: 165 <br />Source: D:\Administrator\workspace\a\Model2007082016080001.java <br />Message: D:\Administrator\workspace\a\Model2007082016080001.java:5: 找不到符号 <br />符号: 类 AbstractPackedModel <br />com.tool.servelet.Model2007082016080001 <br /> <br />根据报错信息,我认为是已经找到包了,但就是不能识别包里面的类,各位帮看看是不是这个问题<br /><strong>问题补充</strong><br /><div class="quote_title">flykete 写道</div><div class="quote_div"> 根据 <br />D:\Administrator\workspace\a\Model2007082016080001.java:3: 找不到符号 <br />符号: 类 AbstractPackedModel <br />位置: 软件包 com.tool.servelet <br />import com.tool.servelet.AbstractPackedModel; <br /> <br />可以知道在编译时,缺少环境变量,你加上-cp指定lib目录 试试</div> <br /> <br />具体应该怎么加,我的开发平台是myeclipse<br /><strong>问题补充:</strong><br />各位朋友帮帮忙,我已经搞了四天了,这个问题还没有解决,影响项目进度了。不管对不对,提提建议,谢谢!<br /><strong>问题补充:</strong><br />回答 qpzmal :不太懂log当中的"找不到符号"是指什么(找不到符号是指找不到类,但是能找到这个类所在的包);现在已经能正确取得你的工程目录地址了么?(我把地址给写死了,如果用方法System.getProperty("user.dir")取,从main函数进去执行方法,取的路径是工程的路径,但是从servelet进去取的路径是tomcat下的bin路径);把Model2007082016080001这个类改成最简单的helloworld,看能不能编译(还不能编译),谢谢qpzmal
ninja 和 VS2015编译caffe-windows失败
![失败截图](https://img-ask.csdn.net/upload/201807/15/1531650930_543226.png) 失败提示 Determining if the C compiler works failed with the following output: Change Dir: G:/Git/caffe/scripts/build/CMakeFiles/CMakeTmp Run Build Command:"C:/Users/TAO/Anaconda3/Library/bin/ninja.exe" "cmTC_55e72" [1/2] Building C object CMakeFiles\cmTC_55e72.dir\testCCompiler.c.obj [2/2] Linking C executable cmTC_55e72.exe FAILED: cmTC_55e72.exe cmd.exe /C "cd . && "C:\Program Files\CMake\bin\cmake.exe" -E vs_link_exe --intdir=CMakeFiles\cmTC_55e72.dir --manifests -- C:\PROGRA~2\MICROS~1.0\VC\bin\amd64\link.exe /nologo CMakeFiles\cmTC_55e72.dir\testCCompiler.c.obj /out:cmTC_55e72.exe /implib:cmTC_55e72.lib /pdb:cmTC_55e72.pdb /version:0.0 /machine:x64 /debug /INCREMENTAL /subsystem:console kernel32.lib user32.lib gdi32.lib winspool.lib shell32.lib ole32.lib oleaut32.lib uuid.lib comdlg32.lib advapi32.lib && cd ." RC Pass 1: command "rc /foCMakeFiles\cmTC_55e72.dir/manifest.res CMakeFiles\cmTC_55e72.dir/manifest.rc" failed (exit code 0) with the following output: The system cannot find the file specified ninja: build stopped: subcommand failed. 我的脚本是 :: Change the settings here to match your setup :: Change MSVC_VERSION to 12 to use VS 2013 if NOT DEFINED MSVC_VERSION set MSVC_VERSION=14 :: Change to 1 to use Ninja generator (builds much faster) if NOT DEFINED WITH_NINJA set WITH_NINJA=1 :: Change to 1 to build caffe without CUDA support if NOT DEFINED CPU_ONLY set CPU_ONLY=0 :: Change to generate CUDA code for one of the following GPU architectures :: [Fermi Kepler Maxwell Pascal All] if NOT DEFINED CUDA_ARCH_NAME set CUDA_ARCH_NAME=Auto :: Change to Debug to build Debug. This is only relevant for the Ninja generator the Visual Studio generator will generate both Debug and Release configs if NOT DEFINED CMAKE_CONFIG set CMAKE_CONFIG=Release :: Set to 1 to use NCCL if NOT DEFINED USE_NCCL set USE_NCCL=0 :: Change to 1 to build a caffe.dll if NOT DEFINED CMAKE_BUILD_SHARED_LIBS set CMAKE_BUILD_SHARED_LIBS=0 :: Change to 3 if using python 3.5 (only 2.7 and 3.5 are supported) if NOT DEFINED PYTHON_VERSION set PYTHON_VERSION=3 :: Change these options for your needs. if NOT DEFINED BUILD_PYTHON set BUILD_PYTHON=1 if NOT DEFINED BUILD_PYTHON_LAYER set BUILD_PYTHON_LAYER=1 if NOT DEFINED BUILD_MATLAB set BUILD_MATLAB=0 :: If python is on your path leave this alone if NOT DEFINED PYTHON_EXE set PYTHON_EXE=python :: Run the tests if NOT DEFINED RUN_TESTS set RUN_TESTS=0 :: Run lint if NOT DEFINED RUN_LINT set RUN_LINT=0 :: Build the install target if NOT DEFINED RUN_INSTALL set RUN_INSTALL=0 折腾一个星期也没弄出来,请大神帮忙看下,谢谢
我自己写了写了一个qwt的程序,想用交叉编译把程序移植到开发板上
谢谢帮忙!! 2、qwt的例子在交叉编译之后可以到开发板上运行。 1、问题:我在用ARM版的qmake之后再make出错,错误如下: /opt/FriendlyARM/toolschain/4.4.3/lib/gcc/arm-none-linux-gnueabi/4.4.3/../../../../arm-none-linux-gnueabi/bin/ld: warning: libQt5PrintSupport.so.5, needed by /usr/local/qwt-6.1.3/lib//libqwt.so, not found (try using -rpath or -rpath-link) /opt/FriendlyARM/toolschain/4.4.3/lib/gcc/arm-none-linux-gnueabi/4.4.3/../../../../arm-none-linux-gnueabi/bin/ld: warning: libQt5Svg.so.5, needed by /usr/local/qwt-6.1.3/lib//libqwt.so, not found (try using -rpath or -rpath-link) /opt/FriendlyARM/toolschain/4.4.3/lib/gcc/arm-none-linux-gnueabi/4.4.3/../../../../arm-none-linux-gnueabi/bin/ld: warning: libQt5Concurrent.so.5, needed by /usr/local/qwt-6.1.3/lib//libqwt.so, not found (try using -rpath or -rpath-link) /usr/local/qwt-6.1.3/lib//libqwt.so: undefined reference to `QSvgGenerator::setTitle(QString const&)@Qt_5' /usr/local/qwt-6.1.3/lib//libqwt.so: undefined reference to `QSvgRenderer::isValid() const@Qt_5' /usr/local/qwt-6.1.3/lib//libqwt.so: undefined reference to `QSvgGenerator::QSvgGenerator()@Qt_5' /usr/local/qwt-6.1.3/lib//libqwt.so: undefined reference to `QSvgGenerator::~QSvgGenerator()@Qt_5' /usr/local/qwt-6.1.3/lib//libqwt.so: undefined reference to `QPrinter::~QPrinter()@Qt_5' /usr/local/qwt-6.1.3/lib//libqwt.so: undefined reference to `QSvgGenerator::viewBoxF() const@Qt_5' /usr/local/qwt-6.1.3/lib//libqwt.so: undefined reference to `QPrinter::setFullPage(bool)@Qt_5' /usr/local/qwt-6.1.3/lib//libqwt.so: undefined reference to `QPrinter::setOutputFormat(QPrinter::OutputFormat)@Qt_5' /usr/local/qwt-6.1.3/lib//libqwt.so: undefined reference to `QPrinter::setDocName(QString const&)@Qt_5' /usr/local/qwt-6.1.3/lib//libqwt.so: undefined reference to `QSvgRenderer::load(QByteArray const&)@Qt_5' /usr/local/qwt-6.1.3/lib//libqwt.so: undefined reference to `QPrinter::setColorMode(QPrinter::ColorMode)@Qt_5' /usr/local/qwt-6.1.3/lib//libqwt.so: undefined reference to `QSvgRenderer::viewBoxF() const@Qt_5' /usr/local/qwt-6.1.3/lib//libqwt.so: undefined reference to `QPrinter::setPaperSize(QSizeF const&, QPrinter::Unit)@Qt_5' /usr/local/qwt-6.1.3/lib//libqwt.so: undefined reference to `QSvgRenderer::QSvgRenderer(QObject*)@Qt_5' /usr/local/qwt-6.1.3/lib//libqwt.so: undefined reference to `QPrinter::setOutputFileName(QString const&)@Qt_5' /usr/local/qwt-6.1.3/lib//libqwt.so: undefined reference to `QSvgGenerator::setFileName(QString const&)@Qt_5' /usr/local/qwt-6.1.3/lib//libqwt.so: undefined reference to `QSvgRenderer::setViewBox(QRectF const&)@Qt_5' /usr/local/qwt-6.1.3/lib//libqwt.so: undefined reference to `QSvgRenderer::render(QPainter*, QRectF const&)@Qt_5' /usr/local/qwt-6.1.3/lib//libqwt.so: undefined reference to `QSvgGenerator::setResolution(int)@Qt_5' /usr/local/qwt-6.1.3/lib//libqwt.so: undefined reference to `QPrinter::setResolution(int)@Qt_5' /usr/local/qwt-6.1.3/lib//libqwt.so: undefined reference to `QSvgRenderer::~QSvgRenderer()@Qt_5' /usr/local/qwt-6.1.3/lib//libqwt.so: undefined reference to `QSvgRenderer::load(QString const&)@Qt_5' /usr/local/qwt-6.1.3/lib//libqwt.so: undefined reference to `QSvgGenerator::setViewBox(QRectF const&)@Qt_5' /usr/local/qwt-6.1.3/lib//libqwt.so: undefined reference to `QPrinter::QPrinter(QPrinter::PrinterMode)@Qt_5' /usr/local/qwt-6.1.3/lib//libqwt.so: undefined reference to `QSvgRenderer::defaultSize() const@Qt_5' collect2: ld returned 1 exit status Makefile:170: recipe for target 'bishe_qwt1' failed make: *** [bishe_qwt1] Error 1
java web start发布应用之找不到webstart\*.java
我目前在学习《java核心技术基础卷1》的第十章部署应用程序和applet,在java web start 的学习过程中尝试发布一个计算器程序,按照书本的步骤,第一步是编译源程序,命令是: ``` javac -classpath .:/path/to/javaws,.jar webstart/*.java 接着命令行就提示错误:找不到文件 webstart\\*.java,然后我去jdk找确实没有webstart这个文件夹,但在jre/lib中有一个javaws.jar 包。百度上关于webstart命令行发布应用程序的资料也很少,找不到有用的。 请问是不是要怎样解决?麻烦各位大神帮帮忙。谢谢啦!
java中 包里存放的是类名.java 还是类名.class?
问题1 java中 包里存放的是类名.java 还是类名.class? 类名.java文件一定要放在所 属包目录下吗? 问题2.见下代码 package packb; public class DemoB { public static void main(String[] args) { System.out.println("Hello World!"); } } package packa; class DemoA { public static void main(String[] args) { packb.DemoB b = new packb.DemoB(); System.out.println("Hello World!"); } } DemoB.java 和 DemoA.java都存放在D:\延飞目录下; 现在问题为: 1.D:\>javac -d D:\延飞\myclass DemoB.java //把DemoB.java编译后生成的packb.DemoB.class文件放在了D:\延飞\myclass下; 2.D:\延飞>javac -d D:\延飞\myclass DemoA.java DemoA.java:6: 错误: 程序包packb不存在 packb.DemoB b = new packb.DemoB(); ^ DemoA.java:6: 错误: 程序包packb不存在 packb.DemoB b = new packb.DemoB(); ^ 2 个错误 // 疑问:2.1:这里为啥程序包packb不存在?这里的程序包packb指的是D:\延飞\my class下的packb.DemoB.class文件还是D:\延飞下的DemoB.java? 2.2假如程序包packb指的是D:\延飞\myclass下的packb.DemoB.class文 件,那么这已经是.class文件了,packb.DemoB b = new packb.DemoB();还能用吗?packb.DemoB b = new packb.DemoB();不是调用的DemoB.java文件吗? 2.3假如程序包packb指的是D:\延飞下的DemoB.java文件,那么DemoB.java不是也在D:\延飞下的吗,怎么会程序包packb不存在? 3.D:\延飞>set classpath= d:\延飞\myclass 3.1这里设置的classpath=d:\延飞\myclass和系统环境变量classpath有何关系,系统classpath设置的是.;%JAVA_HOME%\lib\dt.jar;%JAVA_HOME%\lib\tools.jar; 执行的时候是怎么顺序查找的? 4.D:\延飞>javac -d d:\延飞\myclass DemoA.java 编译通过了 以上疑问请各位大神帮忙分析下, 谢谢!
No init found:嵌入式Linux文件系统加载失败
**问题描述** 文件系统加载不成功,报错:No init found,如图(其中包含调试打印) ![图片说明](https://img-ask.csdn.net/upload/201805/11/1526049104_344764.jpg) **制作材料及过程** 硬件:s3c2440芯片,256M Nand Flash 软件:用了现成的boot,内核是2.6.32,busybox是1.13.3,编译器是arm-linux-gcc 4.4.3,文件映像制作工具为mkyaffs2image-128M(由于FLASH使用的是256M) 制作过程:编译内核、busybox,制作/dev/console和/dev/null的node,制作/lib库,编写/etc/inittab **初步分析** 编译均成功,从打印来看,boot成功引导内核,内核也已经起来了,且进入了kernel_init的init_post ![图片说明](https://img-ask.csdn.net/upload/201805/11/1526050478_566763.jpg) 也就是说,几个run_init_process函数都没跑成功,但文件系统中/sbin/init是存在的 ![图片说明](https://img-ask.csdn.net/upload/201805/11/1526050653_259645.jpg) 跟踪run_init_process函数:run_init_process-->kernel_execve-->do_execve-->count,是在count处出错了,我把argc打出来是-14 ![图片说明](https://img-ask.csdn.net/upload/201805/11/1526050937_427179.jpg) 进入count函数,发现时get_user出错了,EFAULT就是14 ![图片说明](https://img-ask.csdn.net/upload/201805/11/1526051012_294820.jpg) get_user是内核态用来从用户态读数据的函数,但里面已经是嵌入汇编代码了,实在分析不了了…… 哪位高手可以帮忙分析一下,或者以前碰到类似情况,知道如何解决的,谢谢!
使用Log4cxx日志输出至MySQL, 无法找到驱动错误
Hi, guys! 用log4cxx日志框架对log内容输出至数据库(MySQL)一直未成功,不知道是什么步骤出现了问题。希望大伙们能帮帮忙,或者有什么更好的日志系统可以推荐,谢谢各位了。 ^_^ --- **运行环境**: Ubuntu 12.04 32bit + Eclipse CDT **log4cxx** : apache-log4cxx-0.10.0 log4cxx支持两种ODBC选项(iODBC/unixODBC),这里选择了unixODBC形式进行管理 通过添加选项 ./configure --with-ODBC=unixODBC,编译通过. 之后对unixODBC的驱动和数据源进行配置,可以通过终端 _isql log4cxx_ 成功建立连接 但是代码中使用Log4cxx进行输出的时候一直报下面的错误 ``` log4cxx: Failed to connect to database. - [unixODBC][Driver Manager]Data source name not found, and no default driver specified ``` ``` 怀疑一: ``` > Ecplise中是否没有加环境变量; 查阅ODBC资料,在Eclipse中加入ODBCSYSINI,ODBCINSTINI,ODBCINI变量后,还是没有效果. ``` 怀疑二: ``` > log4cxx配置写的不对;这个有没有什么官方的写法,晕呐! --- 配置内容: **/etc/odbcinst.ini** ``` bash [MySQL] Description = MySQL Driver = /usr/lib/i386-linux-gnu/odbc/libmyodbc.so Setup = /usr/lib/i386-linux-gnu/odbc/libodbcmyS.so FileUsage = 1 ``` **/etc/odbc.ini** ``` c [log4cxx] Description = The Database for Logging System Trace = on TraceFile = stderr Driver = MySQL SERVER = localhost PORT = 3306 DATABASE = log USER = root PASSWORD = 56789 ``` **log4cxx.xml** ``` xml <appender name="OdbcMysqlAppender" class="org.apache.log4j.odbc.ODBCAppender"> <param name="URL" value="Driver={MySQL};Server=localhost;Database=log;User=root;Password=56789;" /> <layout class="org.apache.log4j.PatternLayout"> <param name="ConversionPattern" value="INSERT INTO logs (message) VALUES ('%d - %c - %p - %m')" /> </layout> </appender> <root> <priority value="all" /> <appender-ref ref="OdbcMysqlAppender" /> </root> ``` --- # 进展: ``` _Time: 20150702_ ``` 查看Log4cxx源码,采用数据库方式记录Log,使用的是ODBCAppender ``` src/main/cpp/odbcappender.cpp ``` 作者原先的代码采用的是 **SQLxxxW()** 进行DriverConnect和SQLExecDirect操作,根据ODBC的描述,有 **W** 修饰是采用Unicode编码方式。总之我一直陷在这,一直报找不到数据源。于是乎我将 ``` SQLxxxW() ``` 修改成 ``` SQLxxx() ``` 方式的调用,同时将原先``` SQLWCHAR ``` 修改成对应 ``` SQLCHAR ```,即采用非宽字节的操作方式,成功的找到数据源,并且可以进行调用。 不过这就导致了中文的问题了. **疑惑** 在odbcinst.ini中配置的Driver确实是libmyodbc5w.so,即驱动使用Unicode方式的呀! (*与之相对应的是libmyodbc5a.so*). 至今还不知道自己是哪里出错,作者不可能毫无依据的就采用 SQLxxxW() 形式进行ODBC连接的吧. --- 我在ODBCAppender.cpp中添加了 #define SQL_WCHART_CONVERT,否则make的时候过不去, 即 ``` c++ #if !defined(LOG4CXX) #define LOG4CXX 1 #endif #include <log4cxx/private/log4cxx_private.h> #if LOG4CXX_HAVE_ODBC #if defined(WIN32) || defined(_WIN32) #include <windows.h> #endif #define SQL_WCHART_CONVERT #include <sqlext.h> #endif ```
请教:为什么java的JDK安装不了???
在我的机子上安装jDK很正常,但是我给同学安装的时候就出现问题了 ,安装了很多次还是那样: 1.在我的机子上安装后有287M,但是在她机子上只有187M。 2.安装后javac测试通过 3.写一个代码,然后javac OODemo.java 编译通过,但是java OODemo的时候总是出现 : could not open 'D:\j2sdk\jre6\lib\i386\jvm.cfg',我安装在F盘后也还是出现这样的问题! 4.在path,classpath中配置加上\java\jdk1.6.0_17\jre\bin之后还是出现3那样的错误。 到底是怎么回事呀,哪位高手能帮忙解决下啊,小弟谢谢啦!!! [b]问题补充:[/b] 为什么在她的机子上安装后有187M但是在我的机子上有287M 呢?? [b]问题补充:[/b] 看来只有重装系统了,那个注册表好像改不过来了,jre就是装不上去啊
struts2源码调试问题
<p>我在myeclipse中新建了一个web工程测试struts2,把下载的struts2-core.jar的相关java源码加入到类路径中,目的是为工程中直接使用源码编译成的struts2-core.jar中的类,工程就不依赖lib库中的struts2-core.jar了。但我在struts2的相关java文件中打断点调试时,断点进入的地方并不是该java文件,而是其他工程中依赖的struts2-core.jar中的class,让我“Attach Source...”。我把有关struts2-core.jar的工程全部close掉,就可以正常debug到java文件里,这个现象一直未解决,还请大家帮忙看看,谢谢</p> <p><br> </p> <p> </p>
Jakarta-ORO问题,比较奇怪
开发环境:RAD 6.0 <br />JDK:1.3 <br />测试服务器:WAS 5.0测试服务器 <br />工程类型:web工程 <br /> <br />问题过程 <br />1)刚开始直接把Jakarta-ORO.jar导入到lib中,使用Jakarta-ORO Util.split()提示找不到类;但是直接在调用Util的类里面加main可以正确运行; <br />2)怀疑网上下载的Jakarta-ORO.jar有问题,自己重新打包,问题照旧; <br />3)删除jar,将Jakarta-ORO的源代码全部导入工程,同样有问题。。。而且debug的时候不能跟进Jakarta-ORO的源代码,提示找不到源 <br />4)将Util.java里面的方法原封不动的复制出来。。。无论直接加到我的类,还是新建类(和调用类同一个包和不同包都测了),都没有任何问题 <br />5)将Util.java改名,新建一个类(在Jakarta-ORO Util原来的包下面),原封不动复制Util的代码过去,还是有问题 <br /> <br />虽然可以通过复制代码出来暂时解决,但是总感觉奇怪,也想找出原因,为了这个东东测试了一天了,个人认为: <br />1)RAD bug? <br />2)Jakarta-ORO bug? <br />3)曾经怀疑是测试服务器缓存问题。。新建不同名字的工程,复制代码过去,新建测试服务器,问题照旧!!! <br /> <br />补充一点,只有使用Util这个类报错,其他Jakarta-ORO类正常 <br /> <br />确实找不出为什么了。。。请大家帮忙了,谢谢先<br /><strong>问题补充</strong><br />在CSDN上找到一个类似的问题 <br />http://topic.csdn.net/t/20021206/09/1236060.html <br /><div class="quote_title">引用</div><div class="quote_div"> <br />在使用jakarta-oro-2.0.6的时候,编写的一个测试程序,编译的时候通过,可是运行的时候,却报   <br />  java.lang.NoSuchMethodError   <br />    <br />  程序代码如下:(部分主要的)   <br />    <br />  public   static   void   main(String[]   args){   <br />          try{   <br />                  String   link="<img src="How_to_Trace" />   dsfasdfsda";   <br />                  String   regexForLink="\\[IMG\\](.[^\\[]*)\\[\\/IMG\\]";   <br />                  PatternCompiler   compiler   =   new   Perl5Compiler();   <br />                  Pattern   patternForLink=compiler.compile(regexForLink,Perl5Compiler.CASE_INSENSITIVE_MASK);   <br />                  PatternMatcher   matcher   =   new   Perl5Matcher();   <br />    <br />                  StringBuffer   sb   =   new   StringBuffer();   <br />                  int   i   =   Util.substitute(sb,   matcher,patternForLink,   <br />                                  new   Perl5Substitution("$1"),   <br />                                  link,   <br />                                  Util.SUBSTITUTE_ALL);   <br />                  System.out.println("   resultstr   =   "+sb.toString());           <br />          }catch(Exception   e){   <br />                  e.printStackTrace();   <br />          }   <br />  }   <br />    <br />  ----------------------   <br />          错误定位在int   i   =   Util.substitute(···)这一行。可是很奇怪的时候,编译的时候可以编译过去。运行的时候,再报告java.lang.NoSuchMethodError。   <br />          请问谁有解决办法? <br /></div><br /><strong>问题补充</strong><br />Jakarta-ORO 2.08的<br /><strong>问题补充:</strong><br />不仅是编译可以通过,在类里面加main测试都是正常的 <br /> <br />ClassPAth就更没有问题,我从来不会把jar丢classpath的<br /><strong>问题补充:</strong><br />在wen环境中运行 <br />无论测试环境还是部署后 <br /> <br /><br /><strong>问题补充:</strong><br />有的时候有些开发工具可能因为缓存等因素造成不能正确发布,故而测试了下载正式的环境,问题依旧<br /><strong>问题补充:</strong><br />都不可以。。。 <br /> <br />为了排除包的问题,我已经把包都删除了。。。我把oro的jar都删除了,直接从apache上down的源码丢工程里面的,运行的时候使用Java Applicaiotn测试都没有问题;如果在web环境运行都不可以,无论是RAD带的WAS5的测试环境还是在其他服务器上单独安装的WAS。。。而且调试的时候提示没有源代码!!!<br /><strong>问题补充:</strong><br />谢谢大家了 <br /> <br />是WAS里面有一个包里面打包了低版本的ORO的原因(IBM把别人的包直接丢自己包里面去了算不算违反license啊???!!!) <br /> <br />问题解决方法也很多: <br /> 1)Put jakarta-oro-2.0.8.jar "in front" in the classloader hierarchy: WebSphereConsole-&gt; server -&gt; Process Definitions -&gt; JVM -&gt; set classpath = path_including_jakarta-oro-2.0.8.jar <br />==因为这边部署环境比较复杂,在有全国各地哦系统跑,不到万不得已不采用这种方式 <br /> 2)修改Web的类引导优先级:同样修改WAS部署参数。。。暂时不考虑 <br />&nbsp; 3)最好被迫使用。。。。自己新建一个类,把两个版本ORO的差异的东西加进去。。。 <br /> <br /> <br />其实大家都帮我解决问题可,不过答案好像只能给一个人。。。。其他的朋友就有点对不住了哈,分给第一个了 <br /> <br />
error LNK1104: cannot open word2vec_inner.pyd'
windons实现Yang Liu的Topical Word Embeddings时,运行错误 TWE\test.py: import gensim sentence_word = gensim.models.word2vec.LineSentence("tmp/word.file") TWE\gensim\models\word2vec.py: try: raise ImportError # ignore for now from gensim_addons.models.word2vec_inner import train_sentence_sg, train_sentence_cbow, FAST_VERSION, train_sentence_topic except ImportError: try: # try to compile and use the faster cython version import pyximport print 'import pyximport' models_dir = os.path.dirname(__file__) or os.getcwd() print 'models_dir' pyximport.install(setup_args={"include_dirs": [models_dir, get_include()]}) print 'pyximport' # is the follow code's problem from word2vec_inner import train_sentence_sg, train_sentence_cbow, FAST_VERSION, train_sentence_topic print 'from word2vec' except: print 'except2' # failed... fall back to plain numpy (20-80x slower training than the above) FAST_VERSION = -1 def train_sentence_sg(model, sentence, alpha, work=None): ... def train_sentence_cbow(model, sentence, alpha, work=None, neu1=None): ... class Word2Vec(utils.SaveLoad): def __init__(self, sentences=None, size=100, alpha=0.025, window=5, min_count=5,sample=0, seed=1, workers=1, min_alpha=0.0001, sg=1, hs=1, negative=0, cbow_mean=0): ... def train(self, sentences, total_words=None, word_count=0, chunksize=100): if FAST_VERSION < 0: import warnings warnings.warn("Cython compilation failed, training will be slow. Do you have Cython installed? `pip install cython`") logger.info("training model with %i workers on %i vocabulary and %i features, " "using 'skipgram'=%s 'hierarchical softmax'=%s 'subsample'=%s and 'negative sampling'=%s" % (self.workers, len(self.vocab), self.layer1_size, self.sg, self.hs, self.sample, self.negative)) ... def worker_train(): if self.sg: job_words = sum(train_sentence_topic(self, sentence, alpha, work) for sentence in job) else: job_words = sum(train_sentence_cbow(self, sentence, alpha, work, neu1) for sentence in job) ... 运行train.py,出现以下错误: E:\Python27\python.exe D:/pycharm/TWE/TWE1/train.py wordmap.txt model-final.tassign 100 import pyximport models_dir pyximport word2vec_inner.c e:\python27\lib\site-packages\numpy\core\include\numpy\npy_1_7_deprecated_api.h(12) : Warning Msg: Using deprecated NumPy API, disable it by #defining NPY_NO_DEPRECATED_API NPY_1_7_API_VERSION C:\Users\hp\.pyxbld\temp.win32-2.7\Release\pyrex\gensim\models\word2vec_inner.c(15079) : warning C4244: 'initializing' : conversion from 'double' to 'float', possible loss of data C:\Users\hp\.pyxbld\temp.win32-2.7\Release\pyrex\gensim\models\word2vec_inner.c(15085) : warning C4244: 'initializing' : conversion from 'double' to 'float', possible loss of data LINK : fatal error LNK1104: cannot open file 'C:\Users\hp\.pyxbld\lib.win32-2.7\gensim\models\word2vec_inner.pyd' except2 Training the word vector... D:\pycharm\TWE\TWE1\gensim\models\word2vec.py:410: UserWarning: Cython compilation failed, training will be slow. Do you have Cython installed? `pip install cython` warnings.warn("Cython compilation failed, training will be slow. Do you have Cython installed? `pip install cython`") PROGRESS: at 100.00% words, alpha 0.02500, 2556 words/s Training the topic vector... D:\pycharm\TWE\TWE1\gensim\models\word2vec.py:882: UserWarning: Cython compilation failed, training will be slow. Do you have Cython installed? `pip install cython` warnings.warn("Cython compilation failed, training will be slow. Do you have Cython installed? `pip install cython`") Exception in thread Thread-23: Traceback (most recent call last): File "E:\Python27\lib\threading.py", line 801, in __bootstrap_inner self.run() File "E:\Python27\lib\threading.py", line 754, in run self.__target(*self.__args, **self.__kwargs) File "D:\pycharm\TWE\TWE1\gensim\models\word2vec.py", line 909, in worker_train job_words = sum(train_sentence_topic(self, sentence, alpha, work) for sentence in job) File "D:\pycharm\TWE\TWE1\gensim\models\word2vec.py", line 909, in <genexpr> job_words = sum(train_sentence_topic(self, sentence, alpha, work) for sentence in job) NameError: global name 'train_sentence_topic' is not defined Saving the topic vectors... Saving the word vectors... Process finished with exit code 0 我已经安装了Microsoft Visual C++ Compiler for Python 2.7和cython,而且我也用一个小的程序测试了cython是正确编译和安装了的,但是还是出现问题。按照这个博客上的测试了cython,然后按照一个博客运行的TWE程序。看了好久,总结了应该是在word2vec.py最开始导入不了train_sentence_sg, train_sentence_cbow, FAST_VERSION, train_sentence_to。但是为什么导入不了,总觉得不应该,我成功编译了pyx文件的,cython也是正确安装了的。到底是什么问题,有大神遇到过这个问题的吗?求大神帮忙,谢谢!急急急,在线等
关于ant跑覆盖率的问题
现在有一个项目是struts+spring+ibatis的架构。 需要用ant来批量跑junit和覆盖率,由于本人没有这方便的经验,一直没有调试出来。 希望有此经验者不吝赐教。如果手头有以前项目的成品,或者类似的东西的也请共享下,谢谢了! 现在编译是没有问题的,但是跑junit的时候case跑不过(eclipse下全成功. 没有跑通的case好像都是一个原因: private CnxLogger logger = CnxLogger.getLogger(VMBHDM001LogicImpl.class); 出nullpointException 请大家帮忙看看: &lt;target name="runtest" depends="instrument"&gt;&lt;delete dir="${junit.work.dir}"&gt;&lt;/delete&gt;&lt;mkdir dir="${junit.work.dir}"&gt;&lt;/mkdir&gt;&lt;delete dir="${junit.report.dir}"&gt;&lt;/delete&gt;&lt;mkdir dir="${junit.report.dir}"&gt;&lt;/mkdir&gt;&lt;junit printsummary="yes" fork="yes" dir="${project.test.dir}"&gt;&lt;!-- avoid error: Exception in thread "main" java.lang.ClassFormatError: LVTT entry for 'clazz' in .. --&gt;&lt;jvmarg line="-noverify"&gt;&lt;/jvmarg&gt;&lt;classpath location="${jcoverage.lib.dir}/jcoverage.jar"&gt;&lt;/classpath&gt;&lt;classpath location="${build.instrumented.dir}"&gt;&lt;/classpath&gt;&lt;classpath refid="classpath.run"&gt;&lt;/classpath&gt;&lt;classpath&gt;&lt;pathelement location="${build.classes.dir}"&gt;&lt;/pathelement&gt;&lt;/classpath&gt;&lt;formatter type="xml"&gt;&lt;/formatter&gt;&lt;batchtest todir="${junit.work.dir}"&gt;&lt;fileset dir="${build.classes.dir}"&gt;&lt;include name="**/base/**/*Test.class"&gt;&lt;/include&gt;&lt;include name="**/framework/**/*Test.class"&gt;&lt;/include&gt;&lt;/fileset&gt;&lt;/batchtest&gt;&lt;/junit&gt;&lt;junitreport&gt;&lt;fileset dir="${junit.work.dir}"&gt;&lt;include name="TEST-*.xml"&gt;&lt;/include&gt;&lt;/fileset&gt;&lt;report format="frames" todir="${junit.report.dir}"&gt;&lt;/report&gt;&lt;/junitreport&gt;&lt;/target&gt;
爬虫福利二 之 妹子图网MM批量下载
爬虫福利一:27报网MM批量下载    点击 看了本文,相信大家对爬虫一定会产生强烈的兴趣,激励自己去学习爬虫,在这里提前祝:大家学有所成! 目标网站:妹子图网 环境:Python3.x 相关第三方模块:requests、beautifulsoup4 Re:各位在测试时只需要将代码里的变量 path 指定为你当前系统要保存的路径,使用 python xxx.py 或IDE运行即可。
Java学习的正确打开方式
在博主认为,对于入门级学习java的最佳学习方法莫过于视频+博客+书籍+总结,前三者博主将淋漓尽致地挥毫于这篇博客文章中,至于总结在于个人,实际上越到后面你会发现学习的最好方式就是阅读参考官方文档其次就是国内的书籍,博客次之,这又是一个层次了,这里暂时不提后面再谈。博主将为各位入门java保驾护航,各位只管冲鸭!!!上天是公平的,只要不辜负时间,时间自然不会辜负你。 何谓学习?博主所理解的学习,它
程序员必须掌握的核心算法有哪些?
由于我之前一直强调数据结构以及算法学习的重要性,所以就有一些读者经常问我,数据结构与算法应该要学习到哪个程度呢?,说实话,这个问题我不知道要怎么回答你,主要取决于你想学习到哪些程度,不过针对这个问题,我稍微总结一下我学过的算法知识点,以及我觉得值得学习的算法。这些算法与数据结构的学习大多数是零散的,并没有一本把他们全部覆盖的书籍。下面是我觉得值得学习的一些算法以及数据结构,当然,我也会整理一些看过
大学四年自学走来,这些私藏的实用工具/学习网站我贡献出来了
大学四年,看课本是不可能一直看课本的了,对于学习,特别是自学,善于搜索网上的一些资源来辅助,还是非常有必要的,下面我就把这几年私藏的各种资源,网站贡献出来给你们。主要有:电子书搜索、实用工具、在线视频学习网站、非视频学习网站、软件下载、面试/求职必备网站。 注意:文中提到的所有资源,文末我都给你整理好了,你们只管拿去,如果觉得不错,转发、分享就是最大的支持了。 一、PDF搜索网站推荐 对于大部
linux系列之常用运维命令整理笔录
本博客记录工作中需要的linux运维命令,大学时候开始接触linux,会一些基本操作,可是都没有整理起来,加上是做开发,不做运维,有些命令忘记了,所以现在整理成博客,当然vi,文件操作等就不介绍了,慢慢积累一些其它拓展的命令,博客不定时更新 顺便拉下票,我在参加csdn博客之星竞选,欢迎投票支持,每个QQ或者微信每天都可以投5票,扫二维码即可,http://m234140.nofollow.ax.
比特币原理详解
一、什么是比特币 比特币是一种电子货币,是一种基于密码学的货币,在2008年11月1日由中本聪发表比特币白皮书,文中提出了一种去中心化的电子记账系统,我们平时的电子现金是银行来记账,因为银行的背后是国家信用。去中心化电子记账系统是参与者共同记账。比特币可以防止主权危机、信用风险。其好处不多做赘述,这一层面介绍的文章很多,本文主要从更深层的技术原理角度进行介绍。 二、问题引入  假设现有4个人
程序员接私活怎样防止做完了不给钱?
首先跟大家说明一点,我们做 IT 类的外包开发,是非标品开发,所以很有可能在开发过程中会有这样那样的需求修改,而这种需求修改很容易造成扯皮,进而影响到费用支付,甚至出现做完了项目收不到钱的情况。 那么,怎么保证自己的薪酬安全呢? 我们在开工前,一定要做好一些证据方面的准备(也就是“讨薪”的理论依据),这其中最重要的就是需求文档和验收标准。一定要让需求方提供这两个文档资料作为开发的基础。之后开发
网页实现一个简单的音乐播放器(大佬别看。(⊙﹏⊙))
今天闲着无事,就想写点东西。然后听了下歌,就打算写个播放器。 于是乎用h5 audio的加上js简单的播放器完工了。 欢迎 改进 留言。 演示地点跳到演示地点 html代码如下`&lt;!DOCTYPE html&gt; &lt;html&gt; &lt;head&gt; &lt;title&gt;music&lt;/title&gt; &lt;meta charset="utf-8"&gt
Python十大装B语法
Python 是一种代表简单思想的语言,其语法相对简单,很容易上手。不过,如果就此小视 Python 语法的精妙和深邃,那就大错特错了。本文精心筛选了最能展现 Python 语法之精妙的十个知识点,并附上详细的实例代码。如能在实战中融会贯通、灵活使用,必将使代码更为精炼、高效,同时也会极大提升代码B格,使之看上去更老练,读起来更优雅。 1. for - else 什么?不是 if 和 else 才
数据库优化 - SQL优化
前面一篇文章从实例的角度进行数据库优化,通过配置一些参数让数据库性能达到最优。但是一些“不好”的SQL也会导致数据库查询变慢,影响业务流程。本文从SQL角度进行数据库优化,提升SQL运行效率。 判断问题SQL 判断SQL是否有问题时可以通过两个表象进行判断: 系统级别表象 CPU消耗严重 IO等待严重 页面响应时间过长
2019年11月中国大陆编程语言排行榜
2019年11月2日,我统计了某招聘网站,获得有效程序员招聘数据9万条。针对招聘信息,提取编程语言关键字,并统计如下: 编程语言比例 rank pl_ percentage 1 java 33.62% 2 c/c++ 16.42% 3 c_sharp 12.82% 4 javascript 12.31% 5 python 7.93% 6 go 7.25% 7
通俗易懂地给女朋友讲:线程池的内部原理
餐厅的约会 餐盘在灯光的照耀下格外晶莹洁白,女朋友拿起红酒杯轻轻地抿了一小口,对我说:“经常听你说线程池,到底线程池到底是个什么原理?”我楞了一下,心里想女朋友今天是怎么了,怎么突然问出这么专业的问题,但做为一个专业人士在女朋友面前也不能露怯啊,想了一下便说:“我先给你讲讲我前同事老王的故事吧!” 大龄程序员老王 老王是一个已经北漂十多年的程序员,岁数大了,加班加不动了,升迁也无望,于是拿着手里
经典算法(5)杨辉三角
写在前面: 我是 扬帆向海,这个昵称来源于我的名字以及女朋友的名字。我热爱技术、热爱开源、热爱编程。技术是开源的、知识是共享的。 这博客是对自己学习的一点点总结及记录,如果您对 Java、算法 感兴趣,可以关注我的动态,我们一起学习。 用知识改变命运,让我们的家人过上更好的生活。 目录一、杨辉三角的介绍二、杨辉三角的算法思想三、代码实现1.第一种写法2.第二种写法 一、杨辉三角的介绍 百度
腾讯算法面试题:64匹马8个跑道需要多少轮才能选出最快的四匹?
昨天,有网友私信我,说去阿里面试,彻底的被打击到了。问了为什么网上大量使用ThreadLocal的源码都会加上private static?他被难住了,因为他从来都没有考虑过这个问题。无独有偶,今天笔者又发现有网友吐槽了一道腾讯的面试题,我们一起来看看。 腾讯算法面试题:64匹马8个跑道需要多少轮才能选出最快的四匹? 在互联网职场论坛,一名程序员发帖求助到。二面腾讯,其中一个算法题:64匹
面试官:你连RESTful都不知道我怎么敢要你?
面试官:了解RESTful吗? 我:听说过。 面试官:那什么是RESTful? 我:就是用起来很规范,挺好的 面试官:是RESTful挺好的,还是自我感觉挺好的 我:都挺好的。 面试官:… 把门关上。 我:… 要干嘛?先关上再说。 面试官:我说出去把门关上。 我:what ?,夺门而去 文章目录01 前言02 RESTful的来源03 RESTful6大原则1. C-S架构2. 无状态3.统一的接
为啥国人偏爱Mybatis,而老外喜欢Hibernate/JPA呢?
关于SQL和ORM的争论,永远都不会终止,我也一直在思考这个问题。昨天又跟群里的小伙伴进行了一番讨论,感触还是有一些,于是就有了今天这篇文。 声明:本文不会下关于Mybatis和JPA两个持久层框架哪个更好这样的结论。只是摆事实,讲道理,所以,请各位看官勿喷。 一、事件起因 关于Mybatis和JPA孰优孰劣的问题,争论已经很多年了。一直也没有结论,毕竟每个人的喜好和习惯是大不相同的。我也看
SQL-小白最佳入门sql查询一
一 说明 如果是初学者,建议去网上寻找安装Mysql的文章安装,以及使用navicat连接数据库,以后的示例基本是使用mysql数据库管理系统; 二 准备前提 需要建立一张学生表,列分别是id,名称,年龄,学生信息;本示例中文章篇幅原因SQL注释略; 建表语句: CREATE TABLE `student` ( `id` int(11) NOT NULL AUTO_INCREMENT, `
项目中的if else太多了,该怎么重构?
介绍 最近跟着公司的大佬开发了一款IM系统,类似QQ和微信哈,就是聊天软件。我们有一部分业务逻辑是这样的 if (msgType = "文本") { // dosomething } else if(msgType = "图片") { // doshomething } else if(msgType = "视频") { // doshomething } else { // dosho
【图解经典算法题】如何用一行代码解决约瑟夫环问题
约瑟夫环问题算是很经典的题了,估计大家都听说过,然后我就在一次笔试中遇到了,下面我就用 3 种方法来详细讲解一下这道题,最后一种方法学了之后保证让你可以让你装逼。 问题描述:编号为 1-N 的 N 个士兵围坐在一起形成一个圆圈,从编号为 1 的士兵开始依次报数(1,2,3…这样依次报),数到 m 的 士兵会被杀死出列,之后的士兵再从 1 开始报数。直到最后剩下一士兵,求这个士兵的编号。 1、方
致 Python 初学者
文章目录1. 前言2. 明确学习目标,不急于求成,不好高骛远3. 在开始学习 Python 之前,你需要做一些准备2.1 Python 的各种发行版2.2 安装 Python2.3 选择一款趁手的开发工具3. 习惯使用IDLE,这是学习python最好的方式4. 严格遵从编码规范5. 代码的运行、调试5. 模块管理5.1 同时安装了py2/py35.2 使用Anaconda,或者通过IDE来安装模
“狗屁不通文章生成器”登顶GitHub热榜,分分钟写出万字形式主义大作
一、垃圾文字生成器介绍 最近在浏览GitHub的时候,发现了这样一个骨骼清奇的雷人项目,而且热度还特别高。 项目中文名:狗屁不通文章生成器 项目英文名:BullshitGenerator 根据作者的介绍,他是偶尔需要一些中文文字用于GUI开发时测试文本渲染,因此开发了这个废话生成器。但由于生成的废话实在是太过富于哲理,所以最近已经被小伙伴们给玩坏了。 他的文风可能是这样的: 你发现,
程序员:我终于知道post和get的区别
IT界知名的程序员曾说:对于那些月薪三万以下,自称IT工程师的码农们,其实我们从来没有把他们归为我们IT工程师的队伍。他们虽然总是以IT工程师自居,但只是他们一厢情愿罢了。 此话一出,不知激起了多少(码农)程序员的愤怒,却又无可奈何,于是码农问程序员。 码农:你知道get和post请求到底有什么区别? 程序员:你看这篇就知道了。 码农:你月薪三万了? 程序员:嗯。 码农:你是怎么做到的? 程序员:
《程序人生》系列-这个程序员只用了20行代码就拿了冠军
你知道的越多,你不知道的越多 点赞再看,养成习惯GitHub上已经开源https://github.com/JavaFamily,有一线大厂面试点脑图,欢迎Star和完善 前言 这一期不算《吊打面试官》系列的,所有没前言我直接开始。 絮叨 本来应该是没有这期的,看过我上期的小伙伴应该是知道的嘛,双十一比较忙嘛,要值班又要去帮忙拍摄年会的视频素材,还得搞个程序员一天的Vlog,还要写BU
加快推动区块链技术和产业创新发展,2019可信区块链峰会在京召开
      11月8日,由中国信息通信研究院、中国通信标准化协会、中国互联网协会、可信区块链推进计划联合主办,科技行者协办的2019可信区块链峰会将在北京悠唐皇冠假日酒店开幕。   区块链技术被认为是继蒸汽机、电力、互联网之后,下一代颠覆性的核心技术。如果说蒸汽机释放了人类的生产力,电力解决了人类基本的生活需求,互联网彻底改变了信息传递的方式,区块链作为构造信任的技术有重要的价值。   1
程序员把地府后台管理系统做出来了,还有3.0版本!12月7号最新消息:已在开发中有github地址
第一幕:缘起 听说阎王爷要做个生死簿后台管理系统,我们派去了一个程序员…… 996程序员做的梦: 第一场:团队招募 为了应对地府管理危机,阎王打算找“人”开发一套地府后台管理系统,于是就在地府总经办群中发了项目需求。 话说还是中国电信的信号好,地府都是满格,哈哈!!! 经常会有外行朋友问:看某网站做的不错,功能也简单,你帮忙做一下? 而这次,面对这样的需求,这个程序员
网易云6亿用户音乐推荐算法
网易云音乐是音乐爱好者的集聚地,云音乐推荐系统致力于通过 AI 算法的落地,实现用户千人千面的个性化推荐,为用户带来不一样的听歌体验。 本次分享重点介绍 AI 算法在音乐推荐中的应用实践,以及在算法落地过程中遇到的挑战和解决方案。 将从如下两个部分展开: AI 算法在音乐推荐中的应用 音乐场景下的 AI 思考 从 2013 年 4 月正式上线至今,网易云音乐平台持续提供着:乐屏社区、UGC
【技巧总结】位运算装逼指南
位算法的效率有多快我就不说,不信你可以去用 10 亿个数据模拟一下,今天给大家讲一讲位运算的一些经典例子。不过,最重要的不是看懂了这些例子就好,而是要在以后多去运用位运算这些技巧,当然,采用位运算,也是可以装逼的,不信,你往下看。我会从最简单的讲起,一道比一道难度递增,不过居然是讲技巧,那么也不会太难,相信你分分钟看懂。 判断奇偶数 判断一个数是基于还是偶数,相信很多人都做过,一般的做法的代码如下
日均350000亿接入量,腾讯TubeMQ性能超过Kafka
整理 | 夕颜出品 | AI科技大本营(ID:rgznai100) 【导读】近日,腾讯开源动作不断,相继开源了分布式消息中间件TubeMQ,基于最主流的 OpenJDK8开发的
8年经验面试官详解 Java 面试秘诀
    作者 | 胡书敏 责编 | 刘静 出品 | CSDN(ID:CSDNnews) 本人目前在一家知名外企担任架构师,而且最近八年来,在多家外企和互联网公司担任Java技术面试官,前后累计面试了有两三百位候选人。在本文里,就将结合本人的面试经验,针对Java初学者、Java初级开发和Java开发,给出若干准备简历和准备面试的建议。   Java程序员准备和投递简历的实
面试官如何考察你的思维方式?
1.两种思维方式在求职面试中,经常会考察这种问题:北京有多少量特斯拉汽车? 某胡同口的煎饼摊一年能卖出多少个煎饼? 深圳有多少个产品经理? 一辆公交车里能装下多少个乒乓球? 一
so easy! 10行代码写个"狗屁不通"文章生成器
前几天,GitHub 有个开源项目特别火,只要输入标题就可以生成一篇长长的文章。背后实现代码一定很复杂吧,里面一定有很多高深莫测的机器学习等复杂算法不过,当我看了源代码之后这程序不到50
知乎高赞:中国有什么拿得出手的开源软件产品?(整理自本人原创回答)
知乎高赞:中国有什么拿得出手的开源软件产品? 在知乎上,有个问题问“中国有什么拿得出手的开源软件产品(在 GitHub 等社区受欢迎度较好的)?” 事实上,还不少呢~ 本人于2019.7.6进行了较为全面的 回答 - Bravo Yeung,获得该问题下回答中得最高赞(236赞和1枚专业勋章),对这些受欢迎的 Github 开源项目分类整理如下: 分布式计算、云平台相关工具类 1.SkyWalk
MySQL数据库总结
文章目录一、数据库简介二、MySQL数据类型(5.5版本)三、Sql语句(1)Sql语句简介(2)数据定义语言DDLcreate,alter,drop(3)数据操纵语言DMLupdate,insert,delete(4)数据控制语言DCLgrant,revoke(5)数据查询语言DQLselect(6)分组查询与分页查询group by,limit四、完整性约束(单表)五、多表查询六、MySQL数
相关热词 c# clr dll c# 如何orm c# 固定大小的字符数组 c#框架设计 c# 删除数据库 c# 中文文字 图片转 c# 成员属性 接口 c#如何将程序封装 16进制负数转换 c# c#练手项目
立即提问