error LNK1104: cannot open word2vec_inner.pyd' 5C

windons实现Yang Liu的Topical Word Embeddings时,运行错误
TWE\test.py:

import gensim
sentence_word = gensim.models.word2vec.LineSentence("tmp/word.file")

TWE\gensim\models\word2vec.py:

try:
    raise ImportError  # ignore for now
    from gensim_addons.models.word2vec_inner import train_sentence_sg, train_sentence_cbow, FAST_VERSION, train_sentence_topic
except ImportError:
    try:
        # try to compile and use the faster cython version
        import pyximport
        print 'import pyximport'
        models_dir = os.path.dirname(__file__) or os.getcwd()
        print 'models_dir'
        pyximport.install(setup_args={"include_dirs": [models_dir, get_include()]})
        print 'pyximport'   # is the follow code's problem
        from word2vec_inner import train_sentence_sg, train_sentence_cbow, FAST_VERSION, train_sentence_topic
        print 'from word2vec'
    except:
        print 'except2'
        # failed... fall back to plain numpy (20-80x slower training than the above)
        FAST_VERSION = -1

        def train_sentence_sg(model, sentence, alpha, work=None):
                                                          ...
                def train_sentence_cbow(model, sentence, alpha, work=None, neu1=None):
                                                           ...
class Word2Vec(utils.SaveLoad):
    def __init__(self, sentences=None, size=100, alpha=0.025, window=5, min_count=5,sample=0, seed=1, workers=1, min_alpha=0.0001, sg=1, hs=1, negative=0, cbow_mean=0):
                                                          ...
    def train(self, sentences, total_words=None, word_count=0, chunksize=100):
                if FAST_VERSION < 0:
                        import warnings
            warnings.warn("Cython compilation failed, training will be slow. Do you have Cython installed? `pip install cython`")
            logger.info("training model with %i workers on %i vocabulary and %i features, "
             "using 'skipgram'=%s 'hierarchical softmax'=%s 'subsample'=%s and 'negative sampling'=%s" %
              (self.workers, len(self.vocab), self.layer1_size, self.sg, self.hs, self.sample, self.negative))
                                                                   ...
        def worker_train():
                        if self.sg:
                job_words = sum(train_sentence_topic(self, sentence, alpha, work) for sentence in job)
            else:
                job_words = sum(train_sentence_cbow(self, sentence, alpha, work, neu1) for sentence in job)
                                                                          ...

运行train.py,出现以下错误:

E:\Python27\python.exe D:/pycharm/TWE/TWE1/train.py wordmap.txt model-final.tassign 100
import pyximport
models_dir
pyximport
word2vec_inner.c
e:\python27\lib\site-packages\numpy\core\include\numpy\npy_1_7_deprecated_api.h(12) : Warning Msg: Using deprecated NumPy API, disable it by #defining NPY_NO_DEPRECATED_API NPY_1_7_API_VERSION
C:\Users\hp\.pyxbld\temp.win32-2.7\Release\pyrex\gensim\models\word2vec_inner.c(15079) : warning C4244: 'initializing' : conversion from 'double' to 'float', possible loss of data
C:\Users\hp\.pyxbld\temp.win32-2.7\Release\pyrex\gensim\models\word2vec_inner.c(15085) : warning C4244: 'initializing' : conversion from 'double' to 'float', possible loss of data
LINK : fatal error LNK1104: cannot open file 'C:\Users\hp\.pyxbld\lib.win32-2.7\gensim\models\word2vec_inner.pyd'
except2
Training the word vector...
D:\pycharm\TWE\TWE1\gensim\models\word2vec.py:410: UserWarning: Cython compilation failed, training will be slow. Do you have Cython installed? `pip install cython`
warnings.warn("Cython compilation failed, training will be slow. Do you have Cython installed? `pip install cython`")
PROGRESS: at 100.00% words, alpha 0.02500, 2556 words/s
Training the topic vector...
D:\pycharm\TWE\TWE1\gensim\models\word2vec.py:882: UserWarning: Cython compilation failed, training will be slow. Do you have Cython installed? `pip install cython`
warnings.warn("Cython compilation failed, training will be slow. Do you have Cython installed? `pip install cython`")
Exception in thread Thread-23:
Traceback (most recent call last):
File "E:\Python27\lib\threading.py", line 801, in __bootstrap_inner
self.run()
File "E:\Python27\lib\threading.py", line 754, in run
    self.__target(*self.__args, **self.__kwargs)
File "D:\pycharm\TWE\TWE1\gensim\models\word2vec.py", line 909, in worker_train
job_words = sum(train_sentence_topic(self, sentence, alpha, work) for sentence in job)
File "D:\pycharm\TWE\TWE1\gensim\models\word2vec.py", line 909, in <genexpr>
job_words = sum(train_sentence_topic(self, sentence, alpha, work) for sentence in job)
NameError: global name 'train_sentence_topic' is not defined

Saving the topic vectors...
Saving the word vectors...

Process finished with exit code 0

我已经安装了Microsoft Visual C++ Compiler for Python 2.7和cython,而且我也用一个小的程序测试了cython是正确编译和安装了的,但是还是出现问题。按照这个博客上的测试了cython,然后按照一个博客运行的TWE程序。看了好久,总结了应该是在word2vec.py最开始导入不了train_sentence_sg, train_sentence_cbow, FAST_VERSION, train_sentence_to。但是为什么导入不了,总觉得不应该,我成功编译了pyx文件的,cython也是正确安装了的。到底是什么问题,有大神遇到过这个问题的吗?求大神帮忙,谢谢!急急急,在线等

1个回答

Csdn user default icon
上传中...
上传图片
插入图片
抄袭、复制答案,以达到刷声望分或其他目的的行为,在CSDN问答是严格禁止的,一经发现立刻封号。是时候展现真正的技术了!
其他相关推荐
fatal error LNK1104:cannot open file".各种.lib"怎么办

MFC程序在别的机器上可以跑,到我这VC6.0组建程序时总是出现fatal error LNK1104:cannot open file "*****.lib",比如,我每次都根据错误提示添加对应的a.lib文件,一组建又会出现cannot open file“b.lib”,添加了b.lib,又出现cannot open file“c.lib”……我是新手请前辈指教

Python如何解决error LNK1104: 无法打开文件python34_d.lib这个问题

解决 error LNK1104: 无法打开文件“python34_d.lib”

LINK : fatal error LNK1104: cannot open file "APS_168.lib"

![图片说明](https://img-ask.csdn.net/upload/201906/05/1559705382_371282.png) 按步骤进行了动态链接库调用,compile没有问题,但是build的时候就出现了这个错误(错误语句如下),是怎么回事? LINK : fatal error LNK1104: cannot open file "APS_168.lib"

在qtcreator下出现LINK : fatal error LNK1104: 无法打开文件“opencv_core.lib”

在网上找了好多解决方法都没能把问题解决~在debug下出现这种问题,查看qtcreator的opencv配置也没有什么问题啊 配置添加如下: INCLUDEPATH+=D:\OpenCV\opencv\build\include\opencv2\ D:\OpenCV\opencv\build\include\opencv\ D:\OpenCV\opencv\build\include CONFIG(release,debug|release) { LIBS+=D:\OpenCV\opencv\build\x86\vc10\lib\opencv_calib3d246.lib\ D:\OpenCV\opencv\build\x86\vc10\lib\opencv_contrib246.lib\ D:\OpenCV\opencv\build\x86\vc10\lib\opencv_core246.lib\ D:\OpenCV\opencv\build\x86\vc10\lib\opencv_features2d246.lib\ D:\OpenCV\opencv\build\x86\vc10\lib\opencv_flann246.lib\ D:\OpenCV\opencv\build\x86\vc10\lib\opencv_gpu246.lib\ D:\OpenCV\opencv\build\x86\vc10\lib\opencv_highgui246.lib\ D:\OpenCV\opencv\build\x86\vc10\lib\opencv_imgproc246.lib\ D:\OpenCV\opencv\build\x86\vc10\lib\opencv_legacy246.lib\ D:\OpenCV\opencv\build\x86\vc10\lib\opencv_ml246.lib\ D:\OpenCV\opencv\build\x86\vc10\lib\opencv_objdetect246.lib\ D:\OpenCV\opencv\build\x86\vc10\lib\opencv_ts246.lib\ D:\OpenCV\opencv\build\x86\vc10\lib\opencv_video246.lib } CONFIG(debug,debug|release) { LIBS+=D:\OpenCV\opencv\build\x86\vc10\lib\opencv_calib3d246d.lib\ D:\OpenCV\opencv\build\x86\vc10\lib\opencv_contrib246d.lib\ D:\OpenCV\opencv\build\x86\vc10\lib\opencv_core246d.lib\ D:\OpenCV\opencv\build\x86\vc10\lib\opencv_features2d246d.lib\ D:\OpenCV\opencv\build\x86\vc10\lib\opencv_flann246d.lib\ D:\OpenCV\opencv\build\x86\vc10\lib\opencv_gpu246d.lib\ D:\OpenCV\opencv\build\x86\vc10\lib\opencv_highgui246d.lib\ D:\OpenCV\opencv\build\x86\vc10\lib\opencv_imgproc246d.lib\ D:\OpenCV\opencv\build\x86\vc10\lib\opencv_legacy246d.lib\ D:\OpenCV\opencv\build\x86\vc10\lib\opencv_ml246d.lib\ D:\OpenCV\opencv\build\x86\vc10\lib\opencv_objdetect246d.lib\ D:\OpenCV\opencv\build\x86\vc10\lib\opencv_ts246d.lib\ D:\OpenCV\opencv\build\x86\vc10\lib\opencv_video246d.lib }

请问在VSC++2010如何解决1>LINK : fatal error LNK1104: 无法打开文件“.lib”的问题?

一开始的问题是 _**MSVCRTD.lib(crtexew.obj) : error LNK2019: 无法解析的外部符号 _WinMain@16,该符号在函数 ___tmainCRTStartup 中被引用 1>C:\Users\19864\documents\visual studio 2010\Projects\7.14试验\Debug\7.14试验.exe : fatal error LNK1120: 1 个无法解析的外部命令_ 然后在链接器命令行中添加了.lib结果又出现了 fatal error LNK1104: 无法打开文件“.lib”的问题请问如何解决

LNK1181:cannot open input file "m.lib"

python setup.py install 安装模块时出现LNK1181:cannot open input file "m.lib" ![图片说明](https://img-ask.csdn.net/upload/201604/25/1461572121_430116.png) 使用setup.py安装https://github.com/coreylynch/pyFM上第三方模块时出的问题,求大神解答一下。。

error LNK2019: 无法解析的外部符号 __imp__RoInitialize@4

在VS2017里面写Qt5.9.2的项目,创建了一个新的Qt GUI 的项目, 但是却发现有一个关于怀疑.lib有关的问题。 具体错误如下: 1>qtmaind.lib(qtmain_winrt.obj) : error LNK2019: 无法解析的外部符号 __imp__RoInitialize@4,该符号在函数 _WinMain@16 中被引用 1>qtmaind.lib(qtmain_winrt.obj) : error LNK2019: 无法解析的外部符号 __imp__RoGetActivationFactory@12,该符号在函数 "public: __thiscall AppContainer::AppContainer(void)" (??0AppContainer@@QAE@XZ) 中被引用 1>qtmaind.lib(qtmain_winrt.obj) : error LNK2019: 无法解析的外部符号 _WindowsCreateStringReference@16,该符号在函数 "private: void __thiscall Microsoft::WRL::Wrappers::HStringReference::CreateReference(wchar_t const *,unsigned int,unsigned int)" (?CreateReference@HStringReference@Wrappers@WRL@Microsoft@@AAEXPB_WII@Z) 中被引用 1>qtmaind.lib(qtmain_winrt.obj) : error LNK2019: 无法解析的外部符号 _WindowsDeleteString@4,该符号在函数 "public: void __thiscall Microsoft::WRL::Wrappers::HString::Release(void)" (?Release@HString@Wrappers@WRL@Microsoft@@QAEXXZ) 中被引用 1>qtmaind.lib(qtmain_winrt.obj) : error LNK2019: 无法解析的外部符号 _WindowsGetStringRawBuffer@8,该符号在函数 "public: wchar_t const * __thiscall Microsoft::WRL::Wrappers::HString::GetRawBuffer(unsigned int *)const " (?GetRawBuffer@HString@Wrappers@WRL@Microsoft@@QBEPB_WPAI@Z) 中被引用 1>qtmaind.lib(qtmain_winrt.obj) : error LNK2019: 无法解析的外部符号 _RoOriginateError@8,该符号在函数 "public: static void __cdecl Microsoft::WRL::ErrorHelper<0>::OriginateError(long,struct HSTRING__ *)" (?OriginateError@?$ErrorHelper@$0A@@WRL@Microsoft@@SAXJPAUHSTRING__@@@Z) 中被引用 1>D:\New Projects\VS_Project\QtGuiApplication7\Win32\Debug\\QtGuiApplication7.exe : fatal error LNK1120: 6 个无法解析的外部命令 1>已完成生成项目“QtGuiApplication7.vcxproj”的操作 - 失败。 ========== 生成: 成功 0 个,失败 1 个,最新 0 个,跳过 0 个 ========== 在这里以其中一条具体的为例子:1>qtmaind.lib(qtmain_winrt.obj) : error LNK2019: 无法解析的外部符号 __imp__RoInitialize@4,该符号在函数 _WinMain@16 中被引用 ## **百度许多文章,发现大部分都是说缺少对应得.lib或者.h的文件, 但是我查看该项目的属性,发现是有qtmaind.lib这个库的,但是问什么还是有错误呢?** ![图片说明](https://img-ask.csdn.net/upload/201711/21/1511253927_913872.png) ![图片说明](https://img-ask.csdn.net/upload/201711/21/1511253940_181810.png) ![图片说明](https://img-ask.csdn.net/upload/201711/21/1511253949_303532.png) 百思不得七姐~~ 有没有大牛可以指点一下》》》

遇到蛋疼的:error LNK2001:

1>libcrypto.lib(ui_openssl.obj) : error LNK2001: 无法解析的外部符号 __acrt_iob_func 1>libcrypto.lib(eng_openssl.obj) : error LNK2001: 无法解析的外部符号 __acrt_iob_func 1>libcrypto.lib(e_capi.obj) : error LNK2001: 无法解析的外部符号 __acrt_iob_func 1>libcrypto.lib(pem_lib.obj) : error LNK2001: 无法解析的外部符号 __acrt_iob_func 1>libcrypto.lib(ui_openssl.obj) : error LNK2001: 无法解析的外部符号 __stdio_common_vfprintf 1>libcrypto.lib(eng_openssl.obj) : error LNK2001: 无法解析的外部符号 __stdio_common_vfprintf 1>libcrypto.lib(pem_lib.obj) : error LNK2001: 无法解析的外部符号 __stdio_common_vfprintf 1>libcrypto.lib(dso_win32.obj) : error LNK2001: 无法解析的外部符号 __stdio_common_vsprintf 1>libcrypto.lib(cryptlib.obj) : error LNK2001: 无法解析的外部符号 __stdio_common_vsprintf 1>libcrypto.lib(cryptlib.obj) : error LNK2001: 无法解析的外部符号 __stdio_common_vswprintf 1>libcrypto.lib(cryptlib.obj) : error LNK2001: 无法解析的外部符号 __stdio_common_vsscanf 1>libcrypto.lib(v3_utl.obj) : error LNK2001: 无法解析的外部符号 __stdio_common_vsscanf 1>libcurl.lib(gzlib.obj) : error LNK2001: 无法解析的外部符号 __imp___stdio_common_vsprintf 1>libcurl.lib(gzwrite.obj) : error LNK2001: 无法解析的外部符号 __imp___stdio_common_vsprintf 1>libcurl.lib(mprintf.obj) : error LNK2001: 无法解析的外部符号 __imp___stdio_common_vsprintf 1>libcurl.lib(cookie.obj) : error LNK2001: 无法解析的外部符号 __imp___acrt_iob_func 1>libcurl.lib(url.obj) : error LNK2001: 无法解析的外部符号 __imp___acrt_iob_func 1>libcurl.lib(mprintf.obj) : error LNK2001: 无法解析的外部符号 __imp___acrt_iob_func 1>libcurl.lib(formdata.obj) : error LNK2001: 无法解析的外部符号 __imp___acrt_iob_func 1>libcurl.lib(imap.obj) : error LNK2001: 无法解析的外部符号 __imp___stdio_common_vsscanf 1>libcurl.lib(ftp.obj) : error LNK2001: 无法解析的外部符号 __imp___stdio_common_vsscanf 1>libcurl.lib(http_proxy.obj) : error LNK2001: 无法解析的外部符号 __imp___stdio_common_vsscanf 1>libcurl.lib(http.obj) : error LNK2001: 无法解析的外部符号 __imp___stdio_common_vsscanf 1>libcurl.lib(parsedate.obj) : error LNK2001: 无法解析的外部符号 __imp___stdio_common_vsscanf 1>libcurl.lib(telnet.obj) : error LNK2001: 无法解析的外部符号 __imp___stdio_common_vsscanf 1>libcurl.lib(rtsp.obj) : error LNK2001: 无法解析的外部符号 __imp___stdio_common_vsscanf 1>libcurl.lib(cookie.obj) : error LNK2001: 无法解析的外部符号 __imp___stdio_common_vsscanf 1>libcurl.lib(hostip.obj) : error LNK2001: 无法解析的外部符号 __imp___stdio_common_vsscanf 1>libcurl.lib(url.obj) : error LNK2001: 无法解析的外部符号 __imp___stdio_common_vsscanf 1>libcurl.lib(transfer.obj) : error LNK2001: 无法解析的外部符号 __imp___stdio_common_vsscanf 在网上找到一些方法:::添加过两个库文件,。,,也设置过多线程/mtd启动,,,也添加过BUILDING_LIBCURL。。。都不好使。。。依然出现这个错误,,是怎么回事???(VS2013)

fatal error LNK1104: 无法打开文件“mfc80d.lib”

为什么在实验室的电脑上用vs2008编译链接成功的工程,到家里的电脑上就不能运行呢,还要格式转换,明明都是vs2008啊。。。。奇怪,格式转换就算了吧,转了以后,链接的时候还提示fatal error LNK1104: 无法打开文件“mfc80d.lib”。。。。为什么啊,明明已经添加了这个库了啊,真是郁闷啊,哪位大神能说下原因的啊?

MSVCRT.lib(exe_main.obj) : error LNK2001: 无法解析的外部符号 main?

当在第三个项目中添加Test.cpp文件时,会出现:“error LNK2001: 无法解析的外部符号 main?”![图片说明](https://img-ask.csdn.net/upload/201810/10/1539137417_54419.png)

VS2013配置VOSM时,遇到error LNK2038: 检测到“_MSC_VER”的不匹配

全问题如下: 错误 11 error LNK2038: 检测到“_MSC_VER”的不匹配项: 值“1600”不匹配值“1800”(smfitting.obj 中) C:\Users\Administrator\Desktop\VOSM\vosm\vosm-0.3.3 -19\tests\test_smfitting\smfitting.lib(VO_FittingAFM.obj) test_smfitting ![图片说明](https://img-ask.csdn.net/upload/201507/22/1437552943_608765.jpg) 我正在用VS2013调试VOSM-0.3.3,原来的工程是VS2010,遇到了这个问题,网上查是因为版本不兼容。请问怎样才能不整体重建的修复这个问题··谢谢各位! 另外 谁有已经配置好的VS2013下的VOSM项目,求代码,谢谢!

一个汇编语言的问题,在进行汇编文件的link操作的时候报错:LINK : error LNK2001: unresolved external symbol _WinMainCRTStartup

错误详细信息如下: LINK : error LNK2001: unresolved external symbol _WinMainCRTStartup q1.exe : fatal error LNK1120: 1 unresolved externals 下图是进行link的截图 ![图片说明](https://img-ask.csdn.net/upload/201911/28/1574916033_420319.png) 下图是源代码全部截图 ![图片说明](https://img-ask.csdn.net/upload/201911/28/1574916077_242222.png) 在masm的editor里点击任何按钮都没反应,所以选择cmd进行操作,出现如上错误,求汇编大佬帮忙,马上就要交实验报告了

c++boost库编译出问题

1> Assuming _WIN32_WINNT=0x0501 (i.e. Windows XP target). 1>libboost_thread-vc100-mt-1_49.lib(thread.obj) : error LNK2038: 检测到“_ITERATOR_DEBUG_LEVEL”的不匹配项: 值“0”不匹配值“2”(main.obj 中) 1>libboost_thread-vc100-mt-1_49.lib(tss_pe.obj) : error LNK2038: 检测到“_ITERATOR_DEBUG_LEVEL”的不匹配项: 值“0”不匹配值“2”(main.obj 中) 1>libboost_system-vc100-mt-1_49.lib(error_code.obj) : error LNK2038: 检测到“_ITERATOR_DEBUG_LEVEL”的不匹配项: 值“0”不匹配值“2”(main.obj 中) 1>LINK : warning LNK4098: 默认库“MSVCRT”与其他库的使用冲突;请使用 /NODEFAULTLIB:library 1>F:\myworkspace\code\cocos2d-x\3DGameWithForServer\Debug\3DGameWithForServer.exe : fatal error LNK1319: 检测到 3 个不匹配项 1> 1>生成失败。

error LNK2038: _MSC_VER”的不匹配项: 值“1800”不匹配值“1900”

使用vs2017,opencv3.0.0。代码没有错误,为什么会报错 而且我看了一下网上的资料,很多都是高版本不匹配低版本 ![图片说明](https://img-ask.csdn.net/upload/201704/18/1492510225_638772.png) 这是我的配置目录,并没有V120可选 ![图片说明](https://img-ask.csdn.net/upload/201704/18/1492510295_544003.png) 报错 1>------ 已启动生成: 项目: OpenCVExample, 配置: Debug x64 ------ 1>opencv_core300d.lib(alloc.obj) : error LNK2038: 检测到“_MSC_VER”的不匹配项: 值“1800”不匹配值“1900”(App.xaml.obj 中) 1>opencv_core300d.lib(alloc.obj) : error LNK2038: 检测到“RuntimeLibrary”的不匹配项: 值“MTd_StaticDebug”不匹配值“MDd_DynamicDebug”(App.xaml.obj 中) 1>opencv_core300d.lib(matrix.obj) : error LNK2038: 检测到“_MSC_VER”的不匹配项: 值“1800”不匹配值“1900”(App.xaml.obj 中) 1>opencv_core300d.lib(matrix.obj) : error LNK2038: 检测到“RuntimeLibrary”的不匹配项: 值“MTd_StaticDebug”不匹配值“MDd_DynamicDebug”(App.xaml.obj 中) 1>opencv_core300d.lib(stl.obj) : error LNK2038: 检测到“_MSC_VER”的不匹配项: 值“1800”不匹配值“1900”(App.xaml.obj 中) 1>opencv_core300d.lib(stl.obj) : error LNK2038: 检测到“RuntimeLibrary”的不匹配项: 值“MTd_StaticDebug”不匹配值“MDd_DynamicDebug”(App.xaml.obj 中) 值“MDd_DynamicDebug”(App.xaml.obj 中) 1>LINK : fatal error LNK1104: 无法打开文件“libcpmtd.lib” 1>已完成生成项目“OpenCVExample.vcxproj”的操作 - 失败。 ========== 生成: 成功 0 个,失败 1 个,最新 0 个,跳过 0 个 ==========

OpenGL,vs2015运行时,LINK : fatal error LNK1104: 无法打开文件“glfw32.lib”?

网上的好多解决方案都试过了 1、已经在project->linker->input的附加库中添加了 opengl.lib glfw32.lib(然后不行) 2、也试过微软官网的解决方案,OPT(也不行) 大神过来帮帮忙啊,在使用的code链接:https://learnopengl.com/Getting-started/Textures,最后一个code source,中间用到stb_image.h,和Shader_s.h,下面是具体.cpp和.h的链接: https://learnopengl.com/code_viewer_gh.php?code=includes/learnopengl/shader_s.h https://github.com/nothings/stb/blob/master/stb_image.h https://learnopengl.com/code_viewer_gh.php?code=src/1.getting_started/4.1.textures/textures.cpp

LINK : fatal error LNK1104: 无法打开文件“dxerr.lib”

大神们求救啊!我在安装了DirectX的EmptyProject之后,编译时出现LINK : fatal error LNK1104: 无法打开文件“dxerr.lib”这个东西,在包含Include文件夹和Lib文件夹之后编译还是出现这个东东,你们说我该怎么办?拜托了!

VS2010+opencv2.4.10 error LNK2001: 无法解析的外部符号

![图片说明](https://img-ask.csdn.net/upload/201705/16/1494931643_91832.png)1>CameraDS.obj : error LNK2001: 无法解析的外部符号 _cvReleaseImage 1>CameraDS.obj : error LNK2001: 无法解析的外部符号 _cvCreateImage 1>CameraDS.obj : error LNK2001: 无法解析的外部符号 _cvFlip![图片说明](https://img-ask.csdn.net/upload/201705/16/1494932063_459352.png) 1>CvvImage.obj : error LNK2001: 无法解析的外部符号 _cvGetSize 1>CvvImage.obj : error LNK2001: 无法解析的外部符号 _cvConvertImage 1>CvvImage.obj : error LNK2001: 无法解析的外部符号 _cvLoadImage 1>CvvImage.obj : error LNK2001: 无法解析的外部符号 _cvSetImageROI 1>CvvImage.obj : error LNK2001: 无法解析的外部符号 _cvSaveImage 1>CvvImage.obj : error LNK2001: 无法解析的外部符号 _cvShowImage 1>CvvImage.obj : error LNK2001: 无法解析的外部符号 _cvGetImageROI 1>mymfc.obj : error LNK2001: 无法解析的外部符号 _cvDestroyWindow 1>mymfc.obj : error LNK2001: 无法解析的外部符号 _cvReleaseCapture 1>mymfcDlg.obj : error LNK2001: 无法解析的外部符号 "__declsp![![![![图片说明](https://img-ask.csdn.net/upload/201705/16/1494931732_440893.png)图片说明](https://img-ask.csdn.net/upload/201705/16/1494931633_997993.png)图片说明](https://img-ask.csdn.net/upload/201705/16/1494931500_68171.png)图片说明](https://img-ask.csdn.net/upload/201705/16/1494931362_928728.png)ec(dllimport) public: __thiscall asm_shape::~asm_shape(void)" (__imp_??1asm_shape@@QAE@XZ) 1>mymfcDlg.obj : error LNK2001: 无法解析的外部符号 _cvReleaseMat 1>mymfcDlg.obj : error LNK2001: 无法解析的外部符号 "int __cdecl cv::_interlockedExchangeAdd(int *,int)" (?_interlockedExchangeAdd@cv@@YAHPAHH@Z) 1>mymfcDlg.obj : error LNK2001: 无法解析的外部符号 "public: void __thiscall cv::Mat::copySize(class cv::Mat const &)" (?copySize@Mat@cv@@QAEXABV12@@Z) 1>mymfcDlg.obj : error LNK2001: 无法解析的外部符号 "void __cdecl cv::fastFree(void *)" (?fastFree@cv@@YAXPAX@Z) 1>mymfcDlg.obj : error LNK2001: 无法解析的外部符号 "public: __thiscall cv::_OutputArray::_OutputArray(class cv::Mat &)" (??0_OutputArray@cv@@QAE@AAVMat@1@@Z) 1>mymfcDlg.obj : error LNK2001: 无法解析的外部符号 "public: __thiscall cv::_InputArray::_InputArray(class cv::Mat const &)" (??0_InputArray@cv@@QAE@ABVMat@1@@Z) 1>mymfcDlg.obj : error LNK2001: 无法解析的外部符号 "public: void __thiscall cv::Mat::deallocate(void)" (?deallocate@Mat@cv@@QAEXXZ) 1>mymfcDlg.obj : error LNK2001: 无法解析的外部符号 _cvResize 1>mymfcDlg.obj : error LNK2001: 无法解析的外部符号 _cvResetImageROI 1>mymfcDlg.obj : error LNK2001: 无法解析的外部符号 _cvWaitKey 1>mymfcDlg.obj : error LNK2001: 无法解析的外部符号 "public: __thiscall cv::CascadeClassifier::CascadeClassifier(void)" (??0CascadeClassifier@cv@@QAE@XZ) 1>mymfcDlg.obj : error LNK2001: 无法解析的外部符号 "public: virtual __thiscall cv::CascadeClassifier::~CascadeClassifier(void)" (??1CascadeClassifier@cv@@UAE@XZ) 1>mymfcDlg.obj : error LNK2001: 无法解析的外部符号 "public: bool __thiscall cv::CascadeClassifier::load(class std::basic_string<char,struct std::char_traits<char>,class std::allocator<char> > const &)" (?load@CascadeClassifier@cv@@QAE_NABV?$basic_string@DU?$char_traits@D@std@@V?$allocator@D@2@@std@@@Z) 1>mymfcDlg.obj : error LNK2001: 无法解析的外部符号 "public: __thiscall cv::Mat::Mat(struct _IplImage const *,bool)" (??0Mat@cv@@QAE@PBU_IplImage@@_N@Z) 1>mymfcDlg.obj : error LNK2001: 无法解析的外部符号 "void __cdecl cv::cvtColor(class cv::_InputArray const &,class cv::_OutputArray const &,int,int)" (?cvtColor@cv@@YAXABV_InputArray@1@ABV_OutputArray@1@HH@Z) 1>mymfcDlg.obj : error LNK2001: 无法解析的外部符号 "void __cdecl cv::equalizeHist(class cv::_InputArray const &,class cv::_OutputArray const &)" (?equalizeHist@cv@@YAXABV_InputArray@1@ABV_OutputArray@1@@Z) 1>mymfcDlg.obj : error LNK2001: 无法解析的外部符号 "public: virtual void __thiscall cv::CascadeClassifier::detectMultiScale(class cv::Mat const &,class std::vector<class cv::Rect_<int>,class std::allocator<class cv::Rect_<int> > > &,double,int,int,class cv::Size_<int>,class cv::Size_<int>)" (?detectMultiScale@CascadeClassifier@cv@@UAEXABVMat@2@AAV?$vector@V?$Rect_@H@cv@@V?$allocator@V?$Rect_@H@cv@@@std@@@std@@NHHV?$Size_@H@2@2@Z) 1>mymfcDlg.obj : error LNK2001: 无法解析的外部符号 "__declspec(dllimport) public: __thiscall asm_shape::asm_shape(void)" (__imp_??0asm_shape@@QAE@XZ) 1>mymfcDlg.obj : error LNK2001: 无法解析的外部符号 "__declspec(dllimport) public: __thiscall asmfitting::asmfitting(void)" (__imp_??0asmfitting@@QAE@XZ) 1>mymfcDlg.obj : error LNK2001: 无法解析的外部符号 "__declspec(dllimport) public: __thiscall asmfitting::~asmfitting(void)" (__imp_??1asmfitting@@QAE@XZ) 1>mymfcDlg.obj : error LNK2001: 无法解析的外部符号 "__declspec(dllimport) public: bool __thiscall asmfitting::Read(char const *)" (__imp_?Read@asmfitting@@QAE_NPBD@Z) 1>mymfcDlg.obj : error LNK2001: 无法解析的外部符号 "__declspec(dllimport) public: void __thiscall asm_shape::Resize(int)" (__imp_?Resize@asm_shape@@QAEXH@Z) 1>mymfcDlg.obj : error LNK2001: 无法解析的外部符号 __imp__InitShapeFromDetBox 1>mymfcDlg.obj : error LNK2001: 无法解析的外部符号 "__declspec(dllimport) public: bool __thiscall asmfitting::ASMSeqSearch(class asm_shape &,struct _IplImage const *,int,bool,int)" (__imp_?ASMSeqSearch@asmfitting@@QAE_NAAVasm_shape@@PBU_IplImage@@H_NH@Z) 1>mymfcDlg.obj : error LNK2001: 无法解析的外部符号 _cvNamedWindow 1>mymfcDlg.obj : error LNK2001: 无法解析的外部符号 _cvResizeWindow 1>mymfcDlg.obj : error LNK2001: 无法解析的外部符号 _cvGetWindowHandle 1>mymfcDlg.obj : error LNK2001: 无法解析的外部符号 _cvSetZero 1>mymfcDlg.obj : error LNK2001: 无法解析的外部符号 _cvCloneImage 1>mymfcDlg.obj : error LNK2001: 无法解析的外部符号 _cvRectangle 1>mymfcDlg.obj : error LNK2001: 无法解析的外部符号 _cvCircle 1>mymfcDlg.obj : error LNK2001: 无法解析的外部符号 _cvCreateMat 1>mymfcDlg.obj : error LNK2001: 无法解析的外部符号 _cvGEMM 1>mymfcDlg.obj : error LNK2001: 无法解析的外部符号 _cvSVD 1>mymfcDlg.obj : error LNK2001: 无法解析的外部符号 _cvTrace 1>mymfcDlg.obj : error LNK2001: 无法解析的外部符号 "__declspec(dllimport) public: double const __thiscall asmfitting::GetMeanFaceWidth(void)const " (__imp_?GetMeanFaceWidth@asmfitting@@QBE?BNXZ) 1>mymfcDlg.obj : error LNK2001: 无法解析的外部符号 "__declspec(dllimport) public: class asm_shape const __thiscall asmfitting::GetMappingDetShape(void)const " (__imp_?GetMappingDetShape@asmfitting@@QBE?BVasm_shape@@XZ) 1>mymfcDlg.obj : error LNK2001: 无法解析的外部符号 "__declspec(dllimport) public: struct Point2D32f & __thiscall asm_shape::operator[](int)" (__imp_??Aasm_shape@@QAEAAUPoint2D32f@@H@Z) ![图片说明](https://img-ask.csdn.net/upload/201705/16/1494931813_739749.png)

这个问题,fatal error LNK1104: 无法打开文件“cxcore.lib”怎么办

我用的是Opencv2.4.11版本 但是这个库在Opencv1.0版本有,我两个版本都安装了,我应该把1.0的哪些文件放到2.4.11版本的文件夹里才能正常链接

C++ 链接错误 fatal error LNK1104: 无法打开文件“mapnik.lib”

我在mapnik项目中Debug模式下编译成功.lib文件,然后再另一个Debug项目中链接mapnik.lib,就出现了LNK1104, 而在Release状态下是成功的,(debug下的mapnik.lib文件有3个多G),试了半天了,还是一头雾水

在中国程序员是青春饭吗?

今年,我也32了 ,为了不给大家误导,咨询了猎头、圈内好友,以及年过35岁的几位老程序员……舍了老脸去揭人家伤疤……希望能给大家以帮助,记得帮我点赞哦。 目录: 你以为的人生 一次又一次的伤害 猎头界的真相 如何应对互联网行业的「中年危机」 一、你以为的人生 刚入行时,拿着傲人的工资,想着好好干,以为我们的人生是这样的: 等真到了那一天,你会发现,你的人生很可能是这样的: ...

程序员请照顾好自己,周末病魔差点一套带走我。

程序员在一个周末的时间,得了重病,差点当场去世,还好及时挽救回来了。

C++(数据结构与算法)78:---分而治之

一、分而治之的思想 分而治之方法与软件设计的模块化方法非常相似 分而治之通常不用于解决问题的小实例,而要解决一个问题的大实例。一般步骤为: ①把一个大实例分为两个或多个更小的实例 ②分别解决每个小实例 ③把这些小实例的解组合成原始大实例的解 二、实际应用之找出假币 问题描述 一个袋子有16个硬币,其中只有一个是假币,这个假币比其他的真币重量轻(其他所有真币的重量都是相同的)...

springboot+jwt实现token登陆权限认证

一 前言 此篇文章的内容也是学习不久,终于到周末有时间码一篇文章分享知识追寻者的粉丝们,学完本篇文章,读者将对token类的登陆认证流程有个全面的了解,可以动态搭建自己的登陆认证过程;对小项目而已是个轻量级的认证机制,符合开发需求;更多精彩原创内容关注公主号知识追寻者,读者的肯定,就是对作者的创作的最大支持; 二 jwt实现登陆认证流程 用户使用账号和面发出post请求 服务器接受到请求后使用私...

技术大佬:我去,你写的 switch 语句也太老土了吧

昨天早上通过远程的方式 review 了两名新来同事的代码,大部分代码都写得很漂亮,严谨的同时注释也很到位,这令我非常满意。但当我看到他们当中有一个人写的 switch 语句时,还是忍不住破口大骂:“我擦,小王,你丫写的 switch 语句也太老土了吧!” 来看看小王写的代码吧,看完不要骂我装逼啊。 private static String createPlayer(PlayerTypes p...

win10暴力查看wifi密码

刚才邻居打了个电话说:喂小灰,你家wifi的密码是多少,我怎么连不上了。 我。。。 我也忘了哎,就找到了一个好办法,分享给大家: 第一种情况:已经连接上的wifi,怎么知道密码? 打开:控制面板\网络和 Internet\网络连接 然后右击wifi连接的无线网卡,选择状态 然后像下图一样: 第二种情况:前提是我不知道啊,但是我以前知道密码。 此时可以利用dos命令了 1、利用netsh wlan...

女程序员,为什么比男程序员少???

昨天看到一档综艺节目,讨论了两个话题:(1)中国学生的数学成绩,平均下来看,会比国外好?为什么?(2)男生的数学成绩,平均下来看,会比女生好?为什么?同时,我又联想到了一个技术圈经常讨...

副业收入是我做程序媛的3倍,工作外的B面人生是怎样的?

提到“程序员”,多数人脑海里首先想到的大约是:为人木讷、薪水超高、工作枯燥…… 然而,当离开工作岗位,撕去层层标签,脱下“程序员”这身外套,有的人生动又有趣,马上展现出了完全不同的A/B面人生! 不论是简单的爱好,还是正经的副业,他们都干得同样出色。偶尔,还能和程序员的特质结合,产生奇妙的“化学反应”。 @Charlotte:平日素颜示人,周末美妆博主 大家都以为程序媛也个个不修边幅,但我们也许...

MySQL数据库面试题(2020最新版)

文章目录数据库基础知识为什么要使用数据库什么是SQL?什么是MySQL?数据库三大范式是什么mysql有关权限的表都有哪几个MySQL的binlog有有几种录入格式?分别有什么区别?数据类型mysql有哪些数据类型引擎MySQL存储引擎MyISAM与InnoDB区别MyISAM索引与InnoDB索引的区别?InnoDB引擎的4大特性存储引擎选择索引什么是索引?索引有哪些优缺点?索引使用场景(重点)...

如果你是老板,你会不会踢了这样的员工?

有个好朋友ZS,是技术总监,昨天问我:“有一个老下属,跟了我很多年,做事勤勤恳恳,主动性也很好。但随着公司的发展,他的进步速度,跟不上团队的步伐了,有点...

我入职阿里后,才知道原来简历这么写

私下里,有不少读者问我:“二哥,如何才能写出一份专业的技术简历呢?我总感觉自己写的简历太烂了,所以投了无数份,都石沉大海了。”说实话,我自己好多年没有写过简历了,但我认识的一个同行,他在阿里,给我说了一些他当年写简历的方法论,我感觉太牛逼了,实在是忍不住,就分享了出来,希望能够帮助到你。 01、简历的本质 作为简历的撰写者,你必须要搞清楚一点,简历的本质是什么,它就是为了来销售你的价值主张的。往深...

程序员写出这样的代码,能不挨骂吗?

当你换槽填坑时,面对一个新的环境。能够快速熟练,上手实现业务需求是关键。但是,哪些因素会影响你快速上手呢?是原有代码写的不够好?还是注释写的不够好?昨夜...

带了6个月的徒弟当了面试官,而身为高级工程师的我天天修Bug......

即将毕业的应届毕业生一枚,现在只拿到了两家offer,但最近听到一些消息,其中一个offer,我这个组据说客户很少,很有可能整组被裁掉。 想问大家: 如果我刚入职这个组就被裁了怎么办呢? 大家都是什么时候知道自己要被裁了的? 面试软技能指导: BQ/Project/Resume 试听内容: 除了刷题,还有哪些技能是拿到offer不可或缺的要素 如何提升面试软实力:简历, 行为面试,沟通能...

优雅的替换if-else语句

场景 日常开发,if-else语句写的不少吧??当逻辑分支非常多的时候,if-else套了一层又一层,虽然业务功能倒是实现了,但是看起来是真的很不优雅,尤其是对于我这种有强迫症的程序"猿",看到这么多if-else,脑袋瓜子就嗡嗡的,总想着解锁新姿势:干掉过多的if-else!!!本文将介绍三板斧手段: 优先判断条件,条件不满足的,逻辑及时中断返回; 采用策略模式+工厂模式; 结合注解,锦...

!大部分程序员只会写3年代码

如果世界上都是这种不思进取的软件公司,那别说大部分程序员只会写 3 年代码,恐怕就没有程序员这种职业。

离职半年了,老东家又发 offer,回不回?

有小伙伴问松哥这个问题,他在上海某公司,在离职了几个月后,前公司的领导联系到他,希望他能够返聘回去,他很纠结要不要回去? 俗话说好马不吃回头草,但是这个小伙伴既然感到纠结了,我觉得至少说明了两个问题:1.曾经的公司还不错;2.现在的日子也不是很如意。否则应该就不会纠结了。 老实说,松哥之前也有过类似的经历,今天就来和小伙伴们聊聊回头草到底吃不吃。 首先一个基本观点,就是离职了也没必要和老东家弄的苦...

2020阿里全球数学大赛:3万名高手、4道题、2天2夜未交卷

阿里巴巴全球数学竞赛( Alibaba Global Mathematics Competition)由马云发起,由中国科学技术协会、阿里巴巴基金会、阿里巴巴达摩院共同举办。大赛不设报名门槛,全世界爱好数学的人都可参与,不论是否出身数学专业、是否投身数学研究。 2020年阿里巴巴达摩院邀请北京大学、剑桥大学、浙江大学等高校的顶尖数学教师组建了出题组。中科院院士、美国艺术与科学院院士、北京国际数学...

为什么你不想学习?只想玩?人是如何一步一步废掉的

不知道是不是只有我这样子,还是你们也有过类似的经历。 上学的时候总有很多光辉历史,学年名列前茅,或者单科目大佬,但是虽然慢慢地长大了,你开始懈怠了,开始废掉了。。。 什么?你说不知道具体的情况是怎么样的? 我来告诉你: 你常常潜意识里或者心理觉得,自己真正的生活或者奋斗还没有开始。总是幻想着自己还拥有大把时间,还有无限的可能,自己还能逆风翻盘,只不是自己还没开始罢了,自己以后肯定会变得特别厉害...

男生更看重女生的身材脸蛋,还是思想?

往往,我们看不进去大段大段的逻辑。深刻的哲理,往往短而精悍,一阵见血。问:产品经理挺漂亮的,有点心动,但不知道合不合得来。男生更看重女生的身材脸蛋,还是...

为什么程序员做外包会被瞧不起?

二哥,有个事想询问下您的意见,您觉得应届生值得去外包吗?公司虽然挺大的,中xx,但待遇感觉挺低,马上要报到,挺纠结的。

当HR压你价,说你只值7K,你该怎么回答?

当HR压你价,说你只值7K时,你可以流畅地回答,记住,是流畅,不能犹豫。 礼貌地说:“7K是吗?了解了。嗯~其实我对贵司的面试官印象很好。只不过,现在我的手头上已经有一份11K的offer。来面试,主要也是自己对贵司挺有兴趣的,所以过来看看……”(未完) 这段话主要是陪HR互诈的同时,从公司兴趣,公司职员印象上,都给予对方正面的肯定,既能提升HR的好感度,又能让谈判气氛融洽,为后面的发挥留足空间。...

面试:第十六章:Java中级开发

HashMap底层实现原理,红黑树,B+树,B树的结构原理 Spring的AOP和IOC是什么?它们常见的使用场景有哪些?Spring事务,事务的属性,传播行为,数据库隔离级别 Spring和SpringMVC,MyBatis以及SpringBoot的注解分别有哪些?SpringMVC的工作原理,SpringBoot框架的优点,MyBatis框架的优点 SpringCould组件有哪些,他们...

早上躺尸,晚上干活:硅谷科技公司这么流行迟到?

硅谷科技公司上班时间OPEN早已不是什么新鲜事,早九晚五是常态,但有很多企业由于不打卡,员工们10点、11点才“姗姗来迟”的情况也屡见不鲜。 这种灵活的考勤制度为人羡慕,甚至近年来,国内某些互联网企业也纷纷效仿。不过,硅谷普遍弹性的上班制度是怎么由来的呢?这种“流行性迟到”真的有那么轻松、悠哉吗? 《动态规划专题班》 课程试听内容: 动态规划的解题要领 动态规划三大类 求最值/计数/可行性 常...

面试阿里p7,被按在地上摩擦,鬼知道我经历了什么?

面试阿里p7被问到的问题(当时我只知道第一个):@Conditional是做什么的?@Conditional多个条件是什么逻辑关系?条件判断在什么时候执...

Python爬虫,高清美图我全都要(彼岸桌面壁纸)

爬取彼岸桌面网站较为简单,用到了requests、lxml、Beautiful Soup4

无代码时代来临,程序员如何保住饭碗?

编程语言层出不穷,从最初的机器语言到如今2500种以上的高级语言,程序员们大呼“学到头秃”。程序员一边面临编程语言不断推陈出新,一边面临由于许多代码已存在,程序员编写新应用程序时存在重复“搬砖”的现象。 无代码/低代码编程应运而生。无代码/低代码是一种创建应用的方法,它可以让开发者使用最少的编码知识来快速开发应用程序。开发者通过图形界面中,可视化建模来组装和配置应用程序。这样一来,开发者直...

面试了一个 31 岁程序员,让我有所触动,30岁以上的程序员该何去何从?

最近面试了一个31岁8年经验的程序猿,让我有点感慨,大龄程序猿该何去何从。

大三实习生,字节跳动面经分享,已拿Offer

说实话,自己的算法,我一个不会,太难了吧

程序员垃圾简历长什么样?

已经连续五年参加大厂校招、社招的技术面试工作,简历看的不下于万份 这篇文章会用实例告诉你,什么是差的程序员简历! 疫情快要结束了,各个公司也都开始春招了,作为即将红遍大江南北的新晋UP主,那当然要为小伙伴们做点事(手动狗头)。 就在公众号里公开征简历,义务帮大家看,并一一点评。《启舰:春招在即,义务帮大家看看简历吧》 一石激起千层浪,三天收到两百多封简历。 花光了两个星期的所有空闲时...

Java岗开发3年,公司临时抽查算法,离职后这几题我记一辈子

前几天我们公司做了一件蠢事,非常非常愚蠢的事情。我原以为从学校出来之后,除了找工作有测试外,不会有任何与考试有关的事儿。 但是,天有不测风云,公司技术总监、人事总监两位大佬突然降临到我们事业线,叫上我老大,给我们组织了一场别开生面的“考试”。 那是一个风和日丽的下午,我翘着二郎腿,左手端着一杯卡布奇诺,右手抓着我的罗技鼠标,滚动着轮轴,穿梭在头条热点之间。 “淡黄的长裙~蓬松的头发...

立即提问
相关内容推荐