ankhsvn 安装时出错,求高手指教 5C

问题: ankhsvn 安装时出错,求高手指教,坐等回复
描述:
错误内容: Failed to open XML file d:\Program Files\Microsoft Visual Studio 10.0\Common7\IDE\devenv.exe.config,system error:-2147024786

以上介绍了“ ankhsvn 安装时出错,求高手指教,坐等回复”的问题解答,希望对有需要的网友有所帮助。

1个回答

Csdn user default icon
上传中...
上传图片
插入图片
抄袭、复制答案,以达到刷声望分或其他目的的行为,在CSDN问答是严格禁止的,一经发现立刻封号。是时候展现真正的技术了!
其他相关推荐
ankhsvn 安装时出错,求高手指教,坐等回复
错误内容:rn Failed to open XML file d:\Program Files\Microsoft Visual Studio 10.0\Common7\IDE\devenv.exe.config,system error:-2147024786
Response.OutputStream.Write...时出错(高手指教~!)
“你不能关闭microsoft word,因为有一个对话框仍处于活动状态,请先切换到Microsft word 关闭该对话框”rn将信息写入 HTTP 输出内容流,这是一个WORD 文件,为什么会出现这种情况,怎么解决?rnrn 高手指教~!
office2010安装出错,求指教
[img=http://img.my.csdn.net/uploads/201212/07/1354863533_9458.jpg][/img]安装office2010的时候提示一下错误。如图
安装DB2出错求指教
从网上下载了一个 DB2ClientSetup.exe 在安装的时候出现“在检索用于此计算机安装的信息时出错。返回值为203。如果问题仍然存在,请与技术服务代表联系” 求高手指教这个问题怎么解决。我选择的是典型安装
求高手指教!!!输入出错!!
#includern#includern rn int a,n,d[10],b[10],c[10];rn char name[10];rnrnvoid main()rn rn rn rn printf("请输入时刻表的条数\n");rn scanf("%d",&a);rnrnrn for(n=0;n
mysql-proxy安装,编译全部出错,configure时出错,求高手
我安装mysql-proxy时遭遇了好像少了什么文件一样,make时全是错误,执行./configure时有下面几行错误:rnrnchecking for check -version >= 0.8.2 .. norn***Could not run check test program,checking why....rn*** The test program failed to compile or link.See the file config.log forrn*** the exact error that occured.rn那位高手碰到过这个问题?
安装petshop时出错!!请指教
“无法打开COM+1.0目录以配置组件。-->指定的服务未安装。”,我的操作系统是windows 2000,.NET Framework 1.1。
安装VC时,出错,请指教!!
安装时出现如下信息: rn安装程序无法创建一个DCOM用户帐号来注册 rn'E:\Program Files\Microsoft Visual Studio\Common\Tools\Vs-Ent98\Vanalyzr\Valec.exe" rnrnrnrn然后,按确定就退出了,无法安装成功. rnrn请高手指教啊.谢谢了!!!!!!!!!!!!!!!!!
Ankhsvn 安装及使用
AnkhSvn是一种对版本和源代码进行控制的工具。使用它我们可以做到随时随地的进行项目开发,摆脱了开发过程中空间的限制(当然,随时随地的条件是可以上网),同时解决了团队合作中的一个令人头疼的问题--修改冲突。以前我们用SourceSafe进行项目控制时,经常发生团队成员之间对同一段代码做了修改,而在提交时就会出错,时常出现代码的覆盖以及以及更改的丢失。同时AnkhSvn解决了我们无法查看对该解决方案所做更改(即view history)的问题,保证了代码提交的安全性,同时使我们每个人从担心代码冲突、代码覆盖的疑虑中解放出来,能够全身心投入项目开发中。
gridControl给DataSource赋值时出错,求高手指教
DataTable dt = new DataTable();rn dt.Columns.Add("ColumnICExeMaxQty", typeof(int));rn dt.Columns.Add("ColumnICExeMinQty", typeof(int));rn dt.Columns.Add("ColumnICUnit", typeof(string));rn dt.Columns.Add("ColumnICMaxQty", typeof(int));rn dt.Columns.Add("ColumnICMinQty", typeof(int));rn dt.Columns.Add("ColumnICMinUnit", typeof(int));rn dt.Rows.Add(10, 5, "吨", 25, 7, 8);rn dt.Rows.Add(101, 5, "瓶", 254, 7, 8);rn this.gridView2.DataSource = dt;rngridView2.DataSource 赋值时 报gridView2.DataSource是只读的
AnkhSvn安装及使用
下载: http://download.csdn.net/download/lwpoor123/10040718安装: 直接点击下一步完成安装使用: 打开vs—文件—添加—subversion project 添加一个svn地址: 添加完成后可以看到vs底部多了一个Pending Changes,在这里管理代码 如果没有找到Pending Changes,可在 视图—其他窗口—Pend
做启动画面时出错,请高手指教
做启动画面时出错,代码如下rnrn //启动画面rn CCommandLineInfo cmdInfo;rn  ParseCommandLine(cmdInfo);rn  CSplashWnd::EnableSplashScreen(cmdInfo.m_bShowSplash);rn系统显示出错原因:unknown character '0xa1'rn可是这一出错原因我看不懂啊,请高手指教
调试程序时出错,请路过的高手指教!
最近刚从网上下了visual studio2005简体中文版,安装过程一切正常,只是提示有些组件已经装过,所以跳过。 但在程序调试时点了“启动调试”后出现“试图运行项目时出错:无法启动调试。绑定句柄无效。”装了几遍都是同样错误。rnrn调试时所用例子是从书上光盘直接copy的,并无错误,是不是机器配置错误,或者安装时出了什么错误??请路过的高手指点一二。rnrn谢谢了!!!!rn
Linux make vsftpd-2.2.0 时出错(高手指教)
新手上路,请各位大侠解答!rnrn[root@webhost vsftpd-2.2.0]# makernrngcc -c main.c -O2 -Wall -W -Wshadow -idirafter dummyincrngcc -c utility.c -O2 -Wall -W -Wshadow -idirafter dummyincrngcc -c prelogin.c -O2 -Wall -W -Wshadow -idirafter dummyincrngcc -c ftpcmdio.c -O2 -Wall -W -Wshadow -idirafter dummyincrngcc -c postlogin.c -O2 -Wall -W -Wshadow -idirafter dummyincrngcc -c privsock.c -O2 -Wall -W -Wshadow -idirafter dummyincrngcc -c tunables.c -O2 -Wall -W -Wshadow -idirafter dummyincrngcc -c ftpdataio.c -O2 -Wall -W -Wshadow -idirafter dummyincrngcc -c secbuf.c -O2 -Wall -W -Wshadow -idirafter dummyincrngcc -c ls.c -O2 -Wall -W -Wshadow -idirafter dummyincrngcc -c postprivparent.c -O2 -Wall -W -Wshadow -idirafter dummyincrngcc -c logging.c -O2 -Wall -W -Wshadow -idirafter dummyincrngcc -c str.c -O2 -Wall -W -Wshadow -idirafter dummyincrngcc -c netstr.c -O2 -Wall -W -Wshadow -idirafter dummyincrngcc -c sysstr.c -O2 -Wall -W -Wshadow -idirafter dummyincrngcc -c strlist.c -O2 -Wall -W -Wshadow -idirafter dummyincrngcc -c banner.c -O2 -Wall -W -Wshadow -idirafter dummyincrngcc -c filestr.c -O2 -Wall -W -Wshadow -idirafter dummyincrngcc -c parseconf.c -O2 -Wall -W -Wshadow -idirafter dummyincrngcc -c secutil.c -O2 -Wall -W -Wshadow -idirafter dummyincrngcc -c ascii.c -O2 -Wall -W -Wshadow -idirafter dummyincrngcc -c oneprocess.c -O2 -Wall -W -Wshadow -idirafter dummyincrngcc -c twoprocess.c -O2 -Wall -W -Wshadow -idirafter dummyincrngcc -c privops.c -O2 -Wall -W -Wshadow -idirafter dummyincrngcc -c standalone.c -O2 -Wall -W -Wshadow -idirafter dummyincrngcc -c hash.c -O2 -Wall -W -Wshadow -idirafter dummyincrngcc -c tcpwrap.c -O2 -Wall -W -Wshadow -idirafter dummyincrngcc -c ipaddrparse.c -O2 -Wall -W -Wshadow -idirafter dummyincrngcc -c access.c -O2 -Wall -W -Wshadow -idirafter dummyincrngcc -c features.c -O2 -Wall -W -Wshadow -idirafter dummyincrngcc -c readwrite.c -O2 -Wall -W -Wshadow -idirafter dummyincrngcc -c opts.c -O2 -Wall -W -Wshadow -idirafter dummyincrngcc -c ssl.c -O2 -Wall -W -Wshadow -idirafter dummyincrngcc -c sslslave.c -O2 -Wall -W -Wshadow -idirafter dummyincrngcc -c ptracesandbox.c -O2 -Wall -W -Wshadow -idirafter dummyincrngcc -c ftppolicy.c -O2 -Wall -W -Wshadow -idirafter dummyincrngcc -c sysutil.c -O2 -Wall -W -Wshadow -idirafter dummyincrngcc -c sysdeputil.c -O2 -Wall -W -Wshadow -idirafter dummyincrngcc -o vsftpd main.o utility.o prelogin.o ftpcmdio.o postlogin.o privsock.o tunables.o ftpdataio.o secbuf.o ls.o postprivparent.o logging.o str.o netstr.o sysstr.o strlist.o banner.o filestr.o parseconf.o secutil.o ascii.o oneprocess.o twoprocess.o privops.o standalone.o hash.o tcpwrap.o ipaddrparse.o access.o features.o readwrite.o opts.o ssl.o sslslave.o ptracesandbox.o ftppolicy.o sysutil.o sysdeputil.o -Wl,-s `./vsf_findlibs.sh`rn/usr/bin/ld: cannot find -lcaprncollect2: ld returned 1 exit statusrnmake: *** [vsftpd] Error 1
编译内核出错,高手指教
以下为我的步骤:rnrnrngedit MakefilernrnARCH ?= armrnCROSS_COMPILE ?= /home/zilong/crosstool/work/gcc-4.1.0-glibc-2.3.2/arm-9tdmi-linux-gnu/bin/arm-9tdmi-linux-gnu-rnrn2.cp arch/arm/configs/s3c2410_defconfig .configrnrn3.rn修改arch/arm/mach-s3c2440/mach-smdk2440.crnrnstatic void __init smdk2440_map_io(void)rnrn s3c24xx_init_io(smdk2440_iodesc, ARRAY_SIZE(smdk2440_iodesc));rn// s3c24xx_init_clocks(16934400);rn s3c24xx_init_clocks(12000000);rn s3c24xx_init_uarts(smdk2440_uartcfgs, ARRAY_SIZE(smdk2440_uartcfgs));rnrnrn4、rn修改内核源码的“arch/arm/tools/mach-types”文件rns3c2440 ARCH_S3C2440 S3C2440 782rnrn5.禁用Flash ECC校验rn 修改drivers/mtd/nand/s3c2410.crn 修改drivers/mtd/nand/s3c2410.crn 找到chip->eccmode = NAND_ECC_SOFT;rn 改为chip->eccmode = NAND_ECC_NONE;rnrnrn6.修改NandFlash 分区信息。rn在arch/arm/plat-s3c24xx/common-smdk.c中修改smdk_default_nand_part[],rnstatic struct mtd_partition smdk_default_nand_part[] = rn [0] = .name = "vivi",rn .size = 0x00020000,rn .offset = 0X00000000,rn ,rn [1] = .name = "kernel_linux",rn .offset = 0x00050000,rn .size = 0x00200000,rn ,rn [2] = .name = "root_fs",rn .offset =0x00250000,rn .size =0x03dac000,rn rn;rnrnrn7.MAKE menuconfigrnSystem Type ---->rn [*] S3C2410 DMA supportrn S3C2410 Machines --->rn [*] SMDK2410/A9M2410 rn S3C2440 Machines --->rn [*] SMDK2440rn [*] SMDK2440 with S3C2440 CPU modulernrnrnrn[*] Enable loadable module support --->rn [*] Module unloadingrn [*] Automatic kernel module loadingrn rn 选择这两个,剩下的可以去掉rnrnBoot option ----->rn 修改启动参数为:noinitrd root=/dev/mtdblock2 init=/linuxrc console=ttySAC0,115200rn rnrnDevice Drivers --->rn <*> Memory Technology Device (MTD) support --->rn [*] MTD partitioning supportrn <*> NAND Device Support --->rn <*> NAND Flash support for S3C2410/S3C2440 SoCrn [ ] S3C2410 NAND Hardware ECC //这个要去掉rnrn [*] Network device support --->rn [*] Ethernet (10 or 100Mbit) ---> rn <*> DM9000 supportrnKernel Features ->rn [*]Use the ARM EABI to compile the kernelrn [*] Allow old ABI binaries to run with this kernelrnmake zImagernrn结果出现以下错误:rn[color=#FF0000]drivers/usb/core/hcd.c:144: error: expected expression before '>>' tokenrndrivers/usb/core/hcd.c:144: error: expected expression before '>>' tokenrndrivers/usb/core/hcd.c:167: error: expected expression before '>>' tokenrndrivers/usb/core/hcd.c:167: error: expected expression before '>>' token[/color]rnrn请问如何解决???rnrnrn
二叉树出错 高手指教
#include rn#include rn#define MaxSize 100rntypedef char ElemType;rntypedef struct nodernElemType data;rn struct node *lchild;rn struct node *rchild;rnBTNode;rnrnvoid CreateBTNode(BTNode *b,char *str)rnBTNode *St[MaxSize],*p=NULL;rn int top=-1,k,j=0;rn char ch;rn b=NULL;rn ch=str[j];rn while(ch!='\0')rn switch(ch)rn case '(':top++;St[top]=p;k=1;break;rn case ')':top--;break;rn case ',':k=2;break;rn default:p=(BTNode *)malloc(sizeof(BTNode));rn p->data=ch;p->lchild=p->rchild=NULL; rn if(b==NULL) b=p;//让b指向根结点rn elsern switch(k)rn case 1:St[top]->lchild=p;break;rn case 2:St[top]->rchild=p;break;rn rn rn rn j++; ch=str[j];rn rn rn printf("%c",b->data);system("PAUSE");//b在此处没错 rnrnrnvoid DispBTNode(BTNode *b)rnif(b!=NULL)rn printf("%c",b->data);system("PAUSE");rn if(b->lchild!=NULL||b->rchild!=NULL) rn printf("(");rn DispBTNode(b->lchild);rn if(b->rchild!=NULL)//为空的话不用显示逗号的rn printf(",");rn DispBTNode(b->rchild);rn printf(")");rn rn rnrnrnint main(int argc, char *argv[])rnrn BTNode *b,*p,*lp,*rp;rn CreateBTNode(b,"A(B(D,E(H(J,K(L,M(,N))))),C(F,G(,I)))");rn printf("%c",b->data);system("PAUSE");//b出错 ,传递出错??? rn printf("binary tree:");rn DispBTNode(b);rn printf("\n");rnrn system("PAUSE"); rn return 0;rnrn
多线程出错,求指教。
[img=https://img-bbs.csdn.net/upload/201605/20/1463741215_927116.png][/img]rn[img=https://img-bbs.csdn.net/upload/201605/20/1463741224_986703.png][/img]rn[img=https://img-bbs.csdn.net/upload/201605/20/1463741244_919546.png][/img]rn[img=https://img-bbs.csdn.net/upload/201605/20/1463741250_899051.png][/img]rnrn错误是这个,rn.h 里面申明 rnstatic DWORD WINAPI CreateThread(LPVOID lpParam);rnrn函数里面调用 rnAfxBeginThread((AFX_THREADPROC)CreateThread,this); //多线程rnrn.cpp 实现rnDWORD CClientSocketDlg::CreateThread(LPVOID lpParam) //多线程rnrn //连接服务器rn status = connect(Clientsocket,(LPSOCKADDR)&ServerAddress,sizeof(ServerAddress));rn if( status == 0 )rn rn AfxMessageBox(L"服务器连接成功",MB_ICONINFORMATION);rn rn elsern rn AfxMessageBox(L"服务器连接失败",MB_ICONEXCLAMATION);rn return 0;rn rn //接受消息rn CString News;rn char news[250] = "\0";rn while(1)rn rn Number = recv(Clientsocket,news,250,0);rn News = news ;rn if( Number > 0 )rn rn AfxMessageBox(News,MB_ICONINFORMATION);rn rn rn return 0;rnrnrn
跳转页面出错,求指教
我用如下代码写了个跳转页面,但是总报页面找不到,上一页和下一页页面也报错 求指教 谢谢!!rnrn rn rn $newsList.title rn rn rn rn rn rn 对不起,暂时没有信息!rn rn rn rn rn 共$newsListPage.rowNum 条信息 rn onclick="return false;" disabled >首页 rn onclick="return false;" disabled >上一页 rn onclick="return false;" disabled >下一页 rn onclick="return false;" disabled >尾页 rn /$newsListPage.pageNum 页rn 跳转rn rn
控件安装时出了问题.高手指教~
我在网上下了一个控件,这个控件大家可以到网上去下,www.baidu.com找一下.名字叫做:一个做QQ界面的好控件.我用的是DELPHI7 ,安装在E盘下的《DELPHI安装区》(文件夹名)里面。rn一个做QQ界面的好控件:该控件下来的文件夹里面一共有文件分别为:janTabBar.dcu,janTabBar.~pas,janTabBar.cnt,janTabBar.dcr,janTabBar.GID,janTabBar.pas,janTabBar.hlp通过DELPHI的Componet-->install component..-->PAS或DCU文件-->install安装后DELPHI提示:[Fatal Error] janTabBar.pas(7): File not found: 'DsgnIntf.dcu'rn本人以前也安装过控件,没有遇到这种情况。怎么弄都是一回事,也不知道是不是真少了这么一个文件还是自己安装方法不对~请各位高手指教~rnrn您可以把这个控件下下来自己装装看看。百度里一找就找到了~rn在下先在这里谢谢大家了~
安装.NET2003时报错,请高手指教!!!!
安装程序检测到另一个程序要求计算机重新启动。必须从新启动计算机后才能安装visual studio.net系统必备。rn请问这是怎么回事!!!!
安装时出现的问题求指教?
打开文件会出现警告rn以阻止发布者该程序在你的计算机上运行,请问怎样才能取消?
安装vs.net2003时出错,高手救命~~~
我在没有网络的机子上安装sever 2003后安装vs.net2003,出现如下错误:rn 错误1305 读取文件h:\program files\microsoft visual studio.net 2003\common7\IDE\Commoner.Hxs时出错。请验证文件是否存在以及是否可以访问。rn我买了两套安装盘。都这样的错误。rn谁知道是为什么吗?该如何解决?
QTP安装时出错,求解决,非常感谢
[img=https://img-bbs.csdn.net/upload/201409/01/1409563466_210750.jpg][/img]rnrn非常感谢,不知道怎么解决
配置数据源时出错,求高手
//server.xml文件rn rnrnrnrnfactoryrnorg.apache.commons.dbcp.BasicDataSourceFactoryrnrnrnmaxActivern100rnrnrnmaxIdlern30rnrnrnmaxWaitrn10000rnrnrnusernamernrootrnrnrnpasswordrnsxhongrnrnrndriverClassNamerncom.mysql.jdbc.Driverrnrnrnurlrnjdbc:mysql://localhost:3306/testrnrnrnremoveAbandonedrntruernrnrnremoveAbandonedTimeoutrn60rnrnrnrnrn//我的相应目录的web.xml配置如下:rnrnDB Connectionrnjdbc/bookstorernjavax.sql.DataSourcernContainerrnrnmysql驱动已拷入common\lib目录内.rn在servlet内使用如下:rnContext ctx = new InitialContext();rnDataSource ds=(DataSource)ctx.lookup("java:comp/env/jdbc/bookstore");rnConnection con=ds.getConnection();rnStatement stmt=con.createStatement();rnResultSet rs=stmt.executeQuery("select * from digest");rnrn结果出现如下的错误:rnorg.apache.tomcat.dbcp.dbcp.SQLNestedException: Cannot create JDBC driver of class '' for connect URL 'null' at org.apache.tomcat.dbcp.dbcp.BasicDataSource.createDataSource(BasicDataSource.java:780) at org.apache.tomcat.dbcp.dbcp.BasicDataSource.getConnection(BasicDataSource.java:540) at test.doGet(test.java:33) at javax.servlet.http.HttpServlet.service(HttpServlet.java:689) at javax.servlet.http.HttpServlet.service(HttpServlet.java:802) at org.apache.catalina.servlets.InvokerServlet.serveRequest(InvokerServlet.java:419) at org.apache.catalina.servlets.InvokerServlet.doGet(InvokerServlet.java:133) at javax.servlet.http.HttpServlet.service(HttpServlet.java:689) at javax.servlet.http.HttpServlet.service(HttpServlet.java:802) at org.apache.catalina.core.ApplicationFilterChain.internalDoFilter(ApplicationFilterChain.java:252) at org.apache.catalina.core.ApplicationFilterChain.doFilter(ApplicationFilterChain.java:173) at filters.SetCharacterEncodingFilter.doFilter(SetCharacterEncodingFilter.java:123) at org.apache.catalina.core.ApplicationFilterChain.internalDoFilter(ApplicationFilterChain.java:202) at org.apache.catalina.core.ApplicationFilterChain.doFilter(ApplicationFilterChain.java:173) at org.apache.catalina.core.StandardWrapperValve.invoke(StandardWrapperValve.java:213) at org.apache.catalina.core.StandardContextValve.invoke(StandardContextValve.java:178) at org.apache.catalina.core.StandardHostValve.invoke(StandardHostValve.java:126) at org.apache.catalina.valves.ErrorReportValve.invoke(ErrorReportValve.java:105) at org.apache.catalina.core.StandardEngineValve.invoke(StandardEngineValve.java:107) at org.apache.catalina.connector.CoyoteAdapter.service(CoyoteAdapter.java:148) at org.apache.coyote.http11.Http11Processor.process(Http11Processor.java:856) at org.apache.coyote.http11.Http11Protocol$Http11ConnectionHandler.processConnection(Http11Protocol.java:744) at org.apache.tomcat.util.net.PoolTcpEndpoint.processSocket(PoolTcpEndpoint.java:527) at org.apache.tomcat.util.net.LeaderFollowerWorkerThread.runIt(LeaderFollowerWorkerThread.java:80) at org.apache.tomcat.util.threads.ThreadPool$ControlRunnable.run(ThreadPool.java:684) at java.lang.Thread.run(Unknown Source) Caused by: java.sql.SQLException: No suitable driver at java.sql.DriverManager.getDriver(Unknown Source) at org.apache.tomcat.dbcp.dbcp.BasicDataSource.createDataSource(BasicDataSource.java:773) ... 25 more rnrn望高手解答,不甚感激! rn
编译pixman0.12.0时出错 求高手解决。
使用命令:CC=arm-linux-gcc ./configure --host=arm-linux --prefix=$PREFIX配置成功,make时出错:rn/usr/lib/libgtk-x11-2.0.so: could not read symbols: File in wrong formatrncollect2: ld returned 1 exit statusrnmake[2]: *** [clip-test] 错误 1rnmake[2]:正在离开目录 `/home/gtk/pixman-0.12.0/test'rnmake[1]: *** [all-recursive] 错误 1rnmake[1]:正在离开目录 `/home/gtk/pixmaprn我的机器位数是32位应该不存在机器位数不一致的问题。还可能是什么问题呢,怎么解决。急啊,谢谢啦。。。。
Spring整合Hibernate时出错,求高手帮忙!
[size=12px]出现的错误:Error creating bean with name 'sessionFactory' defined in class path resource [beans.xml]: Instantiation of bean failed; nested exception is org.springframework.beans.BeanInstantiationException: Could not instantiate bean class [org.springframework.orm.hibernate3.LocalSessionFactoryBean]: Constructor threw exception; nested exception is java.lang.NoSuchMethodError:org.slf4j.impl.StaticLoggerBinder.getSingleton()Lorg/slf4j/impl/StaticLoggerBinder;[/size]
XP安装VS2008,老是出错,求高手!
我的VS2008是那个90天试用版的,3.7G多。rn安装老是出现说 microsoft document explorer 2008安装失败。前提是:我没有安装office2003,C盘temp的东西已经清理干净。。。。rnrn我以前安装过VS2005的。rnrn求求各位高手,帮忙解答一下唉!
打开文件时出错,请指教
在网上得到一篇代码写的是:得到局域网内所有电脑名。rn三个控件:rn1个buttonrn1个memorn1个timer,enable属性先设为falsernrnunit1中代码如下:rnrnunit Unit1;rnrninterfacernrnusesrn Windows, Messages, SysUtils, Variants, Classes, Graphics, Controls, Forms,rn Dialogs, StdCtrls, ExtCtrls;rnrntypern TForm1 = class(TForm)rn Timer1: TTimer;rn Button1: TButton;rn Memo1: TMemo;rn procedure Button1Click(Sender: TObject);rn procedure Timer1Timer(Sender: TObject);rn privatern Private declarations rn publicrn Public declarations rn end;rnrnvarrn Form1: TForm1;rnrnimplementationrnrn$R *.dfmrnrnprocedure TForm1.Button1Click(Sender: TObject);rnVARrn command:string ;rn comline: pchar ;rnbeginrn command:='COMMAND.COM /C net view>c:\123ip.txt';rn comline:=pchar(command);rn WinExec(comline, sw_hide);rn timer1.Enabled:=true;rnrnend;rnrnprocedure TForm1.Timer1Timer(Sender: TObject);rnvar f:tstringlist;rn ll,ii:integer;rn s1,s:string;rn b:bool;rnbeginrnf:=tstringlist.Create;rntryrn f.LoadFromFile('c:\123ip.txt');rn exceptrnend;rnif f.Count>10 then beginrnmemo1.Clear;rnmemo1.lines.add(f.text); rntimer1.Enabled:=false;rnf.Free;rn去掉多余的行和'\\'rn for ll:=memo1.lines.count-1 downto 0 do beginrn if strpos(pchar(memo1.lines.strings[ll]),'\\')=nil thenrn memo1.lines.delete(ll)rn elsern // memo1.lines.Strings[ll]:=delete(memo1.lines.Strings[ll],'\\');rn 自编1个去'\\'的函数rn end;rntimer1.enabled:=False;rn end;rnrnend;rnrnend.rnrn//////////////////rn运行时点接钮报错rn为验证是否是打开文件时代码错误又建一工程:rn1个buttonrn1个memornrnunit1中代码如下:rnrnunit Unit1;rnrninterfacernrnusesrn Windows, Messages, SysUtils, Variants, Classes, Graphics, Controls, Forms,rn Dialogs, StdCtrls, ExtCtrls;rnrntypern TForm1 = class(TForm)rn Button1: TButton;rn Memo1: TMemo;rn procedure Button1Click(Sender: TObject);rn privatern Private declarations rn publicrn Public declarations rn end;rnrnvarrn Form1: TForm1;rnrnimplementationrnrn$R *.dfmrnrnprocedure TForm1.Button1Click(Sender: TObject);rnvar f:tstringlist;rn ll,ii:integer;rn s1,s:string;rn b:bool;rnbeginrnf:=tstringlist.Create;rntryrn f.LoadFromFile('c:\123ip.txt');//此处也可放其它已存在的文件。rn exceptrnend;rnif f.Count>10 then beginrnmemo1.Clear;rnmemo1.lines.add(f.text);rnf.Free;rn去掉多余的行和'\\'rn for ll:=memo1.lines.count-1 downto 0 do beginrn if strpos(pchar(memo1.lines.strings[ll]),'\\')=nil thenrn memo1.lines.delete(ll)rn elsern //memo1.lines.Strings[ll]:=delxxx(memo1.lines.Strings[ll]);rn 自编1个去'\\'的函数rn end;rnrnend;rnrnend;rnrnend.rnrn////////////rn运行时点接钮,正常运行rn代码都差不多rn不知是哪里不对,请指教。rn
数据库复制时出错,请指教
问题1:rn 我想把本机上的表结构,表数据,索引,存储过程等复制到远程服务器上,本机数据库中有用户AUC,口令AUC ,数据库名AUC ,rn 我用命令 exp AUC/AUC ,提示错误:rn EXP-00056: 遇到 ORACLE 错误 12560rn ORA-12560: TNS: 协议适配器错误rn EXP-00000: 导出终止失败rn 我看看AUC服务,什么都启动了,不知道为何?rn 还想问: 命令 exp AUC/AUC 是否可以讲数据导出?rnrn问题2:rn 想把导出的文件导入到同名数据库,同名用户下,是用命令 imp AUC/AUC 吗?rnrn 谢谢各位!
条件查询时出错,请指教
大家帮忙看一下这段条件查询语句:rnrnselect g.gid,g.gresult,s.studentnumber,s.studentName,c.specialFieldName,ss.sname,t.termname from grade g,studentInfo s,specialFieldInfo c,subject ss,termInfo t where g.gusernumber=s.studentNumber and g.terid=t.termId and g.classid=c.classid and g.subid=ss.sid "&sql_buser&" "&sql_ter_id&" "&sql_sub_id&" "&sql_cla_id&" order by g.gid desc rnrn"&sql_buser&" "&sql_ter_id&" "&sql_sub_id&" "&sql_cla_id&"是查询条件,已经在其他语句注明字段表示内容, 我调试时一直提示有错误。请高人指教,谢谢啦!rn
WindowBuilder Pro安装出错(求高手)!
eclipse安装WindowBuilder Pro时出以下错误是怎么回事?rnWarning:You are installing software that contains unsignd content.rn The authenticity or validity of this software cannot be established.rn Do you want to continue with the installation?
求高手帮忙!VS.NET安装出错!
安装MSDN LIBRARY 2003时,到复制dnservice.hxi时提示验证出错!rnrnrn请各位兄弟们帮个忙,是不是可以通过“自定义安装”跳过这个文件,(但是我不知道应该去掉那个选项可以跳过这个文件)或者可以通过其它方法解决这个问题,请兄弟务必帮个忙,小弟在这谢谢哦!!!
QWT安装出错,求高手解决。
按照安装方法先qmake qwt.pro,再nmake。但是nmake报错:rnin file included from src\qwt_curve.cpp:12:rninclude/qwt_curve.h:26:error:duplicate explicit instantiation of'class QMemArray'rnnmake:fatal error u1077:'g++':return code '0x1' stop.rn求高手解决这是什么错误?该如何解决?
blend 安装出错,求高手指点
[img=http://hi.csdn.net/attachment/201005/19/85322_12742374859878.jpg][/img]rnrn日志:rn10:52:59 2010年5月19日: -------------------------------------------------------------------------------------------------rn10:52:59 2010年5月19日: 信息: 启动安装程序会话rn10:52:59 2010年5月19日: 信息: 安装程序版本: 3.0.1938.0rn10:53:01 2010年5月19日: 信息: 已加载清单 BlendManifest。rn10:53:01 2010年5月19日: 信息: 已加载清单 SuiteCommonManifest。rn10:53:01 2010年5月19日: 信息: 已加载清单 BlendSDKManifest。rn10:53:01 2010年5月19日: 信息: 已加载清单 Silverlight_sdkManifest。rn10:53:01 2010年5月19日: 信息: 已加载清单 WPFToolkitManifest。rn10:53:01 2010年5月19日: 信息: 已合并清单 BlendManifest。rn10:53:01 2010年5月19日: 信息: 已合并清单 SuiteCommonManifest。rn10:53:01 2010年5月19日: 信息: 已合并清单 BlendSDKManifest。rn10:53:01 2010年5月19日: 信息: 已合并清单 Silverlight_sdkManifest。rn10:53:01 2010年5月19日: 信息: 已合并清单 WPFToolkitManifest。rn10:53:01 2010年5月19日: 信息: 产品名称: Microsoft Expression Blend 3 + SketchFlowrn10:53:01 2010年5月19日: 信息: 产品版本: 3.0.1938.0rn10:53:04 2010年5月19日: 信息: 应在“http://go.microsoft.com/fwlink/?LinkId=153315”处找到本地的发行说明。
安装ADO出错,请指教!
我下载了ADO26,安装后打开ODBC,报错(C:\SYSTEM32\ODBCINT.DLL)is a differentrnversion than the (c:\system32\odbcad32.exe).rn 在ASP中调用数据源时永远显示:Microsoft OLE DB Provider for ODBC Drivers (0x80040E4D).rn 请高手帮忙解决!!!!!!rnrn
安装mysql-python时出错
mysql-python安装时EnvironmentError: mysql_config not found 转自:http://www.cnblogs.com/xiazh/archive/2012/12/12/2814289.html 安利一篇我翻译的国外大牛的神经网络入门文章 在安装 mysql-python时,会出现: sh: mysql_config: not found Traceba...
安装JDK1.4.2时出错
为什么我在安装JDK1.4.2时,安装程序对话框中有一些文字无法显示,而是被一些方框(□□□□□,就是这些东东。)所代替。安装完毕后,JDK中是否也会出现方框?rn平台:Windows 2000 Professional 简体中文版rnJava来源:http;//www.sun.com/rnJava版本:J2SE JDK1.4.2
安装WAS时出错
在linux下安装WAS出错,执行./launchpad.sh后出现浏览器窗口,然后第一步安装WAS服务器,点击后没有反映。rn显示rn[root@localhost 32appserver]# ./launchpad.shrn+ firefox -P Profile_11570 -profile /tmp/IBM_LaunchPad_11570/Profile_11570 file:///mnt/hgfs/Share/32appserver/launchpad/Mozilla.htmlrnrn(Gecko:11675): GnomeUI-WARNING **: While connecting to session manager:rnAuthentication Rejected, reason : None of the authentication protocols specified are supported and host-based authentication failed.rnrn(Gecko:11675): GnomeUI-WARNING **: While connecting to session manager:rnAuthentication Rejected, reason : None of the authentication protocols specified are supported and host-based authentication failed.rn 是什么错误啊
安装FC7时出错!!
安装FC7时,在GRRB上执行kernel (hd0,4)/isolinux/ vmlinuz这个时出现"[Linux_bz image,setup=0x10040,size=0xc35547]"错误,,
vc6.0在安装时出错
vc6.0在安装时出错。以前安装该版本的VC6重来没有出现过问题,可是近期因为项目的问题需要使用,可是每次安装都在最后所有文件都拷贝完事之后出现错误,提示我安装失败。希望高手们指点迷津。提示信息如下:rn第一部分:(前后都有删减)rnallow you to install a subset of the windows nt system symbols (.dbg) files from your visual c++ cd-rom.rn第二部分:(前后都有删减)rnpdm.dll was unable to register itself in the system registry.
相关热词 c#部署端口监听项目、 c#接口中的属性使用方法 c# 昨天 c#func链接匿名方法 c#怎么创建文件夹 c#从键盘接收空格 c#da/ad c#部门请假管理系统 c#服务器socket c# 默认的访问修饰符