ubuntu 16 下编译openjdk7 发生如下错误 大神求解 5C

build.sh make sanity 成功返回 Sanity check passed。
make 过程中发生

图片说明

以下是部分 build.log 内容

sanity:
[echo] Sanity Settings:
[echo] ant.home=/usr/share/ant
[echo] ant.version=Apache Ant(TM) version 1.9.6 compiled on July 8 2015
[echo] ant.java.version=1.6
[echo] java.home=/usr/local/src/jdk1.6.0_45/jre
[echo] java.version=1.6.0_45
[echo] os.name=Linux
[echo] os.arch=amd64
[echo] os.version=4.13.0-37-generic
[echo] bootstrap.dir=/usr/local/src/openjdk7/build/../build-debug/langtools/dist/bootstrap
[echo] javac.jar=/usr/local/src/openjdk7/build/../build-debug/langtools/dist/bootstrap/lib/javac.jar
[echo] javac.memoryInitialSize=256m
[echo] javac.memoryMaximumSize=512m
[echo] javac.source=7
[echo] javac.debug=true
[echo] javac.target=7
[echo] javac.version.opt=
[echo] javac.lint.opts=
[echo] javac.no.jdk.warnings=-XDignore.symbol.file=true
[echo] output.dir=/usr/local/src/openjdk7/build/../build-debug/jaxws
[echo] build.dir=/usr/local/src/openjdk7/build/../build-debug/jaxws/build
[echo] dist.dir=/usr/local/src/openjdk7/build/../build-debug/jaxws/dist
[echo] drop.dir=${drop.dir}
[echo] drops.dir=/java/devtools/share/jdk7-drops
[echo]

init:

-jaxws_src-ready:

-jaxws_src-copy-bundle:

-jaxws_src-url-should-be-used:

-jaxws_src-url-bundle:

jaxws_src-update:

-jaf_src-ready:

-jaf_src-copy-bundle:

-jaf_src-url-should-be-used:

-jaf_src-url-bundle:
[echo] Downloading from https://java.net/downloads/jax-ws/JDK7/jdk7-jaf-2010_08_19.zip
[get] Getting: https://java.net/downloads/jax-ws/JDK7/jdk7-jaf-2010_08_19.zip
[get] To: /usr/local/src/openjdk7/build-debug/jaxws/drop/bundles/jdk7-jaf-2010_08_19.zip.temp
[get] https://java.net/downloads/jax-ws/JDK7/jdk7-jaf-2010_08_19.zip moved to http://www.oracle.com/splash/java.net/maintenance/index.html

BUILD FAILED
/usr/local/src/openjdk7/build-debug/jaxws/build/xml_generated/build-drop-jaf_src.xml:96: Redirection detected from https to http. Protocol switch unsafe, not allowed.

Total time: 2 seconds
Makefile:151: recipe for target 'all' failed
make[3]: *** [all] Error 1
make[3]: Leaving directory '/usr/local/src/openjdk7/jaxws/make'
make/jaxws-rules.gmk:42: recipe for target 'jaxws-build' failed
make[2]: *** [jaxws-build] Error 2
make[2]: Leaving directory '/usr/local/src/openjdk7'
Makefile:255: recipe for target 'generic_debug_build' failed
make[1]: *** [generic_debug_build] Error 2
make[1]: Leaving directory '/usr/local/src/openjdk7'
Makefile:263: recipe for target 'build_debug_image' failed
make: *** [build_debug_image] Error 2

1个回答

ubuntu16.0.2LTS下编译OpenJDK7

tj1256342445
苏格拉拉 回复qq_26626375: 你现在解决了吗?我也出现了这个问题
大约 2 年之前 回复
qq_26626375
鱼在云中游 我搜了 没有我这个error 如果您知晓.请指教
大约 2 年之前 回复
Csdn user default icon
上传中...
上传图片
插入图片
抄袭、复制答案,以达到刷声望分或其他目的的行为,在CSDN问答是严格禁止的,一经发现立刻封号。是时候展现真正的技术了!
立即提问
相关内容推荐