QT for android配置时,只有platform sdk installed 出现问题

图片说明
我已经安装好了sdk呀,为啥还是提示没安装
图片说明

6个回答

命令行中 输入 android /? 如果提示没有命令 配置下配置文件即可

zy841958835
cloudyzhao 回复wcx1293296315: 你的jdk什么版本的 尝试升级到1.8试试
接近 2 年之前 回复
qq_40550200
qq_40550200 没看懂
接近 2 年之前 回复
wcx1293296315
我是谁_谁是我 命令行输入时没有报错的,
接近 2 年之前 回复

你的Qt是什么版本?
我很顺利的就配置好了,我觉得你把NDK路径的中文名称改成英文试试?

wcx1293296315
我是谁_谁是我 qt10.01,好心累呀,不是ndk的事,事sdk不知道哪里错了
接近 2 年之前 回复

根据二楼的英文链接 我解决了这个问题 把JDK的版本换成成8就好啦

SDK Manager里 把出现问题的装上就行了

QT for android配置时,只有platform sdk installed 出现问题 10C
sdkandroidqt
图片说明
我已经安装好了sdk呀,为啥还是提示没安装
图片说明

Csdn user default icon
上传中...
上传图片
插入图片
抄袭、复制答案,以达到刷声望分或其他目的的行为,在CSDN问答是严格禁止的,一经发现立刻封号。是时候展现真正的技术了!
其他相关推荐
不能更新 android sdk 工具到 rev19
我下载了 GoogleAPI,但是提示说我必须更新android sdk工具,我在 sdk manager 中设置了,但是有下面的错误: Failed to rename directory C:\Users\Me\android-sdks\platform-tools to C:\Users\Me\android-sdks\temp\PlatformToolPackage.old01. Skipping 'Android SDK Tools, revision 19'; it depends on 'Android SDK Platform-tools, revision 11' which was not installed. 如何处理这个问题?
运行ionic cordova platform add android不成功
各位大神: 在运用Ionic 开发手机APP的过程中遇到困难,ionic安装的是最新的长期支持版的,cordova安装的也是最新版的,但在运行ionic start shop tabs后,再运行ionic cordova platform add android为项目增加Android平台支持不成功,命令行窗口出现如下: C:\Users\WangQitong\jdshop>ionic cordova platform add android C:\Users\WangQitong\jdshop>"node" "C:\Users\WangQitong\AppData\Roaming\npm\\node_modules\ionic\bin\ionic" cordova platform add android > cordova.cmd platform add android C:\Users\WangQitong\jdshop>"node" "C:\Users\WangQitong\AppData\Roaming\npm\\node_modules\cordova\bin\cordova" "platform" "add" "android" Using cordova-fetch for cordova-android@^8.0.0 Failed to fetch platform cordova-android@^8.0.0 Probably this is either a connection problem, or platform spec is incorrect. Check your connection and platform name/version/URL. Error: npm: Command failed with exit code 4294963238 Error output: npm WARN rm not removing C:\Users\WangQitong\jdshop\node_modules\.bin\webdriver-manager.cmd as it wasn't installed by C:\Users\WangQitong\jdshop\node_modules\webdriver-manager npm WARN rm not removing C:\Users\WangQitong\jdshop\node_modules\.bin\webdriver-manager as it wasn't installed by C:\Users\WangQitong\jdshop\node_modules\webdriver-manager npm WARN rm not removing C:\Users\WangQitong\jdshop\node_modules\.bin\webdriver-manager.cmd as it wasn't installed by C:\Users\WangQitong\jdshop\node_modules\_webdriver-manager@12.1.7@webdriver-manager npm WARN rm not removing C:\Users\WangQitong\jdshop\node_modules\.bin\webdriver-manager as it wasn't installed by C:\Users\WangQitong\jdshop\node_modules\_webdriver-manager@12.1.7@webdriver-manager npm WARN webpack-dev-middleware@3.7.2 requires a peer of webpack@^4.0.0 but none is installed. You must install peer dependencies yourself. npm WARN The package @angular/compiler is included as both a dev and production dependency. npm ERR! code ENOENT npm ERR! syscall rename npm ERR! path C:\Users\WangQitong\jdshop\node_modules\_brace-expansion@1.1.11@brace-expansion\node_modules\balanced-match npm ERR! dest C:\Users\WangQitong\jdshop\node_modules\_brace-expansion@1.1.11@brace-expansion\node_modules\balanced-match npm ERR! errno -4058 npm ERR! enoent ENOENT: no such file or directory, rename 'C:\Users\WangQitong\jdshop\node_modules\_brace-expansion@1.1.11@brace-expansion\node_modules\balanced-match' -> 'C:\Users\WangQitong\jdshop\node_modules\_brace-expansion@1.1.11@brace-expansion\node_modules\balanced-match' npm ERR! enoent This is related to npm not being able to find a file. npm ERR! enoent npm ERR! A complete log of this run can be found in: npm ERR! C:\Users\WangQitong\AppData\Roaming\npm-cache\_logs\2019-11-01T12_41_07_880Z-debug.log > ionic cordova resources android --force > cordova-res.cmd android [cordova-res] [cordova-res] C:\Users\WangQitong\jdshop>"node" "C:\Users\WangQitong\AppData\Roaming\npm\\node_modules\cordova-res\bin\cordova-res" "android" [cordova-res] Generated 18 resources for android [cordova-res] Wrote to config.xml 请问是什么原因呢?
Android studio安装时遇到的。
The following SDK components were not installed: build-tools-21.1.1, source-21, extra-android-m2repository, android-21, extra-google-m2repository, tools, platform-tools
android-sdk安装配置android2.3
Preparing to install archives Downloading SDK Platform Android 2.3.3, API 10, revision 2 Download interrupted: Connection to http://dl-ssl.google.com refused Downloading Samples for SDK API 10, revision 1 Download interrupted: Connection to http://dl-ssl.google.com refused Done. Nothing was installed. ---------------------------------------------------------------------------------- ![图片说明](https://img-ask.csdn.net/upload/201608/23/1471950344_926074.png) 以上是我在sdk-manager时弹出的日志。我也按照网上的说法,改了tool-》option的选项了,但是为什么还是报错呀?希望大神帮助解答!谢谢啦!
如何在qt上build Mysql drive
楼主系统是win10,最近在研究mysql和qt。 我在尝试用qt连接mysql服务器的时候, qt creator 告诉我说mysql drive no lead. 我去qt 的论坛上面问,人家说现在已经qt不提供mysql的drive,想用要自己搭。给我一个官方的文档,https://doc.qt.io/qt-5/sql-driver.html#how-to-build-the-qmysql-plugin-on-windows。 问题是,写文档的人估计很久没有装过mysql了,mysql安装器的Custom Install,已经没有Libs & Include Files的选项了。所以我很难确定如何执行cmd代码 ``` cd %QTDIR%\qtbase\src\plugins\sqldrivers qmake -- MYSQL_INCDIR=C:/MySQL/include "MYSQL_LIBDIR=C:/MYSQL/MySQL Server <version>/lib/opt" ``` 最后,我选择使用mysql server的文件, ``` cd %QTDIR%\qtbase\src\plugins\sqldrivers qmake -- "MYSQL_INCDIR=C:/MySql/MySQL Server 8.0/include" "MYSQL_LIBDIR=C:/MySql/MySQL Server 8.0/lib" ``` 得到结论, ``` Info: creating stash file C:\Qt\5.12.6\Src\qtbase\src\plugins\sqldrivers\.qmake.stash Running configuration tests... Checking for DB2 (IBM)... no Checking for InterBase... no Checking for MySQL... no Checking for OCI (Oracle)... no Checking for ODBC... yes Checking for PostgreSQL... no Checking for SQLite (version 2)... no Checking for TDS (Sybase)... no Done running configuration tests. Configure summary: Qt Sql Drivers: DB2 (IBM) .............................. no InterBase .............................. no MySql .................................. no OCI (Oracle) ........................... no ODBC ................................... yes PostgreSQL ............................. no SQLite2 ................................ no SQLite ................................. yes Using system provided SQLite ......... no TDS (Sybase) ........................... no Qt is now configured for building. Just run 'mingw32-make'. Once everything is built, you must run 'mingw32-make install'. Qt will be installed into 'C:\Qt\5.12.6\mingw73_32'. Prior to reconfiguration, make sure you remove any leftovers from the previous build. ``` 我检查了一下qmake log ``` Trying source 5 (type inline) of library mysql ... + cd /d C:\Qt\5.12.6\Src\qtbase\src\plugins\sqldrivers\config.tests\mysql && C:\Qt\5.12.6\mingw73_32\bin\qmake.exe "CONFIG -= qt debug_and_release app_bundle lib_bundle" "CONFIG += shared warn_off console single_arch" "QMAKE_LIBDIR += C:\\openssl\\lib C:\\Utils\\my_sql\\mysql-5.6.11-win32\\lib C:\\Utils\\postgresql\\pgsql\\lib" "INCLUDEPATH += C:\\openssl\\include C:\\Utils\\my_sql\\mysql-5.6.11-win32\\include C:\\Utils\\postgresql\\pgsql\\include" "QMAKE_USE += mysql" "QMAKE_LIBS_MYSQL = C:/MySQL/lib/libmysql.lib" "QMAKE_INCDIR_MYSQL = C:/MySQL/include" C:/Qt/5.12.6/Src/qtbase/src/plugins/sqldrivers/config.tests/mysql > Info: creating stash file C:\Qt\5.12.6\Src\qtbase\src\plugins\sqldrivers\config.tests\.qmake.stash + cd /d C:\Qt\5.12.6\Src\qtbase\src\plugins\sqldrivers\config.tests\mysql && set MAKEFLAGS=& mingw32-make > g++ -c -fno-keep-inline-dllexport -O2 -w -fexceptions -mthreads -DUNICODE -D_UNICODE -DWIN32 -DMINGW_HAS_SECURE_API=1 -I. -IC:\openssl\include -IC:\Utils\my_sql\mysql-5.6.11-win32\include -IC:\Utils\postgresql\pgsql\include -IC:\MySQL\include -IC:\Qt\5.12.6\mingw73_32\mkspecs\win32-g++ -o main.o main.cpp > g++ -Wl,-s -Wl,-subsystem,console -mthreads -o mysql.exe main.o -LC:\openssl\lib -LC:\Utils\my_sql\mysql-5.6.11-win32\lib -LC:\Utils\postgresql\pgsql\lib C:\MySQL\lib\libmysql.lib > c:/mingw/bin/../lib/gcc/mingw32/8.2.0/../../../../mingw32/bin/ld.exe: main.o:main.cpp:(.text.startup+0xc): undefined reference to `mysql_get_client_version@0' > collect2.exe: error: ld returned 1 exit status > mingw32-make: *** [Makefile:66: mysql.exe] Error 1 ``` 看来问题是出在了 undefined reference to `mysql_get_client_version@0' mysql看起来并没有进去。有没有熟悉mysql和qt的大佬解答一下。多谢了和最近有用qt的大佬解答一下。
Android Studio编程 加了进度条组件之后,报错,无法实例化应用
Android Studio编程 加了进度条组件之后,运行之后,报错,无法实例化应用 但运行之后,可以正常显示进度条 ``` <ProgressBar android:layout_width="fill_parent" android:layout_height="wrap_content" android:id="@+id/progress1" /> ``` ``` final ProgressBar progressBar = (ProgressBar)findViewById(R.id.progress1); ``` 报错信息 ``` java.lang.RuntimeException: Unable to instantiate application android.app.Application: java.lang.IllegalStateException: Unable to get package info for com.example.zp.myapplication_1; is package not installed?```
Disconnect 断开连接的问题
Problem Description An enemy state of our country is occupying an island of ours. They take lots of warships around the island. Communications among the warships are transited by wireless signal, but we have to separate the warships so that at least ONE pair of warships cannot communicate with each other. For that purpose, we create a kind of Wireless Signal Shielding Device (WSSD) that WSSD can shield the wireless signal in its shielding circle with radius R. The factories could produce enough WSSDs and our patrol team discovered a lot of places that could be installed with WSSDs. In order to separate the warships, we need to know the minimum value of radius R, smaller R is better because of the cost of manufacture. Please notice that because of the inflection of wireless signal, two warships can communicate with each other even there is no sight view between them. Input The input contains multiply test cases. The first line of each test case consists of two integers, n, m (0 < n, m <= 10000), which are the number of places where we can install WSSDs and the number of warships. Each of the next n lines contains two integers, indicating the coordinate of the place where we can install WSSDs. The next m lines indicate the coordinates of warships. The last test case is followed by a single line with two zeros which should not be processed. Please notice that all the values of coordinates are between -10000 to 10000, and no two coordinates have the same value. Output Output the minimum R with two fractional digits. Sample Input 4 3 -1 0 1 0 0 1 0 -1 10 0 9 0 0 0 4 3 -1 0 1 0 0 1 0 -1 10 0 9 0 -9 0 0 0 Sample Output 0.71 8.00
如何在ubuntu服务器部署uwsgi和nginx使我的django项目可以启动
django项目已经部署好,虚拟环境已经可以配置好, 项目目录: /data/mywork 在该目录下,启用虚拟环境用python3 manage.py runserver 0:8000可以正常启动网页 但是在配置uwsgi之后,只能出现: Welcome to nginx! If you see this page, the nginx web server is successfully installed and working. Further configuration is required. For online documentation and support please refer to nginx.org. Commercial support is available at nginx.com. Thank you for using nginx. 却无法访问我的网页,麻烦专家帮助解决
appium-desktop启动模拟器adb命令超时失败
1appium-desktop启动模拟器adb命令超时失败 2.使用appium-server启动没有问题 报错如下: ``` [Appium] Welcome to Appium v1.15.0 [Appium] Non-default server args: [Appium] allowInsecure: { [Appium] } [Appium] denyInsecure: { [Appium] } [Appium] Appium REST http interface listener started on 0.0.0.0:4723 [HTTP] --> POST /wd/hub/session [HTTP] {"capabilities":{"firstMatch":[{}],"alwaysMatch":{"platformName":"Android"}},"desiredCapabilities":{"platformName":"Android","platformVersion":"5.1.1","deviceName":"Android Emulator","appPackage":"com.android.calculator2","appActivity":".Calculator"}} [W3C] Calling AppiumDriver.createSession() with args: [{"platformName":"Android","platformVersion":"5.1.1","deviceName":"Android Emulator","appPackage":"com.android.calculator2","appActivity":".Calculator"},null,{"firstMatch":[{}],"alwaysMatch":{"platformName":"Android"}}] [BaseDriver] Event 'newSessionRequested' logged at 1571708607532 (09:43:27 GMT+0800 (中国标准时间)) [Appium] Could not parse W3C capabilities: 'deviceName' can't be blank [Appium] Trying to fix W3C capabilities by merging them with JSONWP caps [BaseDriver] The capabilities ["platformVersion","deviceName","appPackage","appActivity"] are not standard capabilities and should have an extension prefix [Appium] [Appium] ====================================================================== [Appium] DEPRECATION WARNING: [Appium] [Appium] The 'automationName' capability was not provided in the desired [Appium] capabilities for this Android session [Appium] [Appium] Setting 'automationName=UiAutomator2' by default and using the [Appium] UiAutomator2 Driver [Appium] [Appium] The next major version of Appium (2.x) will **require** the [Appium] 'automationName' capability to be set for all sessions on all [Appium] platforms [Appium] [Appium] In previous versions (Appium <= 1.13.x), the default was [Appium] 'automationName=UiAutomator1' [Appium] [Appium] If you wish to use that automation instead of UiAutomator2, please [Appium] add 'automationName=UiAutomator1' to your desired capabilities [Appium] [Appium] For more information about drivers, please visit [Appium] http://appium.io/docs/en/about-appium/intro/ and explore the [Appium] 'Drivers' menu [Appium] [Appium] ====================================================================== [Appium] [Appium] Appium v1.15.0 creating new AndroidUiautomator2Driver (v1.37.1) session [BaseDriver] W3C capabilities and MJSONWP desired capabilities were provided [BaseDriver] Creating session with W3C capabilities: { [BaseDriver] "alwaysMatch": { [BaseDriver] "platformName": "Android", [BaseDriver] "appium:platformVersion": "5.1.1", [BaseDriver] "appium:deviceName": "Android Emulator", [BaseDriver] "appium:appPackage": "com.android.calculator2", [BaseDriver] "appium:appActivity": ".Calculator" [BaseDriver] }, [BaseDriver] "firstMatch": [ [BaseDriver] {} [BaseDriver] ] [BaseDriver] } [BaseDriver] Session created with session id: 838e3971-499e-42b3-aacd-1ef1a14ff4be [UiAutomator2] Starting 'com.android.calculator2' directly on the device [ADB] Found 1 'build-tools' folders under 'E:\androidsdk\android-sdk-windows' (newest first): [ADB] E:/androidsdk/android-sdk-windows/build-tools/29.0.2 [ADB] Using 'adb.exe' from 'E:\androidsdk\android-sdk-windows\platform-tools\adb.exe' [AndroidDriver] Retrieving device list [ADB] Trying to find a connected android device [ADB] Getting connected devices... [ADB] Connected devices: [{"udid":"emulator-5554","state":"device"}] [AndroidDriver] Looking for a device with Android '5.1.1' [ADB] Setting device id to emulator-5554 [ADB] Getting device platform version [ADB] Running 'E:\androidsdk\android-sdk-windows\platform-tools\adb.exe -P 5037 -s emulator-5554 shell getprop ro.build.version.release' [ADB] Current device property 'ro.build.version.release': 5.1.1 [AndroidDriver] Using device: emulator-5554 [ADB] Using 'adb.exe' from 'E:\androidsdk\android-sdk-windows\platform-tools\adb.exe' [ADB] Setting device id to emulator-5554 [ADB] Running 'E:\androidsdk\android-sdk-windows\platform-tools\adb.exe -P 5037 -s emulator-5554 shell getprop ro.build.version.sdk' [ADB] Current device property 'ro.build.version.sdk': 22 [ADB] Device API level: 22 [AndroidDriver] No app sent in, not parsing package/activity [ADB] Running 'E:\androidsdk\android-sdk-windows\platform-tools\adb.exe -P 5037 -s emulator-5554 wait-for-device' [ADB] Running 'E:\androidsdk\android-sdk-windows\platform-tools\adb.exe -P 5037 -s emulator-5554 shell echo ping' [AndroidDriver] Pushing settings apk to device... [ADB] Getting install status for io.appium.settings [ADB] Running 'E:\androidsdk\android-sdk-windows\platform-tools\adb.exe -P 5037 -s emulator-5554 shell dumpsys package io.appium.settings' [ADB] 'io.appium.settings' is installed [ADB] Getting package info for 'io.appium.settings' [ADB] Running 'E:\androidsdk\android-sdk-windows\platform-tools\adb.exe -P 5037 -s emulator-5554 shell dumpsys package io.appium.settings' [ADB] Cannot extract apk info using apkanalyzer. Falling back to aapt. Original error: Could not find 'apkanalyzer.bat' in ["E:\\androidsdk\\android-sdk-windows\\platform-tools\\apkanalyzer.bat","E:\\androidsdk\\android-sdk-windows\\emulator\\apkanalyzer.bat","E:\\androidsdk\\android-sdk-windows\\tools\\apkanalyzer.bat","E:\\androidsdk\\android-sdk-windows\\tools\\bin\\apkanalyzer.bat","E:\\androidsdk\\android-sdk-windows\\build-tools\\29.0.2\\apkanalyzer.bat"]. Do you have Android Build Tools installed at 'E:\androidsdk\android-sdk-windows'? [ADB] Using 'aapt.exe' from 'E:\androidsdk\android-sdk-windows\build-tools\29.0.2\aapt.exe' [ADB] The version name of the installed 'io.appium.settings' is greater or equal to the application version name ('2.14.2' >= '2.14.2') [ADB] There is no need to install/upgrade 'C:\Users\Administrator\AppData\Local\Programs\Appium\resources\app\node_modules\appium\node_modules\io.appium.settings\apks\settings_apk-debug.apk' [ADB] Getting IDs of all 'io.appium.settings' processes [ADB] Running 'E:\androidsdk\android-sdk-windows\platform-tools\adb.exe -P 5037 -s emulator-5554 shell 'pgrep --help; echo $?'' [ADB] Running 'E:\androidsdk\android-sdk-windows\platform-tools\adb.exe -P 5037 -s emulator-5554 shell 'pidof --help > /dev/null; echo $?'' [ADB] Using ps-based PID detection [ADB] Running 'E:\androidsdk\android-sdk-windows\platform-tools\adb.exe -P 5037 -s emulator-5554 shell ps' [AndroidDriver] io.appium.settings is already running. There is no need to reset its permissions. [ADB] Running 'E:\androidsdk\android-sdk-windows\platform-tools\adb.exe -P 5037 -s emulator-5554 shell settings put secure mock_location 1' [Logcat] Starting logcat capture [ADB] Getting install status for io.appium.uiautomator2.server [ADB] Running 'E:\androidsdk\android-sdk-windows\platform-tools\adb.exe -P 5037 -s emulator-5554 shell dumpsys package io.appium.uiautomator2.server' [ADB] 'io.appium.uiautomator2.server' is installed [ADB] Getting package info for 'io.appium.uiautomator2.server' [ADB] Running 'E:\androidsdk\android-sdk-windows\platform-tools\adb.exe -P 5037 -s emulator-5554 shell dumpsys package io.appium.uiautomator2.server' [ADB] Cannot extract apk info using apkanalyzer. Falling back to aapt. Original error: Could not find 'apkanalyzer.bat' in ["E:\\androidsdk\\android-sdk-windows\\platform-tools\\apkanalyzer.bat","E:\\androidsdk\\android-sdk-windows\\emulator\\apkanalyzer.bat","E:\\androidsdk\\android-sdk-windows\\tools\\apkanalyzer.bat","E:\\androidsdk\\android-sdk-windows\\tools\\bin\\apkanalyzer.bat","E:\\androidsdk\\android-sdk-windows\\build-tools\\29.0.2\\apkanalyzer.bat"]. Do you have Android Build Tools installed at 'E:\androidsdk\android-sdk-windows'? [ADB] The version name of the installed 'io.appium.uiautomator2.server' is greater or equal to the application version name ('4.3.0' >= '4.3.0') [UiAutomator2] io.appium.uiautomator2.server installation state: sameVersionInstalled [ADB] Checking app cert for C:\Users\Administrator\AppData\Local\Programs\Appium\resources\app\node_modules\appium\node_modules\appium-uiautomator2-server\apks\appium-uiautomator2-server-v4.3.0.apk [ADB] Using 'apksigner.bat' from 'E:\androidsdk\android-sdk-windows\build-tools\29.0.2\apksigner.bat' [ADB] Starting 'E:\androidsdk\android-sdk-windows\build-tools\29.0.2\apksigner.bat' with args '["verify","--print-certs","C:\\Users\\Administrator\\AppData\\Local\\Programs\\Appium\\resources\\app\\node_modules\\appium\\node_modules\\appium-uiautomator2-server\\apks\\appium-uiautomator2-server-v4.3.0.apk"]' [ADB] apksigner stdout: Signer #1 certificate DN: EMAILADDRESS=android@android.com, CN=Android, OU=Android, O=Android, L=Mountain View, ST=California, C=US [ADB] Signer #1 certificate SHA-256 digest: a40da80a59d170caa950cf15c18c454d47a39b26989d8b640ecd745ba71bf5dc [ADB] Signer #1 certificate SHA-1 digest: 61ed377e85d386a8dfee6b864bd85b0bfaa5af81 [ADB] Signer #1 certificate MD5 digest: e89b158e4bcf988ebd09eb83f5378e87 [ADB] [ADB] 'C:\Users\Administrator\AppData\Local\Programs\Appium\resources\app\node_modules\appium\node_modules\appium-uiautomator2-server\apks\appium-uiautomator2-server-v4.3.0.apk' is already signed. [ADB] Getting install status for io.appium.uiautomator2.server.test [ADB] Running 'E:\androidsdk\android-sdk-windows\platform-tools\adb.exe -P 5037 -s emulator-5554 shell dumpsys package io.appium.uiautomator2.server.test' [ADB] 'io.appium.uiautomator2.server.test' is not installed [ADB] Checking app cert for C:\Users\Administrator\AppData\Local\Programs\Appium\resources\app\node_modules\appium\node_modules\appium-uiautomator2-server\apks\appium-uiautomator2-server-debug-androidTest.apk [ADB] Starting 'E:\androidsdk\android-sdk-windows\build-tools\29.0.2\apksigner.bat' with args '["verify","--print-certs","C:\\Users\\Administrator\\AppData\\Local\\Programs\\Appium\\resources\\app\\node_modules\\appium\\node_modules\\appium-uiautomator2-server\\apks\\appium-uiautomator2-server-debug-androidTest.apk"]' [ADB] apksigner stdout: Signer #1 certificate DN: EMAILADDRESS=android@android.com, CN=Android, OU=Android, O=Android, L=Mountain View, ST=California, C=US [ADB] Signer #1 certificate SHA-256 digest: a40da80a59d170caa950cf15c18c454d47a39b26989d8b640ecd745ba71bf5dc [ADB] Signer #1 certificate SHA-1 digest: 61ed377e85d386a8dfee6b864bd85b0bfaa5af81 [ADB] Signer #1 certificate MD5 digest: e89b158e4bcf988ebd09eb83f5378e87 [ADB] [ADB] 'C:\Users\Administrator\AppData\Local\Programs\Appium\resources\app\node_modules\appium\node_modules\appium-uiautomator2-server\apks\appium-uiautomator2-server-debug-androidTest.apk' is already signed. [UiAutomator2] Server packages are going to be (re)installed [ADB] Running 'E:\androidsdk\android-sdk-windows\platform-tools\adb.exe -P 5037 -s emulator-5554 shell 'ls -t -1 /data/local/tmp/appium_cache 2>&1 || echo _ERROR_'' [ADB] The current Android API does not support extended ls options. Defaulting to no-options call [ADB] Running 'E:\androidsdk\android-sdk-windows\platform-tools\adb.exe -P 5037 -s emulator-5554 shell 'ls /data/local/tmp/appium_cache 2>&1 || echo _ERROR_'' [ADB] The count of applications in the cache: 2 [ADB] The application at 'C:\Users\Administrator\AppData\Local\Programs\Appium\resources\app\node_modules\appium\node_modules\appium-uiautomator2-server\apks\appium-uiautomator2-server-v4.3.0.apk' is already cached to '/data/local/tmp/appium_cache/0cc1725a60a05dbb5d0d09256f2fc6ece7e3b10f.apk' [ADB] Running 'E:\androidsdk\android-sdk-windows\platform-tools\adb.exe -P 5037 -s emulator-5554 shell pm install -r /data/local/tmp/appium_cache/0cc1725a60a05dbb5d0d09256f2fc6ece7e3b10f.apk' [UiAutomator2] Deleting UiAutomator2 session [UiAutomator2] Deleting UiAutomator2 server session [WD Proxy] Matched '/' to command name 'deleteSession' [UiAutomator2] Did not get confirmation UiAutomator2 deleteSession worked; Error was: UnknownError: An unknown server-side error occurred while processing the command. Original error: Trying to proxy a session command without session id [ADB] Running 'E:\androidsdk\android-sdk-windows\platform-tools\adb.exe -P 5037 -s emulator-5554 shell am force-stop com.android.calculator2' [Logcat] Stopping logcat capture [ADB] Removing forwarded port socket connection: 8200 [ADB] Running 'E:\androidsdk\android-sdk-windows\platform-tools\adb.exe -P 5037 -s emulator-5554 forward --remove tcp\:8200' [UiAutomator2] Unable to remove port forward 'Error executing adbExec. Original error: 'Command 'E:\\androidsdk\\android-sdk-windows\\platform-tools\\adb.exe -P 5037 -s emulator-5554 forward --remove tcp\:8200' exited with code 1'; Stderr: 'adb.exe: error: listener 'tcp:8200' not found'; Code: '1'' [BaseDriver] Event 'newSessionStarted' logged at 1571708636226 (09:43:56 GMT+0800 (中国标准时间)) [W3C] Encountered internal error running command: Error executing adbExec. Original error: 'Command 'E:\\androidsdk\\android-sdk-windows\\platform-tools\\adb.exe -P 5037 -s emulator-5554 shell pm install -r /data/local/tmp/appium_cache/0cc1725a60a05dbb5d0d09256f2fc6ece7e3b10f.apk' timed out after 20000ms'. Try to increase the 20000ms adb execution timeout represented by 'uiautomator2ServerInstallTimeout' capability [W3C] Error: Command 'E:\\androidsdk\\android-sdk-windows\\platform-tools\\adb.exe -P 5037 -s emulator-5554 shell pm install -r /data/local/tmp/appium_cache/0cc1725a60a05dbb5d0d09256f2fc6ece7e3b10f.apk' timed out after 20000ms [W3C] at Timeout.setTimeout (C:\Users\Administrator\AppData\Local\Programs\Appium\resources\app\node_modules\appium\node_modules\teen_process\lib\exec.js:125:19) [W3C] at ontimeout (timers.js:427:11) [W3C] at tryOnTimeout (timers.js:289:5) [W3C] at listOnTimeout (timers.js:252:5) [W3C] at Timer.processTimers (timers.js:212:10) [HTTP] <-- POST /wd/hub/session 500 28715 ms - 1450 [HTTP] ```
pycham中django项目中导入自定义模块报错
从进行数据迁移的时候,报的错。 从comment/models.py 导入blog/models.py中的Post类。刚接触这个,上网查了整不懂。。。![图片说明](https://img-ask.csdn.net/upload/202002/09/1581227182_368122.jpg)![图片说明](https://img-ask.csdn.net/upload/202002/09/1581227190_265330.jpg)![图片说明](https://img-ask.csdn.net/upload/202002/09/1581227198_245260.jpg) 查的一般都说工作目录下搜不到这个目录,求大神告知 下面是我的报错 (venv) C:\Users\hty11\PycharmProjects\typeidea\typeidea>python manage.py makemigrations C:\Users\hty11\PycharmProjects\typeidea\typeidea C:\Users\hty11\PycharmProjects\typeidea C:\Users\hty11\AppData\Local\Programs\Python\Python38-32\python38.zip C:\Users\hty11\AppData\Local\Programs\Python\Python38-32\DLLs C:\Users\hty11\AppData\Local\Programs\Python\Python38-32\lib C:\Users\hty11\AppData\Local\Programs\Python\Python38-32 C:\Users\hty11\PycharmProjects\typeidea\venv C:\Users\hty11\PycharmProjects\typeidea\venv\lib\site-packages C:\Users\hty11\PycharmProjects\typeidea\venv\lib\site-packages\setuptools-40.8.0-py3.8.egg C:\Users\hty11\PycharmProjects\typeidea\venv\lib\site-packages\pip-19.0.3-py3.8.egg C:\Users\hty11\PycharmProjects\typeidea\typeidea\blog\models.py Traceback (most recent call last): File "manage.py", line 24, in <module> main() File "manage.py", line 20, in main execute_from_command_line(sys.argv) File "C:\Users\hty11\PycharmProjects\typeidea\venv\lib\site-packages\django\core\management\__init__.py", line 381, in execute_from_command_line utility.execute() File "C:\Users\hty11\PycharmProjects\typeidea\venv\lib\site-packages\django\core\management\__init__.py", line 357, in execute django.setup() File "C:\Users\hty11\PycharmProjects\typeidea\venv\lib\site-packages\django\__init__.py", line 24, in setup apps.populate(settings.INSTALLED_APPS) File "C:\Users\hty11\PycharmProjects\typeidea\venv\lib\site-packages\django\apps\registry.py", line 114, in populate app_config.import_models() File "C:\Users\hty11\PycharmProjects\typeidea\venv\lib\site-packages\django\apps\config.py", line 211, in import_models self.models_module = import_module(models_module_name) File "C:\Users\hty11\AppData\Local\Programs\Python\Python38-32\lib\importlib\__init__.py", line 127, in import_module return _bootstrap._gcd_import(name[level:], package, level) File "<frozen importlib._bootstrap>", line 1014, in _gcd_import File "<frozen importlib._bootstrap>", line 991, in _find_and_load File "<frozen importlib._bootstrap>", line 975, in _find_and_load_unlocked File "<frozen importlib._bootstrap>", line 671, in _load_unlocked File "<frozen importlib._bootstrap_external>", line 783, in exec_module File "<frozen importlib._bootstrap>", line 219, in _call_with_frames_removed File "C:\Users\hty11\PycharmProjects\typeidea\typeidea\comment\models.py", line 7, in <module> from typeidea.blog.models import Post ModuleNotFoundError: No module named 'typeidea.blog' ![图片说明](https://img-ask.csdn.net/upload/202002/09/1581237107_695039.jpg) C:\Users\hty11\PycharmProjects\typeidea\typeidea C:\Users\hty11\PycharmProjects\typeidea C:\Users\hty11\AppData\Local\Programs\Python\Python38-32\python38.zip C:\Users\hty11\AppData\Local\Programs\Python\Python38-32\DLLs C:\Users\hty11\AppData\Local\Programs\Python\Python38-32\lib C:\Users\hty11\AppData\Local\Programs\Python\Python38-32 C:\Users\hty11\PycharmProjects\typeidea\venv C:\Users\hty11\PycharmProjects\typeidea\venv\lib\site-packages C:\Users\hty11\PycharmProjects\typeidea\venv\lib\site-packages\setuptools-40.8.0-py3.8.egg C:\Users\hty11\PycharmProjects\typeidea\venv\lib\site-packages\pip-19.0.3-py3.8.egg C:\Users\hty11\PycharmProjects\typeidea
运行 tensorflow ,能正确输出结果,但同时有其他的一些提示,不懂是为什么
代码很简短,目前正在学习中。 ``` import tensorflow as tf a = [[1, 0, 3], [8, -3, 6], [5, 1, 7]] with tf.Session() as sess: print(sess.run(tf.argmax(a, 1))) print(sess.run(tf.argmax(a, 0))) ``` 输出结果如下,不知道为什么会出现这些提示,求高人指点。 E:\anaconda\python.exe D:/pycharm文件/try.py 2020-01-09 22:18:54.342546: I tensorflow/stream_executor/platform/default/dso_loader.cc:44] Successfully opened dynamic library cudart64_100.dll WARNING:tensorflow:From D:/pycharm文件/try.py:5: The name tf.Session is deprecated. Please use tf.compat.v1.Session instead. 2020-01-09 22:18:56.348961: I tensorflow/stream_executor/platform/default/dso_loader.cc:44] Successfully opened dynamic library nvcuda.dll 2020-01-09 22:18:57.534582: I tensorflow/core/common_runtime/gpu/gpu_device.cc:1618] Found device 0 with properties: name: GeForce GTX 1660 Ti with Max-Q Design major: 7 minor: 5 memoryClockRate(GHz): 1.335 pciBusID: 0000:01:00.0 2020-01-09 22:18:57.535147: I tensorflow/stream_executor/platform/default/dso_loader.cc:44] Successfully opened dynamic library cudart64_100.dll 2020-01-09 22:18:57.539354: I tensorflow/stream_executor/platform/default/dso_loader.cc:44] Successfully opened dynamic library cublas64_100.dll 2020-01-09 22:18:57.543360: I tensorflow/stream_executor/platform/default/dso_loader.cc:44] Successfully opened dynamic library cufft64_100.dll 2020-01-09 22:18:57.545647: I tensorflow/stream_executor/platform/default/dso_loader.cc:44] Successfully opened dynamic library curand64_100.dll 2020-01-09 22:18:57.550333: I tensorflow/stream_executor/platform/default/dso_loader.cc:44] Successfully opened dynamic library cusolver64_100.dll 2020-01-09 22:18:57.554235: I tensorflow/stream_executor/platform/default/dso_loader.cc:44] Successfully opened dynamic library cusparse64_100.dll 2020-01-09 22:18:57.556270: W tensorflow/stream_executor/platform/default/dso_loader.cc:55] Could not load dynamic library 'cudnn64_7.dll'; dlerror: cudnn64_7.dll not found 2020-01-09 22:18:57.556681: W tensorflow/core/common_runtime/gpu/gpu_device.cc:1641] Cannot dlopen some GPU libraries. Please make sure the missing libraries mentioned above are installed properly if you would like to use GPU. Follow the guide at https://www.tensorflow.org/install/gpu for how to download and setup the required libraries for your platform. Skipping registering GPU devices... 2020-01-09 22:18:57.558041: I tensorflow/core/platform/cpu_feature_guard.cc:142] Your CPU supports instructions that this TensorFlow binary was not compiled to use: AVX2 2020-01-09 22:18:57.560801: I tensorflow/core/common_runtime/gpu/gpu_device.cc:1159] Device interconnect StreamExecutor with strength 1 edge matrix: 2020-01-09 22:18:57.561152: I tensorflow/core/common_runtime/gpu/gpu_device.cc:1165] [2 0 2] [1 2 2] Process finished with exit code 0
HeavenHelix 代码的编写
Problem Description It's said that MJ was invited to perform for the God. Unfortunately, God was intoxicated in the excellent voice and the moonwalk of MJ. The second day, God said, "Let there be MJ and there was MJ." So MJ stayed, leaving his poor fans' hearts broken ... (Sounds unrealistic.) However, when the third day passed, MJ missed his Neverland so much. His soulful songs conveyed the sorrow to the God. So God built a new Neverland in the Heaven on the forth day. It is said that there is a Roller Coaster called HeavenHelix in the new Neverland. It is so huge that the train seemed to be just a point. The train does uniform circular motion on horizontal plane(The radius is r,and the angular speed is ω rad/s),while it does uniform liner motion in vertical direction(The speed is v m/s)from the top to the bottom. To monitor the train, there is a camera installed on the bottom, where the center of the circle is located. The amount of energy the camera consumes is up to the distance between the train and itself: Assuming the distance is D meters, and in the very moment it travels ds meters, the camera should consume X*D*ds kJ energy from the God. When the Neverland was built, God distributed E kJ energy to the camera initially. God had calculated accurately to make sure that the train will be exactly on the bottom, as soon as the energy is used up. MJ wanted to know how long he can enjoy himself riding the HeavenHelix the sky. Can you help him? Input There are multiple cases. In each case, there will be only one line, containing five integers, r,ω, v, X and E (r≥0, ω≥0, v > 0, X > 0, E≥0), which have the same meaning mentioned above. All the numbers are smaller than 231. The input will be terminated by five zero, which were not need to be proceeded. There is a correct answer for each case. Output For each case, output the total time of the train ran before its stop in a single line. Present the answer in seconds, and accurate to 4 decimal places. You may assume that MJ can ride the HeavenHelix for at most 30 days. Sample Input 1 1 2 2 2 0 0 0 0 0 Sample Output 0.4062
eclipse 和 java 的安装问题
![图片说明](https://img-ask.csdn.net/upload/202002/03/1580678242_562599.png)!![图片说明](https://img-ask.csdn.net/upload/202002/03/1580678291_96124.png) 由于我是一个小白,我在按着教程安装eclipse的时候发现无法打开,并且安装了java的网上上教程中要求的插件。但是环境变量一直显示错误以及无法打开eclipse我直接将其下载的两个文件夹删除了,想着从头再弄一遍,结果开始显示无法找到文件。现在出现了这样的情况请问各位大佬怎么办。我真的是小白!!!!! 截图由于无法上传我手打吧 点开eclipse的压缩包显示Error: could not open 'D:\java\java Runtime\lib\amd64\jvm.cfg 这里是我原来的安装的文件夹的路径 点开java的压缩包显示 This bersioin of the jdk is alreadyu installed. please uninstall the jdk and run this installer again to reinstall. 我看的懂,可是要咋弄啊??????? 大哥们
Disconnect 的问题
Problem Description An enemy state of our country is occupying an island of ours. They take lots of warships around the island. Communications among the warships are transited by wireless signal, but we have to separate the warships so that at least ONE pair of warships cannot communicate with each other. For that purpose, we create a kind of Wireless Signal Shielding Device (WSSD) that WSSD can shield the wireless signal in its shielding circle with radius R. The factories could produce enough WSSDs and our patrol team discovered a lot of places that could be installed with WSSDs. In order to separate the warships, we need to know the minimum value of radius R, smaller R is better because of the cost of manufacture. Please notice that because of the inflection of wireless signal, two warships can communicate with each other even there is no sight view between them. Input The input contains multiply test cases. The first line of each test case consists of two integers, n, m (0 < n, m <= 10000), which are the number of places where we can install WSSDs and the number of warships. Each of the next n lines contains two integers, indicating the coordinate of the place where we can install WSSDs. The next m lines indicate the coordinates of warships. The last test case is followed by a single line with two zeros which should not be processed. Please notice that all the values of coordinates are between -10000 to 10000, and no two coordinates have the same value. Output Output the minimum R with two fractional digits. Sample Input 4 3 -1 0 1 0 0 1 0 -1 10 0 9 0 0 0 4 3 -1 0 1 0 0 1 0 -1 10 0 9 0 -9 0 0 0 Sample Output 0.71 8.00
Appium+Python爬虫无法启动APP
非计算机专业,初学python和appium,需要抓取小红书APP的数据,连接夜神模拟器,但是无法启动APP,一直报错找不到原因,下面放上appium工作日志希望各路大神可以帮帮忙。谢谢大家! ``` [W3C] Calling AppiumDriver.createSession() with args: [{"platformName":"Android","deviceName":"127.0.0.1:62025","appPackage":"com.xingin.xhs","platformVersion":"5.1.1","appActivity":".activity.SplashActivity","noReset":true,"unicodeKeyboard":true},null,{"firstMatch":[{"platformName":"Android","appium:deviceName":"127.0.0.1:62025","appium:appPackage":"com.xingin.xhs","appium:platformVersion":"5.1.1","appium:appActivity":".activity.SplashActivity","appium:noReset":true,"appium:unicodeKeyboard":true}]}] [BaseDriver] Event 'newSessionRequested' logged at 1553679403156 (17:36:43 GMT+0800 (中国标准时间)) [Appium] DeprecationWarning: 'automationName' capability was not provided. Future versions of Appium will require 'automationName' capability to be set for Android sessions. [Appium] Setting automation to 'UiAutomator1'. [Appium] Creating new AndroidDriver (v4.8.0) session [Appium] Capabilities: [Appium] platformName: Android [Appium] deviceName: 127.0.0.1:62025 [Appium] appPackage: com.xingin.xhs [Appium] platformVersion: 5.1.1 [Appium] appActivity: .activity.SplashActivity [Appium] noReset: true [Appium] unicodeKeyboard: true [BaseDriver] W3C capabilities {"alwaysMatch":{"platformNa... and MJSONWP desired capabilities {"platformName":"Android","... were provided [BaseDriver] Creating session with W3C capabilities: {"alwaysMatch":{"platformNa... [BaseDriver] Session created with session id: 4aa3fc42-b895-499c-b714-aaaf47854f3a [AndroidDriver] Java version is: 1.8.0_201 [AndroidDriver] Retrieving device list [ADB] Trying to find a connected android device [ADB] Getting connected devices... [ADB] 1 device(s) connected [AndroidDriver] Looking for a device with Android '5.1.1' [ADB] Setting device id to 127.0.0.1:62001 [ADB] Getting device platform version [ADB] Running 'D:\android-sdk\sdk\adt-bundle-windows-x86_64-20140702\sdk\platform-tools\adb.exe -P 5037 -s 127.0.0.1\:62001 shell getprop ro.build.version.release' [ADB] Current device property 'ro.build.version.release': 5.1.1 [AndroidDriver] Using device: 127.0.0.1:62001 [ADB] Setting device id to 127.0.0.1:62001 [ADB] Running 'D:\android-sdk\sdk\adt-bundle-windows-x86_64-20140702\sdk\platform-tools\adb.exe -P 5037 -s 127.0.0.1\:62001 shell getprop ro.build.version.sdk' [ADB] Current device property 'ro.build.version.sdk': 22 [ADB] Device API level: 22 [AndroidDriver] App file was not listed, instead we're going to run com.xingin.xhs directly on the device [AndroidDriver] Checking whether package is present on the device [ADB] Running 'D:\android-sdk\sdk\adt-bundle-windows-x86_64-20140702\sdk\platform-tools\adb.exe -P 5037 -s 127.0.0.1\:62001 shell pm list packages com.xingin.xhs' [AndroidDriver] Starting Android session [ADB] Running 'D:\android-sdk\sdk\adt-bundle-windows-x86_64-20140702\sdk\platform-tools\adb.exe -P 5037 -s 127.0.0.1\:62001 wait-for-device' [ADB] Running 'D:\android-sdk\sdk\adt-bundle-windows-x86_64-20140702\sdk\platform-tools\adb.exe -P 5037 -s 127.0.0.1\:62001 shell echo ping' [AndroidDriver] Pushing settings apk to device... [ADB] Getting install status for io.appium.settings [ADB] Running 'D:\android-sdk\sdk\adt-bundle-windows-x86_64-20140702\sdk\platform-tools\adb.exe -P 5037 -s 127.0.0.1\:62001 shell dumpsys package io.appium.settings' [ADB] 'io.appium.settings' is not installed [ADB] App 'C:\Users\zlp\AppData\Local\Programs\Appium\resources\app\node_modules\appium\node_modules\io.appium.settings\apks\settings_apk-debug.apk' is not installed [ADB] Installing 'C:\Users\zlp\AppData\Local\Programs\Appium\resources\app\node_modules\appium\node_modules\io.appium.settings\apks\settings_apk-debug.apk' [ADB] Skipping permissions grant option, since the current API level 22 does not support applications permissions customization [ADB] Running 'D:\android-sdk\sdk\adt-bundle-windows-x86_64-20140702\sdk\platform-tools\adb.exe -P 5037 -s 127.0.0.1\:62001 install C\:\\Users\\zlp\\AppData\\Local\\Programs\\Appium\\resources\\app\\node_modules\\appium\\node_modules\\io.appium.settings\\apks\\settings_apk-debug.apk' [ADB] Install command stdout: pkg: /data/local/tmp/settings_apk-debug.apk [ADB] Success [ADB] Getting IDs of all 'io.appium.settings' processes [ADB] Running 'D:\android-sdk\sdk\adt-bundle-windows-x86_64-20140702\sdk\platform-tools\adb.exe -P 5037 -s 127.0.0.1\:62001 shell 'pgrep --help; echo $?'' [ADB] Running 'D:\android-sdk\sdk\adt-bundle-windows-x86_64-20140702\sdk\platform-tools\adb.exe -P 5037 -s 127.0.0.1\:62001 shell 'pidof --help > /dev/null; echo $?'' [ADB] Using ps-based PID detection [ADB] Running 'D:\android-sdk\sdk\adt-bundle-windows-x86_64-20140702\sdk\platform-tools\adb.exe -P 5037 -s 127.0.0.1\:62001 shell ps' [AndroidDriver] Granting android.permission.SET_ANIMATION_SCALE, CHANGE_CONFIGURATION, ACCESS_FINE_LOCATION by pm grant [ADB] Granting permissions ["android.permission.SET_ANIMATION_SCALE","android.permission.CHANGE_CONFIGURATION","android.permission.ACCESS_FINE_LOCATION"] to 'io.appium.settings' [ADB] Got the following command chunks to execute: [["pm","grant","io.appium.settings","android.permission.SET_ANIMATION_SCALE",";","pm","grant","io.appium.settings","android.permission.CHANGE_CONFIGURATION",";","pm","grant","io.appium.settings","android.permission.ACCESS_FINE_LOCATION",";"]] [ADB] Running 'D:\android-sdk\sdk\adt-bundle-windows-x86_64-20140702\sdk\platform-tools\adb.exe -P 5037 -s 127.0.0.1\:62001 shell pm grant io.appium.settings android.permission.SET_ANIMATION_SCALE \; pm grant io.appium.settings android.permission.CHANGE_CONFIGURATION \; pm grant io.appium.settings android.permission.ACCESS_FINE_LOCATION \;' [ADB] Running 'D:\android-sdk\sdk\adt-bundle-windows-x86_64-20140702\sdk\platform-tools\adb.exe -P 5037 -s 127.0.0.1\:62001 shell am start -W -n io.appium.settings/.Settings -a android.intent.action.MAIN -c android.intent.category.LAUNCHER -f 0x10200000' [ADB] Running 'D:\android-sdk\sdk\adt-bundle-windows-x86_64-20140702\sdk\platform-tools\adb.exe -P 5037 -s 127.0.0.1\:62001 shell settings put secure mock_location 1' [Logcat] Starting logcat capture [AndroidDriver] Enabling Unicode keyboard support [ADB] Running 'D:\android-sdk\sdk\adt-bundle-windows-x86_64-20140702\sdk\platform-tools\adb.exe -P 5037 -s 127.0.0.1\:62001 shell settings get secure default_input_method' [AndroidDriver] Unsetting previous IME com.android.inputservice/.InputService [AndroidDriver] Setting IME to 'io.appium.settings/.UnicodeIME' [ADB] Running 'D:\android-sdk\sdk\adt-bundle-windows-x86_64-20140702\sdk\platform-tools\adb.exe -P 5037 -s 127.0.0.1\:62001 shell ime enable io.appium.settings/.UnicodeIME' [ADB] Running 'D:\android-sdk\sdk\adt-bundle-windows-x86_64-20140702\sdk\platform-tools\adb.exe -P 5037 -s 127.0.0.1\:62001 shell ime set io.appium.settings/.UnicodeIME' [ADB] Getting device platform version [ADB] Running 'D:\android-sdk\sdk\adt-bundle-windows-x86_64-20140702\sdk\platform-tools\adb.exe -P 5037 -s 127.0.0.1\:62001 shell getprop ro.build.version.release' [ADB] Current device property 'ro.build.version.release': 5.1.1 [ADB] Running 'D:\android-sdk\sdk\adt-bundle-windows-x86_64-20140702\sdk\platform-tools\adb.exe -P 5037 -s 127.0.0.1\:62001 shell wm size' [ADB] Running 'D:\android-sdk\sdk\adt-bundle-windows-x86_64-20140702\sdk\platform-tools\adb.exe -P 5037 -s 127.0.0.1\:62001 shell getprop ro.product.model' [ADB] Current device property 'ro.product.model': MI 6 [ADB] Running 'D:\android-sdk\sdk\adt-bundle-windows-x86_64-20140702\sdk\platform-tools\adb.exe -P 5037 -s 127.0.0.1\:62001 shell getprop ro.product.manufacturer' [ADB] Current device property 'ro.product.manufacturer': Xiaomi [AndroidDriver] No app sent in, not parsing package/activity [AndroidDriver] No app capability. Assuming it is already on the device [AndroidBootstrap] Watching for bootstrap disconnect [ADB] Forwarding system: 4724 to device: 4724 [ADB] Running 'D:\android-sdk\sdk\adt-bundle-windows-x86_64-20140702\sdk\platform-tools\adb.exe -P 5037 -s 127.0.0.1\:62001 forward tcp\:4724 tcp\:4724' [UiAutomator] Starting UiAutomator [UiAutomator] Moving to state 'starting' [UiAutomator] Parsing uiautomator jar [UiAutomator] Found jar name: 'AppiumBootstrap.jar' [ADB] Running 'D:\android-sdk\sdk\adt-bundle-windows-x86_64-20140702\sdk\platform-tools\adb.exe -P 5037 -s 127.0.0.1\:62001 push C\:\\Users\\zlp\\AppData\\Local\\Programs\\Appium\\resources\\app\\node_modules\\appium\\node_modules\\appium-android-driver\\bootstrap\\bin\\AppiumBootstrap.jar /data/local/tmp/' [ADB] Attempting to kill all uiautomator processes [ADB] Getting IDs of all 'uiautomator' processes [ADB] Using ps-based PID detection [ADB] Running 'D:\android-sdk\sdk\adt-bundle-windows-x86_64-20140702\sdk\platform-tools\adb.exe -P 5037 -s 127.0.0.1\:62001 shell ps' [ADB] No 'uiautomator' process has been found [UiAutomator] Starting UIAutomator [ADB] Creating ADB subprocess with args: ["-P",5037,"-s","127.0.0.1:62001","shell","uiautomator","runtest","AppiumBootstrap.jar","-c","io.appium.android.bootstrap.Bootstrap","-e","pkg","com.xingin.xhs","-e","disableAndroidWatchers",false,"-e","acceptSslCerts",false] [UiAutomator] Moving to state 'online' [AndroidBootstrap] [BOOTSTRAP LOG] [debug] Loading json... [AndroidBootstrap] [BOOTSTRAP LOG] [debug] Registered crash watchers. [AndroidBootstrap] Android bootstrap socket is now connected [ADB] Running 'D:\android-sdk\sdk\adt-bundle-windows-x86_64-20140702\sdk\platform-tools\adb.exe -P 5037 -s 127.0.0.1\:62001 shell dumpsys window' [AndroidBootstrap] [BOOTSTRAP LOG] [debug] Client connected [AndroidDriver] Screen already unlocked, doing nothing [ADB] Running 'D:\android-sdk\sdk\adt-bundle-windows-x86_64-20140702\sdk\platform-tools\adb.exe -P 5037 -s 127.0.0.1\:62001 shell am start -W -n com.xingin.xhs/.activity.SplashActivity -S' [AndroidDriver] Shutting down Android driver [ADB] Running 'D:\android-sdk\sdk\adt-bundle-windows-x86_64-20140702\sdk\platform-tools\adb.exe -P 5037 -s 127.0.0.1\:62001 shell am force-stop com.xingin.xhs' [BaseDriver] Event 'newSessionStarted' logged at 1553679571306 (17:39:31 GMT+0800 (中国标准时间)) [W3C] Encountered internal error running command: Error: Cannot start the 'com.xingin.xhs' application. Visit https://github.com/appium/appium/blob/master/docs/en/writing-running-appium/android/activity-startup.md for troubleshooting. Original error: Error executing adbExec. Original error: 'Command 'D\:\\android-sdk\\sdk\\adt-bundle-windows-x86_64-20140702\\sdk\\platform-tools\\adb.exe -P 5037 -s 127.0.0.1\:62001 shell am start -W -n com.xingin.xhs/.activity.SplashActivity -S' timed out after 20000ms'. Try to increase the 20000ms adb execution timeout represented by 'adbExecTimeout' capability [W3C] at ADB.apkUtilsMethods.startApp (C:\Users\zlp\AppData\Local\Programs\Appium\resources\app\node_modules\appium\node_modules\appium-adb\lib\tools\apk-utils.js:144:11) [HTTP] <-- POST /wd/hub/session 500 168162 ms - 1794 [HTTP] ```
创建android AVD时出现“no system images installed for this target”问题
我自己也上网查了,说有一个或者多个包没安装,然后我下下来,安装之后还是不行!这是怎么回事?
appium 测试无法打开 app,请各位大神帮忙
初学appium,使用python写测试脚本,现在可以安装上app,之后无法自动启动app。 这是我的脚本: #coding=utf-8 from appium import webdriver from lib2to3.pgen2.driver import Driver from lib2to3.tests.support import driver import os import time PATH=lambda p:os.path.abspath(os.path.join(os.path.dirname(file),p)) global driver desired_caps = {} desired_caps['platformName'] = 'Android' desired_caps['platformVersion'] = '4.4.2' desired_caps['deviceName'] = 'b91b9b66' #desired_caps['appPackage'] = 'com.zhengyuan.watch' #desired_caps['appActivity'] = 'com.zhengyuan.watch.logic.launch.AppStart' desired_caps['app'] = PATH('D:\android\app\rtring_c_zhengyuan.apk') driver = webdriver.Remote('http://localhost:4723/wd/hub', desired_caps) time.sleep(5) driver.swipe(600,660,10,660,1000) time.sleep(1) driver.swipe(600,660,10,660,1000) time.sleep(1) log: info: --> POST /wd/hub/session {"desiredCapabilities":{"platformVersion":"4.4.2","deviceName":"b91b9b66","app":"D:\android\app\rtring_c_zhengyuan.apk","platformName":"Android"}} info: Client User-Agent string: Python-urllib/2.7 info: [debug] No appActivity desired capability or server param. Parsing from apk. info: [debug] No appPackage desired capability or server param. Parsing from apk. info: [debug] Using local app from desired caps: D:\android\app\rtring_c_zhengyuan.apk info: [debug] Creating new appium session 7ab051a1-8c95-4b9a-a998-f1748ed52d47 info: Starting android appium info: [debug] Getting Java version info: Java version is: 1.7.0_79 info: [debug] Checking whether adb is present info: [debug] Using adb from D:\android\sdk\platform-tools\adb.exe info: [debug] Parsing package and activity from app manifest info: [debug] Checking whether aapt is present info: [debug] Using aapt from D:\android\sdk\build-tools\android-4.4W\aapt.exe info: [debug] Extracting package and launch activity from manifest. info: [debug] executing cmd: D:\android\sdk\build-tools\android-4.4W\aapt.exe dump badging D:\android\app\rtring_c_zhengyuan.apk info: [debug] badging package: com.zhengyuan.watch info: [debug] badging act: com.zhengyuan.watch.logic.launch.AppStart info: [debug] Parsed package and activity are: com.zhengyuan.watch/com.zhengyuan.watch.logic.launch.AppStart info: [debug] Using fast reset? true info: [debug] Preparing device for session info: [debug] Checking whether app is actually present info: Retrieving device info: [debug] Trying to find a connected android device info: [debug] Getting connected devices... info: [debug] executing cmd: D:\android\sdk\platform-tools\adb.exe devices info: [debug] 1 device(s) connected info: Found device b91b9b66 info: [debug] Setting device id to b91b9b66 info: [debug] Waiting for device to be ready and to respond to shell commands (timeout = 5) info: [debug] executing cmd: D:\android\sdk\platform-tools\adb.exe -s b91b9b66 wait-for-device info: [debug] executing cmd: D:\android\sdk\platform-tools\adb.exe -s b91b9b66 shell "echo 'ready'" info: [debug] Starting logcat capture info: [debug] Getting device API level info: [debug] executing cmd: D:\android\sdk\platform-tools\adb.exe -s b91b9b66 shell "getprop ro.build.version.sdk" info: [debug] Device is at API Level 19 info: Device API level is: 19 info: [debug] Extracting strings for language: default info: [debug] executing cmd: D:\android\sdk\platform-tools\adb.exe -s b91b9b66 shell "getprop persist.sys.language" info: [debug] Current device persist.sys.language: zh info: [debug] java -jar "C:\Program Files (x86)\Appium\node_modules\appium\node_modules\appium-adb\jars\appium_apk_tools.jar" "stringsFromApk" "D:\android\app\rtring_c_zhengyuan.apk" "C:\Users\admin\AppData\Local\Temp\com.zhengyuan.watch" zh info: [debug] Reading strings from converted strings.json info: [debug] Setting language to default info: [debug] executing cmd: D:\android\sdk\platform-tools\adb.exe -s b91b9b66 push "C:\Users\admin\AppData\Local\Temp\com.zhengyuan.watch\strings.json" /data/local/tmp info: [debug] Checking whether aapt is present info: [debug] Using aapt from D:\android\sdk\build-tools\android-4.4W\aapt.exe info: [debug] Retrieving process from manifest. info: [debug] executing cmd: D:\android\sdk\build-tools\android-4.4W\aapt.exe dump xmltree D:\android\app\rtring_c_zhengyuan.apk AndroidManifest.xml info: [debug] Set app process to: com.zhengyuan.watch info: [debug] Not uninstalling app since server not started with --full-reset info: [debug] Checking app cert for D:\android\app\rtring_c_zhengyuan.apk. info: [debug] executing cmd: java -jar "C:\Program Files (x86)\Appium\node_modules\appium\node_modules\appium-adb\jars\verify.jar" D:\android\app\rtring_c_zhengyuan.apk info: [debug] App already signed. info: [debug] Zip-aligning D:\android\app\rtring_c_zhengyuan.apk info: [debug] Checking whether zipalign is present info: [debug] Using zipalign from D:\android\sdk\build-tools\android-4.4W\zipalign.exe info: [debug] Zip-aligning apk. info: [debug] executing cmd: D:\android\sdk\build-tools\android-4.4W\zipalign.exe -f 4 D:\android\app\rtring_c_zhengyuan.apk C:\Users\admin\AppData\Local\Temp\116210-428-1fgurq6\appium.tmp info: [debug] MD5 for app is 310a577ec209ceac8a6dee5086a1bf5d info: [debug] executing cmd: D:\android\sdk\platform-tools\adb.exe -s b91b9b66 shell "ls /data/local/tmp/310a577ec209ceac8a6dee5086a1bf5d.apk" info: [debug] Getting install status for com.zhengyuan.watch info: [debug] Getting device API level info: [debug] executing cmd: D:\android\sdk\platform-tools\adb.exe -s b91b9b66 shell "getprop ro.build.version.sdk" info: [debug] Device is at API Level 19 info: [debug] executing cmd: D:\android\sdk\platform-tools\adb.exe -s b91b9b66 shell "pm list packages -3 com.zhengyuan.watch" info: [debug] App is installed info: Installing App info: [debug] executing cmd: D:\android\sdk\platform-tools\adb.exe -s b91b9b66 shell "mkdir -p /data/local/tmp/" info: [debug] Removing any old apks info: [debug] executing cmd: D:\android\sdk\platform-tools\adb.exe -s b91b9b66 shell "ls /data/local/tmp/*.apk" info: [debug] executing cmd: D:\android\sdk\platform-tools\adb.exe -s b91b9b66 shell rm "/data/local/tmp/8f29ab35c86ad03708a23dfe9aaeeaa0.apk" info: [debug] executing cmd: D:\android\sdk\platform-tools\adb.exe -s b91b9b66 push "D:\android\app\rtring_c_zhengyuan.apk" /data/local/tmp/310a577ec209ceac8a6dee5086a1bf5d.apk info: [debug] Uninstalling com.zhengyuan.watch info: [debug] executing cmd: D:\android\sdk\platform-tools\adb.exe -s b91b9b66 shell "am force-stop com.zhengyuan.watch" info: [debug] executing cmd: D:\android\sdk\platform-tools\adb.exe -s b91b9b66 uninstall com.zhengyuan.watch info: [debug] App was uninstalled info: [debug] executing cmd: D:\android\sdk\platform-tools\adb.exe -s b91b9b66 shell "pm install -r /data/local/tmp/310a577ec209ceac8a6dee5086a1bf5d.apk" info: [debug] Forwarding system:4724 to device:4724 info: [debug] executing cmd: D:\android\sdk\platform-tools\adb.exe -s b91b9b66 forward tcp:4724 tcp:4724 info: [debug] Pushing appium bootstrap to device... info: [debug] executing cmd: D:\android\sdk\platform-tools\adb.exe -s b91b9b66 push "C:\Program Files (x86)\Appium\node_modules\appium\build\android_bootstrap\AppiumBootstrap.jar" /data/local/tmp/ info: [debug] Pushing settings apk to device... info: [debug] executing cmd: D:\android\sdk\platform-tools\adb.exe -s b91b9b66 install "C:\Program Files (x86)\Appium\node_modules\appium\build\settings_apk\settings_apk-debug.apk" info: [debug] Pushing unlock helper app to device... info: [debug] executing cmd: D:\android\sdk\platform-tools\adb.exe -s b91b9b66 install "C:\Program Files (x86)\Appium\node_modules\appium\build\unlock_apk\unlock_apk-debug.apk" info: Starting App info: [debug] Attempting to kill all 'uiautomator' processes info: [debug] Getting all processes with 'uiautomator' info: [debug] executing cmd: D:\android\sdk\platform-tools\adb.exe -s b91b9b66 shell "ps 'uiautomator'" info: [debug] Attempting to kill process 31936 info: [debug] executing cmd: D:\android\sdk\platform-tools\adb.exe -s b91b9b66 shell "kill 31936" info: [debug] Running bootstrap info: [debug] spawning: D:\android\sdk\platform-tools\adb.exe -s b91b9b66 shell uiautomator runtest AppiumBootstrap.jar -c io.appium.android.bootstrap.Bootstrap -e pkg com.zhengyuan.watch -e disableAndroidWatchers false info: [debug] [UIAUTOMATOR STDOUT] INSTRUMENTATION_STATUS: numtests=1 info: [debug] [UIAUTOMATOR STDOUT] INSTRUMENTATION_STATUS: stream= info: [debug] [UIAUTOMATOR STDOUT] io.appium.android.bootstrap.Bootstrap: info: [debug] [UIAUTOMATOR STDOUT] INSTRUMENTATION_STATUS: id=UiAutomatorTestRunner info: [debug] [UIAUTOMATOR STDOUT] INSTRUMENTATION_STATUS: test=testRunServer info: [debug] [UIAUTOMATOR STDOUT] INSTRUMENTATION_STATUS: class=io.appium.android.bootstrap.Bootstrap info: [debug] [UIAUTOMATOR STDOUT] INSTRUMENTATION_STATUS: current=1 info: [debug] [UIAUTOMATOR STDOUT] INSTRUMENTATION_STATUS_CODE: 1 info: [debug] [BOOTSTRAP] [debug] Socket opened on port 4724 info: [debug] [BOOTSTRAP] [debug] Appium Socket Server Ready info: [debug] [BOOTSTRAP] [debug] Loading json... error: Unhandled error: Error: getaddrinfo ENOENT at Object.exports.errnoException (util.js:746:11) at errnoException (dns.js:49:15) at GetAddrInfoReqWrap.onlookup as oncomplete context: [POST /wd/hub/session {"desiredCapabilities":{"platformVersion":"4.4.2","deviceName":"b91b9b66","app":"D:\android\app\rtringc_zhengyuan.apk","platformName":"Android"}}] info: [debug] [BOOTSTRAP] [debug] json loading complete. info: [debug] [BOOTSTRAP] [debug] Registered crash watchers. info: <-- POST /wd/hub/session - - ms - - undefined 之后就停住了,请大家帮我看看是什么问题,纠结了好几天了,谢谢大家!
Disney's FastPass 程序的实现
Problem Description Disney's FastPass is a virtual queuing system created by the Walt Disney Company. First introduced in 1999 (thugh the idea of a ride reservation system was first introduced in world fairs), Fast-Pass allows guests to avoid long lines at the attractions on which the system is installed, freeing them to enjoy other attractions during their wait. The service is available at no additional charge to all park guests. --- wikipedia Disneyland is a large theme park with plenties of entertainment facilities, also with a large number of tourists. Normally, you need to wait for a long time before geting the chance to enjoy any of the attractions. The FastPass is a system allowing you to pick up FastPass-tickets in some specific position, and use them at the corresponding facility to avoid long lines. With the help of the FastPass System, one can arrange his/her trip more efficiently. You are given the map of the whole park, and there are some attractions that you are interested in. How to visit all the interested attractions within the shortest time? Input The first line contains an integer T(1<=T<=25), indicating the number of test cases. Each test case contains several lines. The first line contains three integers N,M,K(1 <= N <= 50; 0 <= M <= N(N - 1)/2; 0 <= K <= 8), indicating the number of locations(starting with 1, and 1 is the only gate of the park where the trip must be started and ended), the number of roads and the number of interested attractions. The following M lines each contains three integers A,B,D(1 <= A,B <= N; 0 <= D <= 10^4) which means it takes D minutes to travel between location A and location B. The following K lines each contains several integers Pi, Ti, FTi,Ni, Fi,1, Fi,2 ... Fi,Ni-1, FiNi ,(1 <= Pi,Ni, Fi,j <=N, 0 <= FTi <= Ti <= 10^4), which means the ith interested araction is placed at location Pi and there are Ni locations Fi,1; Fi,2 ... Fi,Ni where you can get the FastPass for the ith attraction. If you come to the ith attraction with its FastPass, you need to wait for only FTi minutes, otherwise you need to wait for Ti minutes. You can assume that all the locations are connected and there is at most one road between any two locations. Note that there might be several attrractions at one location. Output For each test case in the input, print one line: "Case #X: Y", where X is the test case number (starting with 1) and Y is the minimum time of the trip. Sample Input 2 4 5 2 1 2 8 2 3 4 3 4 19 4 1 6 2 4 7 2 25 18 1 3 4 12 6 1 3 4 6 2 1 2 5 1 4 4 3 1 1 3 2 1 3 4 1 2 4 10 2 8 3 1 4 4 8 3 1 2 Sample Output Case #1: 53 Case #2: 14
问个有关django+heroku的问题
``` Traceback (most recent call last): File "/app/.heroku/python/lib/python3.6/site-packages/django/db/backends/utils.py", line 64, in execute return self.cursor.execute(sql, params) psycopg2.errors.UndefinedTable: relation "auth_user" does not exist LINE 1: ...user"."is_active", "auth_user"."date_joined" FROM "auth_user... The above exception was the direct cause of the following exception: Traceback (most recent call last): File "manage.py", line 10, in <module> execute_from_command_line(sys.argv) File "/app/.heroku/python/lib/python3.6/site-packages/django/core/management/__init__.py", line 351, in execute_from_command_line utility.execute() File "/app/.heroku/python/lib/python3.6/site-packages/django/core/management/__init__.py", line 325, in execute django.setup() File "/app/.heroku/python/lib/python3.6/site-packages/django/__init__.py", line 18, in setup apps.populate(settings.INSTALLED_APPS) File "/app/.heroku/python/lib/python3.6/site-packages/django/apps/registry.py", line 108, in populate app_config.import_models(all_models) File "/app/.heroku/python/lib/python3.6/site-packages/django/apps/config.py", line 198, in import_models self.models_module = import_module(models_module_name) File "/app/.heroku/python/lib/python3.6/importlib/__init__.py", line 126, in import_module return _bootstrap._gcd_import(name[level:], package, level) File "<frozen importlib._bootstrap>", line 978, in _gcd_import File "<frozen importlib._bootstrap>", line 961, in _find_and_load File "<frozen importlib._bootstrap>", line 950, in _find_and_load_unlocked File "<frozen importlib._bootstrap>", line 655, in _load_unlocked File "<frozen importlib._bootstrap_external>", line 678, in exec_module File "<frozen importlib._bootstrap>", line 205, in _call_with_frames_removed File "/app/learning_logs/models.py", line 7, in <module> class Topic(models.Model): File "/app/learning_logs/models.py", line 8, in Topic choices=Help().choices() File "/app/learning_logs/help.py", line 9, in choices for user in users: File "/app/.heroku/python/lib/python3.6/site-packages/django/db/models/query.py", line 162, in __iter__ self._fetch_all() File "/app/.heroku/python/lib/python3.6/site-packages/django/db/models/query.py", line 965, in _fetch_all self._result_cache = list(self.iterator()) File "/app/.heroku/python/lib/python3.6/site-packages/django/db/models/query.py", line 238, in iterator results = compiler.execute_sql() File "/app/.heroku/python/lib/python3.6/site-packages/django/db/models/sql/compiler.py", line 840, in execute_sql cursor.execute(sql, params) File "/app/.heroku/python/lib/python3.6/site-packages/django/db/backends/utils.py", line 64, in execute return self.cursor.execute(sql, params) File "/app/.heroku/python/lib/python3.6/site-packages/django/db/utils.py", line 97, in __exit__ six.reraise(dj_exc_type, dj_exc_value, traceback) File "/app/.heroku/python/lib/python3.6/site-packages/django/utils/six.py", line 658, in reraise raise value.with_traceback(tb) File "/app/.heroku/python/lib/python3.6/site-packages/django/db/backends/utils.py", line 64, in execute return self.cursor.execute(sql, params) django.db.utils.ProgrammingError: relation "auth_user" does not exist LINE 1: ...user"."is_active", "auth_user"."date_joined" FROM "auth_user... ``` 在heroku bash操作makemigrations,migrate中出现的错误 在本地用这些没问题 settings.py ``` """ Django settings for learning_log project. Generated by 'django-admin startproject' using Django 1.8.5. For more information on this file, see https://docs.djangoproject.com/en/1.8/topics/settings/ For the full list of settings and their values, see https://docs.djangoproject.com/en/1.8/ref/settings/ """ # Build paths inside the project like this: os.path.join(BASE_DIR, ...) import os import django_heroku BASE_DIR = os.path.dirname(os.path.dirname(os.path.abspath(__file__))) # Quick-start development settings - unsuitable for production # See https://docs.djangoproject.com/en/1.8/howto/deployment/checklist/ # SECURITY WARNING: keep the secret key used in production secret! SECRET_KEY = 'o47!#$sbu_&=)pnbk63ra!hjbx@+pc=2j42cf(&mx82&hs&ph_' # SECURITY WARNING: don't run with debug turned on in production! DEBUG = True ALLOWED_HOSTS = [] # Application definition INSTALLED_APPS = ( 'whitenoise.runserver_nostatic', 'django.contrib.admin', 'django.contrib.auth', 'django.contrib.contenttypes', 'django.contrib.sessions', 'django.contrib.messages', 'django.contrib.staticfiles', #my app 'learning_logs', 'users', #other app 'bootstrap3', ) MIDDLEWARE = [ 'django.middleware.clickjacking.XFrameOptionsMiddleware', 'whitenoise.middleware.WhiteNoiseMiddleware', ] MIDDLEWARE_CLASSES = ( 'django.contrib.sessions.middleware.SessionMiddleware', 'django.middleware.common.CommonMiddleware', 'django.middleware.csrf.CsrfViewMiddleware', 'django.contrib.auth.middleware.AuthenticationMiddleware', 'django.contrib.auth.middleware.SessionAuthenticationMiddleware', 'django.contrib.messages.middleware.MessageMiddleware', 'django.middleware.clickjacking.XFrameOptionsMiddleware', 'django.middleware.security.SecurityMiddleware', ) ROOT_URLCONF = 'learning_log.urls' TEMPLATES = [ { 'BACKEND': 'django.template.backends.django.DjangoTemplates', 'DIRS': [], 'APP_DIRS': True, 'OPTIONS': { 'context_processors': [ 'django.template.context_processors.debug', 'django.template.context_processors.request', 'django.contrib.auth.context_processors.auth', 'django.contrib.messages.context_processors.messages', ], }, }, ] WSGI_APPLICATION = 'learning_log.wsgi.application' # Database # https://docs.djangoproject.com/en/1.8/ref/settings/#databases DATABASES = { 'default': { 'ENGINE': 'django.db.backends.sqlite3', 'NAME': os.path.join(BASE_DIR, 'db.sqlite3'), } } # Internationalization # https://docs.djangoproject.com/en/1.8/topics/i18n/ LANGUAGE_CODE = 'en-us' TIME_ZONE = 'UTC' USE_I18N = True USE_L10N = True USE_TZ = True LOGIN_URL = '/users/login/' # Static files (CSS, JavaScript, Images) # https://docs.djangoproject.com/en/1.8/howto/static-files/ STATIC_URL = '/static/' MEDIA_URL = '/media/' MEDIA_ROOT = os.path.join(BASE_DIR, 'media') STATIC_ROOT = os.path.join(BASE_DIR, 'staticfiles') if os.getenv('DATABASE_URL') is not None: import dj_database_url DATABASES['default'] = dj_database_url.config() SECURE_PROXY_SSL_HEADER = ('HTTP_X_FORWARDED_PROTO', 'https') ALLOWED_HOSTS = ['stark-anchorage-08076.herokuapp.com'] DEBUG = False BASE_DIR = os.path.dirname(os.path.abspath(__file__)) STATICFILES_DIRS = ( os.path.join(BASE_DIR, 'static'), ) django_heroku.settings(locals()) ``` views.py ``` from django.shortcuts import render from .models import Topic, Entry, Root, Suf_Pre_fix from django.http import HttpResponseRedirect, Http404 from django.core.urlresolvers import reverse from .forms import TopicForm, EntryForm, RootForm from django.contrib.auth.decorators import login_required from .help import Help from django.contrib.auth.models import User # Create your views here. def index(request): return render(request, 'learning_logs/index.html') @login_required def topics(request): topics = Topic.objects.order_by('date_added') context = {'topics': topics} return render(request, 'learning_logs/topics.html', context) @login_required def topic(request, topic_id): topic = Topic.objects.get(id=topic_id) entries = topic.entry_set.order_by('-date_added') context = {'topic': topic,'entries': entries} return render(request, 'learning_logs/topic.html', context) @login_required def new_topic(request): if request.method != 'POST': form = TopicForm() else: form = TopicForm(request.POST) if form.is_valid(): new_topic = form.save(commit=False) new_topic.owner = request.user new_topic.edit_able = request.POST.getlist("edit_able") new_topic.save() return HttpResponseRedirect(reverse('learning_logs:topics')) context = {'form': form, 'users':Help().users()} return render(request, 'learning_logs/new_topic.html', context) @login_required def new_entry(request, topic_id): topic = Topic.objects.get(id=topic_id) if request.method != 'POST': form = EntryForm() else: form = EntryForm(data=request.POST) if form.is_valid(): new_entry = form.save(commit=False) new_entry.topic = topic new_entry.edit_able = request.POST.getlist("edit_able") new_entry.save() return HttpResponseRedirect(reverse('learning_logs:topic',args=[topic_id])) context = {'topic':topic, 'form': form, 'users':Help().users()} return render(request, 'learning_logs/new_entry.html', context) @login_required def edit_entry(request, entry_id): entry = Entry.objects.get(id=entry_id) topic = entry.topic if not Help().check_user(request.user,entry.edit_able) or not Help().check_user(request.user,topic.edit_able): raise Http404 if request.method != 'POST': form = EntryForm(instance=entry) else: form = EntryForm(instance=entry, data=request.POST) if form.is_valid(): edit_entry = form.save(commit=False) edit_entry.edit_able = request.POST.getlist("edit_able") edit_entry.save() return HttpResponseRedirect(reverse('learning_logs:topic',args=[topic.id])) context = {'entry': entry, 'topic': topic, 'form': form ,'users':Help().users()} return render(request, 'learning_logs/edit_entry.html', context) @login_required def roots(request): roots = Root.objects.order_by('date_added') context = {'roots': roots} return render(request, 'learning_logs/roots.html', context) def root(request, root_id): root = Root.objects.get(id=root_id) things = root.things.order_by('-date_added') context = {'root':root, 'things':things} return render(request, 'learning_logs/root.html', context) ``` help.py ``` from django.contrib.auth.models import User class Help(): def __init__(self): pass def choices(self): users=User.objects.all() choices=[] a=1 for user in users: choices.append((a,str(user))) a+=1 return choices def check_user(self,user,users): try: str(users).index(str(user)) except: return False else: return True def users(self): users=[] for user in User.objects.all(): users.append(str(user)) return users def test_list(self,list1): for item in list1: print(type(item)) def test_word(self,item): print(item,type(item)) ```
终于明白阿里百度这样的大公司,为什么面试经常拿ThreadLocal考验求职者了
点击上面↑「爱开发」关注我们每晚10点,捕获技术思考和创业资源洞察什么是ThreadLocalThreadLocal是一个本地线程副本变量工具类,各个线程都拥有一份线程私有的数
win10系统安装教程(U盘PE+UEFI安装)
一、准备工作 u盘,电脑一台,win10原版镜像(msdn官网) 二、下载wepe工具箱  极力推荐微pe(微pe官方下载) 下载64位的win10 pe,使用工具箱制作启动U盘打开软件,   选择安装到U盘(按照操作无需更改) 三、重启进入pe系统   1、关机后,将U盘插入电脑 2、按下电源后,按住F12进入启动项选择(技嘉主板是F12)     选择需要启
程序员必须掌握的核心算法有哪些?
由于我之前一直强调数据结构以及算法学习的重要性,所以就有一些读者经常问我,数据结构与算法应该要学习到哪个程度呢?,说实话,这个问题我不知道要怎么回答你,主要取决于你想学习到哪些程度,不过针对这个问题,我稍微总结一下我学过的算法知识点,以及我觉得值得学习的算法。这些算法与数据结构的学习大多数是零散的,并没有一本把他们全部覆盖的书籍。下面是我觉得值得学习的一些算法以及数据结构,当然,我也会整理一些看过
《奇巧淫技》系列-python!!每天早上八点自动发送天气预报邮件到QQ邮箱
将代码部署服务器,每日早上定时获取到天气数据,并发送到邮箱。 也可以说是一个小人工智障。 思路可以运用在不同地方,主要介绍的是思路。
Nginx 软件层面加强Nginx性能优化的面试问答和解决方案
Nginx 软件层面加强Nginx性能优化的面试问答和解决方案 去年我去爱卡汽车面试PHP,一轮和二轮面的都不错,在三轮面到Nginx的时候很多问题当时不知道怎么回答,确实没有深入学习过,花了一段时间的学习,终于能解答Nginx高性能优化的问题了,10月24号为了获得程序员勋章,发布了半个优化笔记,浏览到了1000+,受到这个鼓舞,我抽时间在仔细整理下关于Nginx性能优化的问题,我们从软件说起。...
【管理系统课程设计】美少女手把手教你后台管理
【文章后台管理系统】URL设计与建模分析+项目源码+运行界面 栏目管理、文章列表、用户管理、角色管理、权限管理模块(文章最后附有源码) 1. 这是一个什么系统? 1.1 学习后台管理系统的原因 随着时代的变迁,现如今各大云服务平台横空出世,市面上有许多如学生信息系统、图书阅读系统、停车场管理系统等的管理系统,而本人家里就有人在用烟草销售系统,直接在网上完成挑选、购买与提交收货点,方便又快捷。 试想,若没有烟草销售系统,本人家人想要购买烟草,还要独自前往药...
11月19日科技资讯|华为明日发布鸿蒙整体战略;京东宣告全面向技术转型;Kotlin 1.3.60 发布
「极客头条」—— 技术人员的新闻圈! CSDN 的读者朋友们早上好哇,「极客头条」来啦,快来看今天都有哪些值得我们技术人关注的重要新闻吧。扫描上方二维码进入 CSDN App 可以收听御姐萌妹 Style 的人工版音频哟。 一分钟速览新闻点! 6G 专家组成员:速率是 5G 的 10 至 100 倍,预计 2030 年商用 雷军:很多人多次劝我放弃WPS,能坚持下来并不是纯粹的商业决定 ...
C语言魔塔游戏
很早就很想写这个,今天终于写完了。 游戏截图: 编译环境: VS2017 游戏需要一些图片,如果有想要的或者对游戏有什么看法的可以加我的QQ 2985486630 讨论,如果暂时没有回应,可以在博客下方留言,到时候我会看到。 下面我来介绍一下游戏的主要功能和实现方式 首先是玩家的定义,使用结构体,这个名字是可以自己改变的 struct gamerole { char n
化繁为简 - 腾讯计费高一致TDXA的实践之路
导语:腾讯计费是孵化于支撑腾讯内部业务千亿级营收的互联网计费平台,在如此庞大的业务体量下,腾讯计费要支撑业务的快速增长,同时还要保证每笔交易不错账。采用最终一致性或离线补...
Python爬虫爬取淘宝,京东商品信息
小编是一个理科生,不善长说一些废话。简单介绍下原理然后直接上代码。 使用的工具(Python+pycharm2019.3+selenium+xpath+chromedriver)其中要使用pycharm也可以私聊我selenium是一个框架可以通过pip下载 pip install selenium -i https://pypi.tuna.tsinghua.edu.cn/simple/ 
Java学习笔记(七十二)—— Cookie
概述 会话技术: 会话:一次会话中包含多次请求和响应 一次会话:浏览器第一次给服务器发送资源请求,会话建立,直到有一方断开为止 功能:在一次会话的范围内的多次请求间,共享数据 方式: 客户端会话技术:Cookie,把数据存储到客户端 服务器端会话技术:Session,把数据存储到服务器端 Cookie 概念:客户端会话技术,将数据存储到客户端 快速入门: 使用步骤: 创建C
阿里程序员写了一个新手都写不出的低级bug,被骂惨了。
这种新手都不会范的错,居然被一个工作好几年的小伙子写出来,差点被当场开除了。
Java工作4年来应聘要16K最后没要,细节如下。。。
前奏: 今天2B哥和大家分享一位前几天面试的一位应聘者,工作4年26岁,统招本科。 以下就是他的简历和面试情况。 基本情况: 专业技能: 1、&nbsp;熟悉Sping了解SpringMVC、SpringBoot、Mybatis等框架、了解SpringCloud微服务 2、&nbsp;熟悉常用项目管理工具:SVN、GIT、MAVEN、Jenkins 3、&nbsp;熟悉Nginx、tomca
2020年,冯唐49岁:我给20、30岁IT职场年轻人的建议
点击“技术领导力”关注∆  每天早上8:30推送 作者| Mr.K   编辑| Emma 来源| 技术领导力(ID:jishulingdaoli) 前天的推文《冯唐:职场人35岁以后,方法论比经验重要》,收到了不少读者的反馈,觉得挺受启发。其实,冯唐写了不少关于职场方面的文章,都挺不错的。可惜大家只记住了“春风十里不如你”、“如何避免成为油腻腻的中年人”等不那么正经的文章。 本文整理了冯
程序员该看的几部电影
##1、骇客帝国(1999) 概念:在线/离线,递归,循环,矩阵等 剧情简介: 不久的将来,网络黑客尼奥对这个看似正常的现实世界产生了怀疑。 他结识了黑客崔妮蒂,并见到了黑客组织的首领墨菲斯。 墨菲斯告诉他,现实世界其实是由一个名叫“母体”的计算机人工智能系统控制,人们就像他们饲养的动物,没有自由和思想,而尼奥就是能够拯救人类的救世主。 可是,救赎之路从来都不会一帆风顺,到底哪里才是真实的世界?
作为一个程序员,CPU的这些硬核知识你必须会!
CPU对每个程序员来说,是个既熟悉又陌生的东西? 如果你只知道CPU是中央处理器的话,那可能对你并没有什么用,那么作为程序员的我们,必须要搞懂的就是CPU这家伙是如何运行的,尤其要搞懂它里面的寄存器是怎么一回事,因为这将让你从底层明白程序的运行机制。 随我一起,来好好认识下CPU这货吧 把CPU掰开来看 对于CPU来说,我们首先就要搞明白它是怎么回事,也就是它的内部构造,当然,CPU那么牛的一个东
@程序员,如何花式构建线程?
作者 |曾建责编 | 郭芮出品 | CSDN(ID:CSDNnews)在项目和业务的开发中,我们难免要经常使用线程来进行业务处理,使用线程可以保证我们的业务在相互处理之间可以保证原子性...
破14亿,Python分析我国存在哪些人口危机!
2020年1月17日,国家统计局发布了2019年国民经济报告,报告中指出我国人口突破14亿。 猪哥的朋友圈被14亿人口刷屏,但是很多人并没有看到我国复杂的人口问题:老龄化、男女比例失衡、生育率下降、人口红利下降等。 今天我们就来分析一下我们国家的人口数据吧! 一、背景 1.人口突破14亿 2020年1月17日,国家统计局发布了 2019年国民经济报告 ,报告中指出:年末中国大陆总人口(包括31个
强烈推荐10本程序员在家读的书
很遗憾,这个鼠年春节注定是刻骨铭心的,新型冠状病毒让每个人的神经都是紧绷的。那些处在武汉的白衣天使们,尤其值得我们的尊敬。而我们这些窝在家里的程序员,能不外出就不外出,就是对社会做出的最大的贡献。 有些读者私下问我,窝了几天,有点颓丧,能否推荐几本书在家里看看。我花了一天的时间,挑选了 10 本我最喜欢的书,你可以挑选感兴趣的来读一读。读书不仅可以平复恐惧的压力,还可以对未来充满希望,毕竟苦难终
Linux自学篇——linux命令英文全称及解释
man: Manual 意思是手册,可以用这个命令查询其他命令的用法。 pwd:Print working directory 显示当前目录 su:Swith user 切换用户,切换到root用户 cd:Change directory 切换目录 ls:List files 列出目录下的文件 ps:Process Status 进程状态 mk
Python实战:抓肺炎疫情实时数据,画2019-nCoV疫情地图
文章目录1. 前言2. 数据下载3. 数据处理4. 数据可视化 1. 前言 今天,群里白垩老师问如何用python画武汉肺炎疫情地图。白垩老师是研究海洋生态与地球生物的学者,国家重点实验室成员,于不惑之年学习python,实为我等学习楷模。先前我并没有关注武汉肺炎的具体数据,也没有画过类似的数据分布图。于是就拿了两个小时,专门研究了一下,遂成此文。 2月6日追记:本文发布后,腾讯的数据源多次变更u
智力题(程序员面试经典)
NO.1  有20瓶药丸,其中19瓶装有1克/粒的药丸,余下一瓶装有1.1克/粒的药丸。给你一台称重精准的天平,怎么找出比较重的那瓶药丸?天平只能用一次。 解法 有时候,严格的限制条件有可能反倒是解题的线索。在这个问题中,限制条件是天平只能用一次。 因为天平只能用一次,我们也得以知道一个有趣的事实:一次必须同时称很多药丸,其实更准确地说,是必须从19瓶拿出药丸进行称重。否则,如果跳过两瓶或更多瓶药
在家远程办公效率低?那你一定要收好这个「在家办公」神器!
相信大家都已经收到国务院延长春节假期的消息,接下来,在家远程办公可能将会持续一段时间。 但是问题来了。远程办公不是人在电脑前就当坐班了,相反,对于沟通效率,文件协作,以及信息安全都有着极高的要求。有着非常多的挑战,比如: 1在异地互相不见面的会议上,如何提高沟通效率? 2文件之间的来往反馈如何做到及时性?如何保证信息安全? 3如何规划安排每天工作,以及如何进行成果验收? ......
作为一个程序员,内存和磁盘的这些事情,你不得不知道啊!!!
截止目前,我已经分享了如下几篇文章: 一个程序在计算机中是如何运行的?超级干货!!! 作为一个程序员,CPU的这些硬核知识你必须会! 作为一个程序员,内存的这些硬核知识你必须懂! 这些知识可以说是我们之前都不太重视的基础知识,可能大家在上大学的时候都学习过了,但是嘞,当时由于老师讲解的没那么有趣,又加上这些知识本身就比较枯燥,所以嘞,大家当初几乎等于没学。 再说啦,学习这些,也看不出来有什么用啊!
2020年的1月,我辞掉了我的第一份工作
其实,这篇文章,我应该早点写的,毕竟现在已经2月份了。不过一些其它原因,或者是我的惰性、还有一些迷茫的念头,让自己迟迟没有试着写一点东西,记录下,或者说是总结下自己前3年的工作上的经历、学习的过程。 我自己知道的,在写自己的博客方面,我的文笔很一般,非技术类的文章不想去写;另外我又是一个还比较热衷于技术的人,而平常复杂一点的东西,如果想写文章写的清楚点,是需要足够...
别低估自己的直觉,也别高估自己的智商
所有群全部吵翻天,朋友圈全部沦陷,公众号疯狂转发。这两周没怎么发原创,只发新闻,可能有人注意到了。我不是懒,是文章写了却没发,因为大家的关注力始终在这次的疫情上面,发了也没人看。当然,我...
Java坑人面试题系列: 包装类(中级难度)
Java Magazine上面有一个专门坑人的面试题系列: https://blogs.oracle.com/javamagazine/quiz-2。 这些问题的设计宗旨,主要是测试面试者对Java语言的了解程度,而不是为了用弯弯绕绕的手段把面试者搞蒙。 如果你看过往期的问题,就会发现每一个都不简单。 这些试题模拟了认证考试中的一些难题。 而 “中级(intermediate)” 和 “高级(ad
Spring Boot 2.x基础教程:使用JdbcTemplate访问MySQL数据库
在第2章节中,我们介绍了如何通过Spring Boot来实现HTTP接口,以及围绕HTTP接口相关的单元测试、文档生成等实用技能。但是,这些内容还不足以帮助我们构建一个动态应用的服务端程序。不论我们是要做App、小程序、还是传统的Web站点,对于用户的信息、相关业务的内容,通常都需要对其进行存储,而不是像第2章节中那样,把用户信息存储在内存中(重启就丢了!)。 对于信息的存储,现在已经有非常非常多...
基于Python的人脸自动戴口罩系统
目录 1、项目背景 2、页面设计 3、器官识别 4、退出系统 1、项目背景 2019年新型冠状病毒感染的肺炎疫情发生以来,牵动人心,举国哀痛,口罩、酒精、消毒液奇货可居。 抢不到口罩,怎么办?作为技术人今天分享如何使用Python实现自动戴口罩系统,来安慰自己,系统效果如下所示: 本系统的实现原理是借助 Dlib模块的Landmark人脸68个关键点检测库轻松识别出人脸五官
这个世界上人真的分三六九等,你信吗?
偶然间,在知乎上看到一个问题 一时间,勾起了我深深的回忆。 以前在厂里打过两次工,做过家教,干过辅导班,做过中介。零下几度的晚上,贴过广告,满脸、满手地长冻疮。 再回首那段岁月,虽然苦,但让我学会了坚持和忍耐。让我明白了,在这个世界上,无论环境多么的恶劣,只要心存希望,星星之火,亦可燎原。 下文是原回答,希望能对你能有所启发。 如果我说,这个世界上人真的分三六九等,...
相关热词 c#如何定义数组列表 c#倒序读取txt文件 java代码生成c# c# tcp发送数据 c#解决时间格式带星期 c#类似hashmap c#设置istbox的值 c#获取多线程返回值 c# 包含数字 枚举 c# timespan
立即提问