Cocos2dx 无法进入onEnterTransitionDidFinsh(),急急急 10C

void Test::onEnter()
{
Layer::onEnter();
////使用png图片做成精灵帧,精灵帧创建精灵对象
auto spriteFrame = SpriteFrame::create("mp.png", Rect(0, 81.25 * 2, 81.25, 81.25));
sprite = Sprite::createWithSpriteFrame(spriteFrame);
sprite->setPosition(Vec2(400, 500));
this->addChild(sprite);
auto scene = HelloWorld::createScene();
Director::getInstance()->replaceScene(scene);
log("onEnter");
}

void Test::onEnterTransitionDidFinsh()
{
Layer::onEnterTransitionDidFinish();

log("onEnterTransitionDidFinsh");

}

void Test::onExit()
{
Layer::onExit();
log("onExit");
}

void Test::onExitTransitionDidStart()
{
Layer::onExitTransitionDidStart();
log("onExitTransitionDidStart");
}

2个回答

1.你的Test是继承什么的(按照你代码写的似乎是Layer?)
2.你添加该layer的代码前后呢?
3.这么写略飘逸,我想问题应该是你在onEnter的时候,就replaceScene了,这个layer被移除了,所以没机会调用onEnterTransitionDidFinsh()

大神 ,就是我不添加那个切换场景,它也进不去的。应该是onEnter()结束后,就进去。但是没有进去

Csdn user default icon
上传中...
上传图片
插入图片
抄袭、复制答案,以达到刷声望分或其他目的的行为,在CSDN问答是严格禁止的,一经发现立刻封号。是时候展现真正的技术了!
其他相关推荐
cocos2d-x 使用 中 CCPoint 未导出,请教解决方案。
使用VS2010 编译时提示如下: 1>Test.obj : error LNK2019: 无法解析的外部符号 "__declspec(dllimport) public: __thiscall cocos2d::CCPoint::CCPoint(float,float)" (__imp_??0CCPoint@cocos2d@@QAE@MM@Z),该符号在函数 "void __cdecl cocos2d::`dynamic initializer for 'CCPointZero''(void)" (??__ECCPointZero@cocos2d@@YAXXZ) 中被引用 1>Test.obj : error LNK2019: 无法解析的外部符号 "__declspec(dllimport) public: __thiscall cocos2d::CCSize::CCSize(float,float)" (__imp_??0CCSize@cocos2d@@QAE@MM@Z),该符号在函数 "void __cdecl cocos2d::`dynamic initializer for 'CCSizeZero''(void)" (??__ECCSizeZero@cocos2d@@YAXXZ) 中被引用 1>Test.obj : error LNK2019: 无法解析的外部符号 "__declspec(dllimport) public: __thiscall cocos2d::CCRect::CCRect(float,float,float,float)" (__imp_??0CCRect@cocos2d@@QAE@MMMM@Z),该符号在函数 "void __cdecl cocos2d::`dynamic initializer for 'CCRectZero''(void)" (??__ECCRectZero@cocos2d@@YAXXZ) 中被引用 1>.\Debug\Test.exe : fatal error LNK1120: 3 个无法解析的外部命令 我想是 CCPoint 所在的lib或DLL不在工程目录下,请教是那个lib或DLL。
cocos2dx环境安装,vs可以编译,eclipsc编译打包,提示找不到cocos2d.h
cocos2dx环境安装了,vs可以编译![图片说明](https://img-ask.csdn.net/upload/202002/10/1581328545_369488.png) 但是eclipsc编译打包,就提示找不到cocos2d.h, ![图片说明](https://img-ask.csdn.net/upload/202002/10/1581327308_353806.png) 不知道是不是环境配置的有问题,还是没安装好,有熟悉这方面的,最好能加个好友,如能帮忙解决,必有酬谢
android cocos2d 添加精灵后黑屏
android cocos2d 添加精灵后黑屏,在手机上运行没有问题 , 在pad上运行涉及到添加精灵的地方就会黑屏 , 这是为什么呢? 使用的 cocos2d-android jar包
cocos2d-x移植安卓的一个问题实在是找不到解决途径了
Updated project.properties Updated local.properties Updated file D:\CocosDevelop\PopStars\proj.android\..\cocos2d\cocos\platform\android\java\proguard-project.txt Traceback (most recent call last): File "D:\cocos2d-x-3.2\tools\cocos2d-console\bin\/cocos.py", line 504, in <module> run_plugin(command, argv, plugins) File "D:\cocos2d-x-3.2\tools\cocos2d-console\bin\/cocos.py", line 469, in run_plugin dependencies_objects[dep_name] = run_plugin(dep_name, argv, plugins) File "D:\cocos2d-x-3.2\tools\cocos2d-console\bin\/cocos.py", line 469, in run_plugin dependencies_objects[dep_name] = run_plugin(dep_name, argv, plugins) File "D:\cocos2d-x-3.2\tools\cocos2d-console\bin\/cocos.py", line 471, in run_plugin plugin.run(argv, dependencies_objects) File "D:\cocos2d-x-3.2\tools\cocos2d-console\bin\..\plugins\project_compile\project_compile.py", line 1075, in run self.build_android() File "D:\cocos2d-x-3.2\tools\cocos2d-console\bin\..\plugins\project_compile\project_compile.py", line 332, in build_android self.apk_path = builder.do_build_apk(sdk_root, ant_root, self._ap, build_mode, output_dir, self._custom_step_args, self) File "D:\cocos2d-x-3.2\tools\cocos2d-console\bin\..\plugins\project_compile\build_android.py", line 307, in do_build_apk self._copy_resources(custom_step_args) File "D:\cocos2d-x-3.2\tools\cocos2d-console\bin\..\plugins\project_compile\build_android.py", line 445, in _copy_resources shutil.rmtree(assets_dir) File "C:\Python27\lib\shutil.py", line 247, in rmtree rmtree(fullname, ignore_errors, onerror) File "C:\Python27\lib\shutil.py", line 247, in rmtree rmtree(fullname, ignore_errors, onerror) File "C:\Python27\lib\shutil.py", line 252, in rmtree onerror(os.remove, fullname, sys.exc_info()) File "C:\Python27\lib\shutil.py", line 250, in rmtree os.remove(fullname) WindowsError: [Error 5] : 'D:\\CocosDevelop\\PopStars\\proj.android\\assets\\stars\\.svn\\all-wcprops' 是在做消灭星星时候遇到,PC正常运行,当我PC上实现音乐播放之后就出错了,另外在游戏中也用到了自己使用cocostudio制作的UI,
cocos2d spriteFrame的问题
cocos2d 版本:cocos2d-x-3.14.1 用cc.spriteFrameCache.addSpriteFrame("res/graphics/texture.plist");加载碎图, 但是在用var title=new cc.Sprite("#welcome_title.png"); 加载时,系统提示 ![图片说明](https://img-ask.csdn.net/upload/201702/12/1486886477_543461.jpeg) 请问要怎么解决
新手cocos2d-js编译问题
C:\Users\Administrator>cocos compile -s "e:\cocosCode\JsTestII" -p android 编译模式:debug 使用 Eclipse 工程:e:\cocosCode\JsTestII\frameworks\runtime-src\proj.android 正在执行:'"C:\Program Files\Android\android-sdk\tools\android" update project - t android-13 -p e:\cocosCode\JsTestII\frameworks\runtime-src\proj.android' Updated project.properties Updated local.properties Updated file e:\cocosCode\JsTestII\frameworks\runtime-src\proj.android\proguard- project.txt 正在执行:'"C:\Program Files\Android\android-sdk\tools\android" update lib-proje ct -p e:\cocosCode\JsTestII\frameworks\cocos2d-x\cocos\platform\android\java -t android-13' Updated project.properties Updated local.properties Updated file e:\cocosCode\JsTestII\frameworks\cocos2d-x\cocos\platform\android\j ava\proguard-project.txt 正在执行 ndk-build... NDK 编译模式:debug 正在执行:'"android-ndk-r10c\ndk-build" -C e:\cocosCode\JsTestII\frameworks\runt ime-src\proj.android -j4 NDK_MODULE_PATH=e:\cocosCode\JsTestII\frameworks\cocos2 d-x;e:\cocosCode\JsTestII\frameworks\cocos2d-x\cocos;e:\cocosCode\JsTestII\frame works\cocos2d-x\external NDK_TOOLCHAIN_VERSION=4.9 NDK_DEBUG=1' 系统找不到指定的路径。 执行命令出错,返回值:1。 C:\Users\Administrator> 这个是什么问题,新手一枚,请指教
cocos2d-x 无法打开glew.lib
本人是vs2012 由于vs13只安装了一半中间退出,现在运行cocos2d程序出现 无法打开glew.lib问题 求大神解答,在线等
Cocos2d-X3.4 打包apk时出错,大神快来帮帮我吧
make: *** [obj/local/armeabi/objs-debug/cocos2dcpp_shared/__/__/Classes/InitReco rd.o] Error 1 jni/../../Classes/RiverCrossingScene.cpp: In member function 'virtual bool River CrossingScene::init()': jni/../../Classes/RiverCrossingScene.cpp:37:98: warning: 'void cocos2d::ui::Widg et::addTouchEventListener(cocos2d::Ref*, cocos2d::ui::SEL_TouchEvent)' is deprec ated (declared at E:\TTSNJ_2.0\TTSNJ_2.0\proj.android\../cocos2d/cocos/3d/../ui/ UIWidget.h:239) [-Wdeprecated-declarations] goBackBtn->addTouchEventListener(this, toucheventselector(RiverCrossingScene:: toHelloWorldScene)); ^ At global scope: cc1plus.exe: warning: unrecognized command line option "-Wno-extern-c-compat" [e nabled by default] jni/../../Classes/RiverCrossingScene.cpp:53:83: warning: 'void cocos2d::ui::Widg et::addTouchEventListener(cocos2d::Ref*, cocos2d::ui::SEL_TouchEvent)' is deprec ated (declared at E:\TTSNJ_2.0\TTSNJ_2.0\proj.android\../cocos2d/cocos/3d/../ui/ UIWidget.h:239) [-Wdeprecated-declarations] moveBtn->addTouchEventListener(this, toucheventselector(RiverCrossingScene::mo ve)); ^ cc1plus.exe: warning: unrecognized command line option "-Wno-extern-c-compat" [e nabled by default] jni/../../Classes/RiverCrossingScene.cpp:66:20: warning: 'cocos2d::Color3B cocos 2d::ccc3(GLubyte, GLubyte, GLubyte)' is deprecated (declared at E:\TTSNJ_2.0\TTS NJ_2.0\proj.android\../cocos2d/cocos/3d/../deprecated/CCDeprecated.h:415) [-Wdep recated-declarations] timeLab->setColor(ccc3(0, 0, 0)); ^ jni/../../Classes/RiverCrossingScene.cpp:66:32: warning: 'cocos2d::Color3B cocos 2d::ccc3(GLubyte, GLubyte, GLubyte)' is deprecated (declared at E:\TTSNJ_2.0\TTS NJ_2.0\proj.android\../cocos2d/cocos/3d/../deprecated/CCDeprecated.h:415) [-Wdep recated-declarations] timeLab->setColor(ccc3(0, 0, 0)); ^ jni/../../Classes/RiverCrossingScene.cpp:71:21: warning: 'cocos2d::Color3B cocos 2d::ccc3(GLubyte, GLubyte, GLubyte)' is deprecated (declared at E:\TTSNJ_2.0\TTS NJ_2.0\proj.android\../cocos2d/cocos/3d/../deprecated/CCDeprecated.h:415) [-Wdep recated-declarations] timeLab1->setColor(ccc3(0, 0, 0)); ^ jni/../../Classes/RiverCrossingScene.cpp:71:33: warning: 'cocos2d::Color3B cocos 2d::ccc3(GLubyte, GLubyte, GLubyte)' is deprecated (declared at E:\TTSNJ_2.0\TTS NJ_2.0\proj.android\../cocos2d/cocos/3d/../deprecated/CCDeprecated.h:415) [-Wdep recated-declarations] timeLab1->setColor(ccc3(0, 0, 0)); ^ jni/../../Classes/RiverCrossingScene.cpp:115:86: warning: 'void cocos2d::ui::Wid get::addTouchEventListener(cocos2d::Ref*, cocos2d::ui::SEL_TouchEvent)' is depre cated (declared at E:\TTSNJ_2.0\TTSNJ_2.0\proj.android\../cocos2d/cocos/3d/../ui /UIWidget.h:239) [-Wdeprecated-declarations] human[0]->addTouchEventListener(this, toucheventselector(RiverCrossingScene::h uman1)); ^ jni/../../Classes/RiverCrossingScene.cpp:116:86: warning: 'void cocos2d::ui::Wid get::addTouchEventListener(cocos2d::Ref*, cocos2d::ui::SEL_TouchEvent)' is depre cated (declared at E:\TTSNJ_2.0\TTSNJ_2.0\proj.android\../cocos2d/cocos/3d/../ui /UIWidget.h:239) [-Wdeprecated-declarations] human[1]->addTouchEventListener(this, toucheventselector(RiverCrossingScene::h uman2)); ^ jni/../../Classes/RiverCrossingScene.cpp:117:86: warning: 'void cocos2d::ui::Wid get::addTouchEventListener(cocos2d::Ref*, cocos2d::ui::SEL_TouchEvent)' is depre cated (declared at E:\TTSNJ_2.0\TTSNJ_2.0\proj.android\../cocos2d/cocos/3d/../ui /UIWidget.h:239) [-Wdeprecated-declarations] human[2]->addTouchEventListener(this, toucheventselector(RiverCrossingScene::h uman3)); ^ jni/../../Classes/RiverCrossingScene.cpp:118:86: warning: 'void cocos2d::ui::Wid get::addTouchEventListener(cocos2d::Ref*, cocos2d::ui::SEL_TouchEvent)' is depre cated (declared at E:\TTSNJ_2.0\TTSNJ_2.0\proj.android\../cocos2d/cocos/3d/../ui /UIWidget.h:239) [-Wdeprecated-declarations] ghost[0]->addTouchEventListener(this, toucheventselector(RiverCrossingScene::g host1)); ^ jni/../../Classes/RiverCrossingScene.cpp:119:86: warning: 'void cocos2d::ui::Wid get::addTouchEventListener(cocos2d::Ref*, cocos2d::ui::SEL_TouchEvent)' is depre cated (declared at E:\TTSNJ_2.0\TTSNJ_2.0\proj.android\../cocos2d/cocos/3d/../ui /UIWidget.h:239) [-Wdeprecated-declarations] ghost[1]->addTouchEventListener(this, toucheventselector(RiverCrossingScene::g host2)); ^ make:jni/../../Classes/RiverCrossingScene.cpp:120:86: warning: 'void cocos2d::ui ::Widget::addTouchEventListener(cocos2d::Ref*, cocos2d::ui::SEL_TouchEvent)' is deprecated (declared at E:\TTSNJ_2.0\TTSNJ_2.0\proj.android\../cocos2d/cocos/3d/ ../ui/UIWidget.h:239) [-Wdeprecated-declarations] ghost[2]->addTouchEventListener(this, toucheventselector(RiverCrossingScene::g host3)); ^ *** [obj/local/armeabi/objs-debug/cocos2dcpp_shared/__/__/Classejni/../../Class es/RiverCrossingScene.cpp: In member function 'void RiverCrossingScene::losePlay ()': jni/../../Classes/RiverCrossingScene.cpp:270:86: warning: 'void cocos2d::ui::Wid get::addTouchEventListener(cocos2d::Ref*, cocos2d::ui::SEL_TouchEvent)' is depre cated (declared at E:\TTSNJ_2.0\TTSNJ_2.0\proj.android\../cocos2d/cocos/3d/../ui /UIWidget.h:239) [-Wdeprecated-declarations] goMain->addTouchEventListener(this, toucheventselector(RiverCrossingScene::try Again)); ^ s/Recorjni/../../Classes/RiverCrossingScene.cpp:274:19: warning: 'cocos2d::Color 3B cocos2d::ccc3(GLubyte, GLubyte, GLubyte)' is deprecated (declared at E:\TTSNJ _2.0\TTSNJ_2.0\proj.android\../cocos2d/cocos/3d/../deprecated/CCDeprecated.h:415 ) [-Wdeprecated-declarations] tryLab->setColor(ccc3(0, 0, 0)); ^ d.o]jni/../../Classes/RiverCrossingScene.cpp:274:31: warning: 'cocos2d::Color3B cocos2d::ccc3(GLubyte, GLubyte, GLubyte)' is deprecated (declared at E:\TTSNJ_2. 0\TTSNJ_2.0\proj.android\../cocos2d/cocos/3d/../deprecated/CCDeprecated.h:415) [ -Wdeprecated-declarations] tryLab->setColor(ccc3(0, 0, 0)); ^ Error 1 At global scope: cc1plus.exe: warning: unrecognized command line option "-Wno-extern-c-compat" [e nabled by default] cc1plus.exe: warning: unrecognized command line option "-Wno-extern-c-compat" [e nabled by default] make: Leaving directory `E:/TTSNJ_2.0/TTSNJ_2.0/proj.android' Ndk build failed! E:\TTSNJ_2.0\TTSNJ_2.0>
Android Studio debug cocos2d-x工程,成功编译后,报错无法进虚拟机
``` ……以上编译内容省略 :AnimalPlanet:assembleDebug Skipping task ':AnimalPlanet:assembleDebug' as it has no actions. :AnimalPlanet:assembleDebug UP-TO-DATE :AnimalPlanet:assembleDebug (Thread[Task worker for ':' Thread 3,5,main]) completed. Took 0.001 secs. BUILD SUCCESSFUL in 1s 51 actionable tasks: 1 executed, 50 up-to-date Traceback (most recent call last): File "D:\environment\cocos2d-x-3.13.1\tools\cocos2d-console\bin\/cocos.py", line 998, in <module> run_plugin(command, argv, plugins) File "D:\environment\cocos2d-x-3.13.1\tools\cocos2d-console\bin\/cocos.py", line 916, in run_plugin plugin.run(argv, dependencies_objects) File "D:\environment\cocos2d-x-3.13.1\tools\cocos2d-console\plugins\plugin_compile\project_compile.py", line 1546, in run self.build_android() File "D:\environment\cocos2d-x-3.13.1\tools\cocos2d-console\plugins\plugin_compile\project_compile.py", line 527, in build_android self.apk_path = builder.do_build_apk(build_mode, self._no_apk, output_dir, self._custom_step_args, self) File "D:\environment\cocos2d-x-3.13.1\tools\cocos2d-console\plugins\plugin_compile\build_android.py", line 462, in do_build_apk shutil.copy(gen_apk_path, output_dir) File "C:\Python27\lib\shutil.py", line 119, in copy copyfile(src, dst) File "C:\Python27\lib\shutil.py", line 82, in copyfile with open(src, 'rb') as fsrc: IOError: [Errno 2] No such file or directory: 'D:\\work\\AnimalPlanet-_Iran\\proj.android-studio\\app/build/outputs/apk\\AnimalPlanet-debug.apk' Process finished with exit code 1 ``` 如果单处APK没问题,但这样没法调试Java部分(sdk接入),着急啊,感谢有经营的大神指点。
cocos2d-x-3.8编译android报错,求大神帮帮忙
创建了一个cocos2d项目,添加了几行代码,在vs2012下运行正常,编译win32也正常,但是一编译android就报错 NDK用android-ndk-r9d和android-ndk-r10两个版本试过,估计不是ndk的原因,其他的原因也想不出来,求大神帮忙解决 这是报错的原文 E:\cocos\fu100>cocos compile -p android -j 4 执行命令:compile 编译模式:debug 使用 Eclipse 工程:E:\cocos\fu100\proj.android 未指定 Android 目标平台版本,自动查找一个可用版本... 正在执行:'"D:\android-sdk\tools\android" update project -t android-10 -p E:\coc os\fu100\proj.android' Updated project.properties Updated local.properties Updated file E:\cocos\fu100\proj.android\proguard-project.txt 未指定 Android 目标平台版本,自动查找一个可用版本... 正在执行:'"D:\android-sdk\tools\android" update lib-project -p E:\cocos\fu100\c ocos2d\cocos\platform\android\java -t android-10' Updated project.properties Updated local.properties Updated file E:\cocos\fu100\cocos2d\cocos\platform\android\java\proguard-project .txt 正在执行 ndk-build... NDK 编译模式:debug NDK_TOOLCHAIN_VERSION: 4.8 正在执行:'"D:\android-ndk-r9d\ndk-build" -C E:\cocos\fu100\proj.android -j4 NDK _MODULE_PATH=E:\cocos\fu100\proj.android\../cocos2d;E:\cocos\fu100\proj.android\ ../cocos2d/cocos;E:\cocos\fu100\proj.android\../cocos2d/external NDK_TOOLCHAIN_V ERSION=4.8 NDK_DEBUG=1' make.exe: Entering directory `E:/cocos/fu100/proj.android' D:/android-ndk-r9d/build/core/build-binary.mk:393: warning: overriding commands for target `obj/local/armeabi/objs-debug/bullet_static/BulletMultiThreaded/SpuLi bspe2Support.o' D:/android-ndk-r9d/build/core/build-binary.mk:393: warning: ignoring old command s for target `obj/local/armeabi/objs-debug/bullet_static/BulletMultiThreaded/Spu Libspe2Support.o' [armeabi] Gdbserver : [arm-linux-androideabi-4.8] libs/armeabi/gdbserver [armeabi] Gdbsetup : libs/armeabi/gdb.setup [armeabi] Compile++ thumb: cocos2dcpp_shared <= main.cpp [armeabi] Compile++ thumb: cocos2dcpp_shared <= AppDelegate.cpp arm-linux-androideabi-g++: error: CreateProcess: No such file or directory [armeabi] Compile++ thumb: cocos2dcpp_shared <= HelloWorldScene.cpp make.exe: *** [obj/local/armeabi/objs-debug/cocos2dcpp_shared/hellocpp/main.o] E rror 1 make.exe: *** Waiting for unfinished jobs.... arm-linux-androideabi-g++: error: CreateProcess: No such file or directory make.exe: *** [obj/local/armeabi/objs-debug/cocos2dcpp_shared/__/__/Classes/AppD elegate.o] Error 1 arm-linux-androideabi-g++: error: CreateProcess: No such file or directory make.exe: *** [obj/local/armeabi/objs-debug/cocos2dcpp_shared/__/__/Classes/Hell oWorldScene.o] Error 1 make.exe: Leaving directory `E:/cocos/fu100/proj.android' 执行命令出错,返回值:2。 ``` 这事新建了一个空的项目,想编译来试试,结果还是报错,求大神帮忙 ``` 正在执行 ndk-build... NDK 编译模式:debug NDK_TOOLCHAIN_VERSION: 4.8 正在执行:'"D:\android-ndk-r9d\ndk-build" -C E:\cocos\test\proj.android -j4 NDK_ MODULE_PATH=E:\cocos\test\proj.android\../cocos2d;E:\cocos\test\proj.android\../ cocos2d/cocos;E:\cocos\test\proj.android\../cocos2d/external NDK_TOOLCHAIN_VERSI ON=4.8 NDK_DEBUG=1' make.exe: Entering directory `E:/cocos/test/proj.android' D:/android-ndk-r9d/build/core/build-binary.mk:393: warning: overriding commands for target `obj/local/armeabi/objs-debug/bullet_static/BulletMultiThreaded/SpuLi bspe2Support.o' D:/android-ndk-r9d/build/core/build-binary.mk:393: warning: ignoring old command s for target `obj/local/armeabi/objs-debug/bullet_static/BulletMultiThreaded/Spu Libspe2Support.o' [armeabi] StaticLibrary : libcocos2d.a [armeabi] Compile++ thumb: cocostudio_static <= WidgetReader.cpp arm-linux-androideabi-g++: error: CreateProcess: No such file or directory make.exe: *** [obj/local/armeabi/objs-debug/cocostudio_static/WidgetReader/Widge tReader.o] Error 1 make.exe: *** Waiting for unfinished jobs.... make.exe: Leaving directory `E:/cocos/test/proj.android' 执行命令出错,返回值:2。 ``` ```
cocos2D中禁用触屏动作
有没有方法在cocos2D中完全禁止触屏动作? 比如在下载文件时用户不能进行任何按钮操作。 谢谢
cocos2d可以和java后台实现交互不。
网上只找到androd和cocos2d的,但是现在我有个erp系统。用的ssm框架。想做成游戏类型的, 求大佬告知。如果cocos2d不行,希望大佬们推荐一个游戏引擎。
cocos2d-x base64编码
cocos2d-x base64编码一般的会遇到什么问题?为什么总是编码不正确?
cocos2d-x 2.2版本 如何实现工具条加载?
初学cocos2d-x,请各位帮帮忙呢,需要实现游戏开始界面的资源加载!尽量代码简洁,多注释!
cocos2d-x新建工程时勾选支持lua的时候,出现很多无法解析的外部符号问题~~
cocos2d-x的版本是2.1.3版本,用的是VS2010的~~~我已经加复制了cocos2dx,CocosDenshion,scripting那几个文件夹,也已经把cocos2d-x目录下的debug.win32下的全部lib和dll复制到了我的工程debug.win32下面了,然后就卡在这个错误上了 错误列表的错误是这样的: error LNK2001: 无法解析的外部符号 _lua_createtable 还有很长很多条~~求解决方案!!!
关于 cocos-2d-x中的错误问题
我已经安装了cocos-2d-x文件,也配置好了python27相关的编辑系统环境变量 ,我的vs也勾选了c++游戏开发的选项(支持cocos-2d),可为什么会是这个情况,哪个大佬能帮忙解决一下,谢谢,小白一枚~~~
cocos2d-x v3.10在vs2012中编译出错
我从cocos官网下载了最新的cocos2d-x V3.10版本,本地解压后,打开build文件夹下的相应的win32的sln解决文件后, 在vs2012(中文旗舰版)中,编译出错了,望各路大神不吝赐教,感激不尽!!!(我电脑的os是win7的) ↓↓↓↓↓↓↓↓↓↓↓↓↓↓↓↓↓↓↓↓↓↓↓↓↓↓↓↓↓↓↓Log如下↓↓↓↓↓↓↓↓↓↓↓↓↓↓↓↓↓↓↓↓↓↓↓↓↓↓↓↓↓↓↓ 1>------ 已启动生成: 项目: libcocos2d, 配置: Debug Win32 ------ 1>项目文件包含 ToolsVersion="12.0"。此工具集可能未知或缺失。在这种情况下,通过安装 MSBuild 的正确版本,或许可以解决此问题。否则,该 build 可能已因策略原因而被强制为某个特定 ToolsVersion。将该项目视为其已具有 ToolsVersion="4.0"。有关详细信息,请参阅 http://go.microsoft.com/fwlink/?LinkId=291333。 1>项目文件包含 ToolsVersion="12.0"。此工具集可能未知或缺失。在这种情况下,通过安装 MSBuild 的正确版本,或许可以解决此问题。否则,该 build 可能已因策略原因而被强制为某个特定 ToolsVersion。将该项目视为其已具有 ToolsVersion="4.0"。有关详细信息,请参阅 http://go.microsoft.com/fwlink/?LinkId=291333。 1>项目文件包含 ToolsVersion="12.0"。此工具集可能未知或缺失。在这种情况下,通过安装 MSBuild 的正确版本,或许可以解决此问题。否则,该 build 可能已因策略原因而被强制为某个特定 ToolsVersion。将该项目视为其已具有 ToolsVersion="4.0"。有关详细信息,请参阅 http://go.microsoft.com/fwlink/?LinkId=291333。 1>项目文件包含 ToolsVersion="12.0"。此工具集可能未知或缺失。在这种情况下,通过安装 MSBuild 的正确版本,或许可以解决此问题。否则,该 build 可能已因策略原因而被强制为某个特定 ToolsVersion。将该项目视为其已具有 ToolsVersion="4.0"。有关详细信息,请参阅 http://go.microsoft.com/fwlink/?LinkId=291333。 1> UIScale9Sprite.cpp 1>..\ui\UIScale9Sprite.cpp(1172): error C2059: 语法错误:“{” 1>..\ui\UIScale9Sprite.cpp(1172): error C2143: 语法错误 : 缺少“;”(在“{”的前面) 1>..\ui\UIScale9Sprite.cpp(1172): error C2143: 语法错误 : 缺少“;”(在“}”的前面) 1>..\ui\UIScale9Sprite.cpp(1176): error C2059: 语法错误:“{” 1>..\ui\UIScale9Sprite.cpp(1176): error C2143: 语法错误 : 缺少“;”(在“{”的前面) 1>..\ui\UIScale9Sprite.cpp(1176): error C2143: 语法错误 : 缺少“;”(在“}”的前面) 1>..\ui\UIScale9Sprite.cpp(1210): error C2059: 语法错误:“{” 1>..\ui\UIScale9Sprite.cpp(1210): error C2143: 语法错误 : 缺少“;”(在“{”的前面) 1>..\ui\UIScale9Sprite.cpp(1210): error C2143: 语法错误 : 缺少“;”(在“}”的前面) 1>..\ui\UIScale9Sprite.cpp(1299): error C2059: 语法错误:“{” 1>..\ui\UIScale9Sprite.cpp(1299): error C2143: 语法错误 : 缺少“;”(在“{”的前面) 1>..\ui\UIScale9Sprite.cpp(1299): error C2143: 语法错误 : 缺少“;”(在“}”的前面) 2>------ 已启动生成: 项目: cpp-tests, 配置: Debug Win32 ------ 2> 复制了 0 个文件 2> 找不到文件 - *.dll 2> 复制了 0 个文件 2> LabelTestNew.cpp 2> NavMeshTest.cpp 2> UIScale9SpriteTest.cpp 2> controller.cpp 2>C:\cocos2d-x-3.10\external\chipmunk\include\chipmunk\chipmunk.h(26): warning C4005: “_USE_MATH_DEFINES”: 宏重定义 (..\Classes\controller.cpp) 2> 命令行参数: 参见前面的“_USE_MATH_DEFINES”定义 2>..\Classes\UITest\CocoStudioGUITest\UIScale9SpriteTest.cpp(989): error C2552: “spriteFrameNameArray”: 不能用初始值设定项列表初始化非聚合 2> “std::vector<_Ty>”: 不聚合带基的类型 2> with 2> [ 2> _Ty=std::string 2> ] 2> DrawPrimitivesTest.cpp 2>c:\cocos2d-x-3.10\tests\cpp-tests\classes\ActionManagerTest/ActionManagerTest.h(92): error C2864: “StopActionsByFlagsTest::kMoveFlag”: 只有静态常量整型数据成员才可以在类中初始化 (..\Classes\controller.cpp) 2>c:\cocos2d-x-3.10\tests\cpp-tests\classes\ActionManagerTest/ActionManagerTest.h(93): error C2864: “StopActionsByFlagsTest::kScaleFlag”: 只有静态常量整型数据成员才可以在类中初始化 (..\Classes\controller.cpp) 2>c:\cocos2d-x-3.10\tests\cpp-tests\classes\ActionManagerTest/ActionManagerTest.h(94): error C2864: “StopActionsByFlagsTest::kRotateFlag”: 只有静态常量整型数据成员才可以在类中初始化 (..\Classes\controller.cpp) 2>c:\cocos2d-x-3.10\tests\cpp-tests\classes\ActionManagerTest/ActionManagerTest.h(95): error C2864: “StopActionsByFlagsTest::kRepeatForeverFlag”: 只有静态常量整型数据成员才可以在类中初始化 (..\Classes\controller.cpp) 2>c:\cocos2d-x-3.10\tests\cpp-tests\classes\ActionManagerTest/ActionManagerTest.h(86): error C2512: “StopActionsByFlagsTest”: 没有合适的默认构造函数可用 (..\Classes\controller.cpp) 2>..\Classes\LabelTest\LabelTestNew.cpp(1027): warning C4018: “<”: 有符号/无符号不匹配 2>c:\cocos2d-x-3.10\external\bullet\bulletcollision\broadphasecollision\btDbvtBroadphase.h(62): warning C4099: “btDbvtBroadphase”: 类型名称以前使用“class”现在使用的是“struct” (..\Classes\NavMeshTest\NavMeshTest.cpp) 2> c:\cocos2d-x-3.10\cocos\physics3d\CCPhysics3DWorld.h(39) : 参见“btDbvtBroadphase”的声明 2>..\Classes\LabelTest\LabelTestNew.cpp(1841): warning C4819: 该文件包含不能在当前代码页(936)中表示的字符。请将该文件保存为 Unicode 格式以防止数据丢失 2>..\Classes\LabelTest\LabelTestNew.cpp(2524): error C2552: “labelTypes”: 不能用初始值设定项列表初始化非聚合 2> “std::vector<_Ty>”: 不聚合带基的类型 2> with 2> [ 2> _Ty=std::string 2> ] 2>..\Classes\NavMeshTest\NavMeshTest.cpp(181): error C2143: 语法错误 : 缺少“;”(在“{”的前面) 2>..\Classes\NavMeshTest\NavMeshTest.cpp(181): error C2143: 语法错误 : 缺少“;”(在“}”的前面) 2>..\Classes\LabelTest\LabelTestNew.cpp(2665): error C2552: “labelTypes”: 不能用初始值设定项列表初始化非聚合 2> “std::vector<_Ty>”: 不聚合带基的类型 2> with 2> [ 2> _Ty=std::string 2> ] 2> ActionManagerTest.cpp 2>..\Classes\DrawPrimitivesTest\DrawPrimitivesTest.cpp(317): error C2552: “cocos2d::V3F_C4B_T2F::vertices”: 不能用初始值设定项列表初始化非聚合 2> “cocos2d::Vec3”: 不聚合带用户定义的构造函数的类型 2>..\Classes\DrawPrimitivesTest\DrawPrimitivesTest.cpp(318): error C2552: “cocos2d::V3F_C4B_T2F::vertices”: 不能用初始值设定项列表初始化非聚合 2> “cocos2d::Vec3”: 不聚合带用户定义的构造函数的类型 2>..\Classes\DrawPrimitivesTest\DrawPrimitivesTest.cpp(319): error C2552: “cocos2d::V3F_C4B_T2F::vertices”: 不能用初始值设定项列表初始化非聚合 2> “cocos2d::Vec3”: 不聚合带用户定义的构造函数的类型 2>..\Classes\DrawPrimitivesTest\DrawPrimitivesTest.cpp(320): error C2552: “cocos2d::V3F_C4B_T2F::vertices”: 不能用初始值设定项列表初始化非聚合 2> “cocos2d::Vec3”: 不聚合带用户定义的构造函数的类型 2>c:\cocos2d-x-3.10\tests\cpp-tests\classes\actionmanagertest\ActionManagerTest.h(92): error C2864: “StopActionsByFlagsTest::kMoveFlag”: 只有静态常量整型数据成员才可以在类中初始化 (..\Classes\ActionManagerTest\ActionManagerTest.cpp) 2>c:\cocos2d-x-3.10\tests\cpp-tests\classes\actionmanagertest\ActionManagerTest.h(93): error C2864: “StopActionsByFlagsTest::kScaleFlag”: 只有静态常量整型数据成员才可以在类中初始化 (..\Classes\ActionManagerTest\ActionManagerTest.cpp) 2>c:\cocos2d-x-3.10\tests\cpp-tests\classes\actionmanagertest\ActionManagerTest.h(94): error C2864: “StopActionsByFlagsTest::kRotateFlag”: 只有静态常量整型数据成员才可以在类中初始化 (..\Classes\ActionManagerTest\ActionManagerTest.cpp) 2>c:\cocos2d-x-3.10\tests\cpp-tests\classes\actionmanagertest\ActionManagerTest.h(95): error C2864: “StopActionsByFlagsTest::kRepeatForeverFlag”: 只有静态常量整型数据成员才可以在类中初始化 (..\Classes\ActionManagerTest\ActionManagerTest.cpp) 2>c:\cocos2d-x-3.10\tests\cpp-tests\classes\actionmanagertest\ActionManagerTest.h(86): error C2512: “StopActionsByFlagsTest”: 没有合适的默认构造函数可用 (..\Classes\ActionManagerTest\ActionManagerTest.cpp) ========== 生成: 成功 0 个,失败 2 个,最新 4 个,跳过 0 个 ==========
cocos2d-Android游戏引擎中如何切换场景
Android开发中用cocos2d-Android游戏引擎如何切换场景
cocos2d-objc- 3.49 3.5 ios 怎么安装 和cocos3d 怎么结合
最近才开始学cocos2d cocos3d 下载了最新版本的 发现 cocos2d 3.5没有install 。sh 然后cocos2d 2.2.6版本的创建新工厂编译成功 运行失败 和coco3d 用命令行按教程进行搭建环境 最后cchelloworld 丢失文件 无法运行 究竟是版本问题还是操作问题呢 求解答!!
终于明白阿里百度这样的大公司,为什么面试经常拿ThreadLocal考验求职者了
点击上面↑「爱开发」关注我们每晚10点,捕获技术思考和创业资源洞察什么是ThreadLocalThreadLocal是一个本地线程副本变量工具类,各个线程都拥有一份线程私有的数
程序员必须掌握的核心算法有哪些?
由于我之前一直强调数据结构以及算法学习的重要性,所以就有一些读者经常问我,数据结构与算法应该要学习到哪个程度呢?,说实话,这个问题我不知道要怎么回答你,主要取决于你想学习到哪些程度,不过针对这个问题,我稍微总结一下我学过的算法知识点,以及我觉得值得学习的算法。这些算法与数据结构的学习大多数是零散的,并没有一本把他们全部覆盖的书籍。下面是我觉得值得学习的一些算法以及数据结构,当然,我也会整理一些看过...
《奇巧淫技》系列-python!!每天早上八点自动发送天气预报邮件到QQ邮箱
此博客仅为我业余记录文章所用,发布到此,仅供网友阅读参考,如有侵权,请通知我,我会删掉。 补充 有不少读者留言说本文章没有用,因为天气预报直接打开手机就可以收到了,为何要多此一举发送到邮箱呢!!!那我在这里只能说:因为你没用,所以你没用!!! 这里主要介绍的是思路,不是天气预报!不是天气预报!!不是天气预报!!!天气预报只是用于举例。请各位不要再刚了!!! 下面是我会用到的两个场景: 每日下
面试官问我:什么是消息队列?什么场景需要他?用了会出现什么问题?
你知道的越多,你不知道的越多 点赞再看,养成习惯 GitHub上已经开源 https://github.com/JavaFamily 有一线大厂面试点脑图、个人联系方式,欢迎Star和完善 前言 消息队列在互联网技术存储方面使用如此广泛,几乎所有的后端技术面试官都要在消息队列的使用和原理方面对小伙伴们进行360°的刁难。 作为一个在互联网公司面一次拿一次Offer的面霸,打败了无数
8年经验面试官详解 Java 面试秘诀
    作者 | 胡书敏 责编 | 刘静 出品 | CSDN(ID:CSDNnews) 本人目前在一家知名外企担任架构师,而且最近八年来,在多家外企和互联网公司担任Java技术面试官,前后累计面试了有两三百位候选人。在本文里,就将结合本人的面试经验,针对Java初学者、Java初级开发和Java开发,给出若干准备简历和准备面试的建议。   Java程序员准备和投递简历的实
究竟你适不适合买Mac?
我清晰的记得,刚买的macbook pro回到家,开机后第一件事情,就是上了淘宝网,花了500元钱,找了一个上门维修电脑的师傅,上门给我装了一个windows系统。。。。。。 表砍我。。。 当时买mac的初衷,只是想要个固态硬盘的笔记本,用来运行一些复杂的扑克软件。而看了当时所有的SSD笔记本后,最终决定,还是买个好(xiong)看(da)的。 已经有好几个朋友问我mba怎么样了,所以今天尽量客观
程序员一般通过什么途径接私活?
二哥,你好,我想知道一般程序猿都如何接私活,我也想接,能告诉我一些方法吗? 上面是一个读者“烦不烦”问我的一个问题。其实不止是“烦不烦”,还有很多读者问过我类似这样的问题。 我接的私活不算多,挣到的钱也没有多少,加起来不到 20W。说实话,这个数目说出来我是有点心虚的,毕竟太少了,大家轻喷。但我想,恰好配得上“一般程序员”这个称号啊。毕竟苍蝇再小也是肉,我也算是有经验的人了。 唾弃接私活、做外
大学四年自学走来,这些珍藏的「实用工具/学习网站」我全贡献出来了
知乎高赞:文中列举了互联网一线大厂程序员都在用的工具集合,涉及面非常广,小白和老手都可以进来看看,或许有新收获。
《阿里巴巴开发手册》读书笔记-编程规约
Java编程规约命名风格 命名风格 类名使用UpperCamelCase风格 方法名,参数名,成员变量,局部变量都统一使用lowerCamelcase风格 常量命名全部大写,单词间用下划线隔开, 力求语义表达完整清楚,不要嫌名字长 ...
Python爬虫爬取淘宝,京东商品信息
小编是一个理科生,不善长说一些废话。简单介绍下原理然后直接上代码。 使用的工具(Python+pycharm2019.3+selenium+xpath+chromedriver)其中要使用pycharm也可以私聊我selenium是一个框架可以通过pip下载 pip install selenium -i https://pypi.tuna.tsinghua.edu.cn/simple/ 
阿里程序员写了一个新手都写不出的低级bug,被骂惨了。
你知道的越多,你不知道的越多 点赞再看,养成习惯 本文 GitHub https://github.com/JavaFamily 已收录,有一线大厂面试点思维导图,也整理了很多我的文档,欢迎Star和完善,大家面试可以参照考点复习,希望我们一起有点东西。 前前言 为啥今天有个前前言呢? 因为你们的丙丙啊,昨天有牌面了哟,直接被微信官方推荐,知乎推荐,也就仅仅是还行吧(心里乐开花)
Java工作4年来应聘要16K最后没要,细节如下。。。
前奏: 今天2B哥和大家分享一位前几天面试的一位应聘者,工作4年26岁,统招本科。 以下就是他的简历和面试情况。 基本情况: 专业技能: 1、&nbsp;熟悉Sping了解SpringMVC、SpringBoot、Mybatis等框架、了解SpringCloud微服务 2、&nbsp;熟悉常用项目管理工具:SVN、GIT、MAVEN、Jenkins 3、&nbsp;熟悉Nginx、tomca
Python爬虫精简步骤1 获取数据
爬虫的工作分为四步: 1.获取数据。爬虫程序会根据我们提供的网址,向服务器发起请求,然后返回数据。 2.解析数据。爬虫程序会把服务器返回的数据解析成我们能读懂的格式。 3.提取数据。爬虫程序再从中提取出我们需要的数据。 4.储存数据。爬虫程序把这些有用的数据保存起来,便于你日后的使用和分析。 这一篇的内容就是:获取数据。 首先,我们将会利用一个强大的库——requests来获取数据。 在电脑上安装
Python绘图,圣诞树,花,爱心 | Turtle篇
1.画圣诞树 import turtle screen = turtle.Screen() screen.setup(800,600) circle = turtle.Turtle() circle.shape('circle') circle.color('red') circle.speed('fastest') circle.up() square = turtle.Turtle()
作为一个程序员,CPU的这些硬核知识你必须会!
CPU对每个程序员来说,是个既熟悉又陌生的东西? 如果你只知道CPU是中央处理器的话,那可能对你并没有什么用,那么作为程序员的我们,必须要搞懂的就是CPU这家伙是如何运行的,尤其要搞懂它里面的寄存器是怎么一回事,因为这将让你从底层明白程序的运行机制。 随我一起,来好好认识下CPU这货吧 把CPU掰开来看 对于CPU来说,我们首先就要搞明白它是怎么回事,也就是它的内部构造,当然,CPU那么牛的一个东
破14亿,Python分析我国存在哪些人口危机!
2020年1月17日,国家统计局发布了2019年国民经济报告,报告中指出我国人口突破14亿。 猪哥的朋友圈被14亿人口刷屏,但是很多人并没有看到我国复杂的人口问题:老龄化、男女比例失衡、生育率下降、人口红利下降等。 今天我们就来分析一下我们国家的人口数据吧! 更多有趣分析教程,扫描下方二维码关注vx公号「裸睡的猪」 即可查看! 一、背景 1.人口突破14亿 2020年1月17日,国家统计局发布
听说想当黑客的都玩过这个Monyer游戏(1~14攻略)
第零关 进入传送门开始第0关(游戏链接) 请点击链接进入第1关: 连接在左边→ ←连接在右边 看不到啊。。。。(只能看到一堆大佬做完的留名,也能看到菜鸡的我,在后面~~) 直接fn+f12吧 &lt;span&gt;连接在左边→&lt;/span&gt; &lt;a href="first.php"&gt;&lt;/a&gt; &lt;span&gt;←连接在右边&lt;/span&gt; o
在家远程办公效率低?那你一定要收好这个「在家办公」神器!
相信大家都已经收到国务院延长春节假期的消息,接下来,在家远程办公可能将会持续一段时间。 但是问题来了。远程办公不是人在电脑前就当坐班了,相反,对于沟通效率,文件协作,以及信息安全都有着极高的要求。有着非常多的挑战,比如: 1在异地互相不见面的会议上,如何提高沟通效率? 2文件之间的来往反馈如何做到及时性?如何保证信息安全? 3如何规划安排每天工作,以及如何进行成果验收? ......
作为一个程序员,内存和磁盘的这些事情,你不得不知道啊!!!
截止目前,我已经分享了如下几篇文章: 一个程序在计算机中是如何运行的?超级干货!!! 作为一个程序员,CPU的这些硬核知识你必须会! 作为一个程序员,内存的这些硬核知识你必须懂! 这些知识可以说是我们之前都不太重视的基础知识,可能大家在上大学的时候都学习过了,但是嘞,当时由于老师讲解的没那么有趣,又加上这些知识本身就比较枯燥,所以嘞,大家当初几乎等于没学。 再说啦,学习这些,也看不出来有什么用啊!
别低估自己的直觉,也别高估自己的智商
所有群全部吵翻天,朋友圈全部沦陷,公众号疯狂转发。这两周没怎么发原创,只发新闻,可能有人注意到了。我不是懒,是文章写了却没发,因为大家的关注力始终在这次的疫情上面,发了也没人看。当然,我...
这个世界上人真的分三六九等,你信吗?
偶然间,在知乎上看到一个问题 一时间,勾起了我深深的回忆。 以前在厂里打过两次工,做过家教,干过辅导班,做过中介。零下几度的晚上,贴过广告,满脸、满手地长冻疮。   再回首那段岁月,虽然苦,但让我学会了坚持和忍耐。让我明白了,在这个世界上,无论环境多么的恶劣,只要心存希望,星星之火,亦可燎原。   下文是原回答,希望能对你能有所启发。   如果我说,这个世界上人真的分三六九等,
为什么听过很多道理,依然过不好这一生?
记录学习笔记是一个重要的习惯,不希望学习过的东西成为过眼云烟。做总结的同时也是一次复盘思考的过程。 本文是根据阅读得到 App上《万维钢·精英日课》部分文章后所做的一点笔记和思考。学习是一个系统的过程,思维模型的建立需要相对完整的学习和思考过程。以下观点是在碎片化阅读后总结的一点心得总结。
B 站上有哪些很好的学习资源?
哇说起B站,在小九眼里就是宝藏般的存在,放年假宅在家时一天刷6、7个小时不在话下,更别提今年的跨年晚会,我简直是跪着看完的!! 最早大家聚在在B站是为了追番,再后来我在上面刷欧美新歌和漂亮小姐姐的舞蹈视频,最近两年我和周围的朋友们已经把B站当作学习教室了,而且学习成本还免费,真是个励志的好平台ヽ(.◕ฺˇд ˇ◕ฺ;)ノ 下面我们就来盘点一下B站上优质的学习资源: 综合类 Oeasy: 综合
如何优雅地打印一个Java对象?
你好呀,我是沉默王二,一个和黄家驹一样身高,和刘德华一样颜值的程序员。虽然已经写了十多年的 Java 代码,但仍然觉得自己是个菜鸟(请允许我惭愧一下)。 在一个月黑风高的夜晚,我思前想后,觉得再也不能这么蹉跎下去了。于是痛下决心,准备通过输出的方式倒逼输入,以此来修炼自己的内功,从而进阶成为一名真正意义上的大神。与此同时,希望这些文章能够帮助到更多的读者,让大家在学习的路上不再寂寞、空虚和冷。 ...
雷火神山直播超两亿,Web播放器事件监听是怎么实现的?
Web播放器解决了在手机浏览器和PC浏览器上播放音视频数据的问题,让视音频内容可以不依赖用户安装App,就能进行播放以及在社交平台进行传播。在视频业务大数据平台中,播放数据的统计分析非常重要,所以Web播放器在使用过程中,需要对其内部的数据进行收集并上报至服务端,此时,就需要对发生在其内部的一些播放行为进行事件监听。 那么Web播放器事件监听是怎么实现的呢? 01 监听事件明细表 名
3万字总结,Mysql优化之精髓
本文知识点较多,篇幅较长,请耐心学习 MySQL已经成为时下关系型数据库产品的中坚力量,备受互联网大厂的青睐,出门面试想进BAT,想拿高工资,不会点MySQL优化知识,拿offer的成功率会大大下降。 为什么要优化 系统的吞吐量瓶颈往往出现在数据库的访问速度上 随着应用程序的运行,数据库的中的数据会越来越多,处理时间会相应变慢 数据是存放在磁盘上的,读写速度无法和内存相比 如何优化 设计
Linux 命令(122)—— watch 命令
1.命令简介 2.命令格式 3.选项说明 4.常用示例 参考文献 [1] watch(1) manual
Linux 命令(121)—— cal 命令
1.命令简介 2.命令格式 3.选项说明 4.常用示例 参考文献 [1] cal(1) manual
记jsp+servlet+jdbc实现的新闻管理系统
1.工具:eclipse+SQLyog 2.介绍:实现的内容就是显示新闻的基本信息,然后一个增删改查的操作。 3.数据库表设计 列名 中文名称 数据类型 长度 非空 newsId 文章ID int 11 √ newsTitle 文章标题 varchar 20 √ newsContent 文章内容 text newsStatus 是否审核 varchar 10 news...
Python新型冠状病毒疫情数据自动爬取+统计+发送报告+数据屏幕(三)发送篇
今天介绍的项目是使用 Itchat 发送统计报告 项目功能设计: 定时爬取疫情数据存入Mysql 进行数据分析制作疫情报告 使用itchat给亲人朋友发送分析报告(本文) 基于Django做数据屏幕 使用Tableau做数据分析 来看看最终效果 目前已经完成,预计2月12日前更新 使用 itchat 发送数据统计报告 itchat 是一个基于 web微信的一个框架,但微信官方并不允
相关热词 c#导入fbx c#中屏蔽键盘某个键 c#正态概率密度 c#和数据库登陆界面设计 c# 高斯消去法 c# codedom c#读取cad文件文本 c# 控制全局鼠标移动 c# temp 目录 bytes初始化 c#
立即提问