maven项目,junit test时出错,应该不是zeroDateTimeBehavior问题 5C

图片说明

0

2个回答

数据库数据错了吧,是不是有0000-00-00

1
sinat_41684925
sinat_41684925 确实是出现这种数据了,我的是mysql8.0版本的,该怎么解决好呢
大约一年之前 回复

jdbc:mysql://*****:3306/******?zeroDateTimeBehavior=convertToNull

设置zeroDateTimeBehavior 属性,当遇到DATETIME值完全由0组成时,最终的有效值可以设置为,异常(exception),一个近似值(round),或将这个值转换为null(convertToNull)。

设置zeroDateTimeBehavior 属性,当遇到DATETIME值完全由0组成时,最终的有效值可以设置为,异常(exception),一个近似值(round),或将这个值转换为null(convertToNull)。

1
sinat_41684925
sinat_41684925 我的是TIMESTAMP 类型时间,这个好像没用
大约一年之前 回复
Csdn user default icon
上传中...
上传图片
插入图片
抄袭、复制答案,以达到刷声望分或其他目的的行为,在CSDN问答是严格禁止的,一经发现立刻封号。是时候展现真正的技术了!
其他相关推荐
junit @test问题
我将很多的类似的 @test 以程序结合在一起 变成了一个 @test 断言设置为 一个断言失败 整个断言失败的模式 rn在 运行时 只会显示一个 @test的结果rnrn我想编写成 和 拥有 多个@test的形式 在junit中 而且 还只用一个方法的模式 如何实现
eclipse打包maven项目时跳过单元测试junit
在pom.xml中添加如下plugin             <plugin>                <groupId>org.apache.maven.plugins</groupId>                    <artifactId>maven-surefire-plugin</artifactId>    ...
maven项目调试Junit类
maven项目提供了对单元测试类的批量执行功能,但有时我们想针对某个类进行调试,尽管这些类的配置可能依赖filter属性,也是可以进行测试的。 方法:执行mvn install,将项目打包,然后再执行debug->junit,就可以正常调试了。
maven项目,单元测试jacoco、junit
maven项目,单元测试jacoco、junit...........................................................................................
Java使用junit时出错
Could not connect to: : 50252 rnjava.net.ConnectException: Connection timed out: connectrn at java.net.DualStackPlainSocketImpl.connect0(Native Method)rn at java.net.DualStackPlainSocketImpl.socketConnect(DualStackPlainSocketImpl.java:79)rn at java.net.AbstractPlainSocketImpl.doConnect(AbstractPlainSocketImpl.java:345)rn at java.net.AbstractPlainSocketImpl.connectToAddress(AbstractPlainSocketImpl.java:206)rn at java.net.AbstractPlainSocketImpl.connect(AbstractPlainSocketImpl.java:188)rn at java.net.PlainSocketImpl.connect(PlainSocketImpl.java:172)rn at java.net.SocksSocketImpl.connect(SocksSocketImpl.java:392)rn at java.net.Socket.connect(Socket.java:589)rn at java.net.Socket.connect(Socket.java:538)rn at java.net.Socket.(Socket.java:434)rn at java.net.Socket.(Socket.java:211)rn at org.eclipse.jdt.internal.junit.runner.RemoteTestRunner.connect(RemoteTestRunner.java:562)rn at org.eclipse.jdt.internal.junit.runner.RemoteTestRunner.run(RemoteTestRunner.java:373)rn at org.eclipse.jdt.internal.junit.runner.RemoteTestRunner.main(RemoteTestRunner.java:192)
myeclipse6.5执行junit时出错
请教高手:rnrn我用myeclipse6.0执行的junit测试是完全正常的,rn更换到6.5以后就出现问题了!rnrn代码:rnpackage com.eastib.test.spring.junit.dao;rnrnrnimport static org.junit.Assert.*;rnimport static org.junit.Assert.assertEquals;rnimport static org.junit.Assert.assertTrue;rnrnimport java.sql.Date;rnimport java.text.SimpleDateFormat;rnimport java.util.Calendar;rnimport java.util.GregorianCalendar;rnimport java.util.List;rnimport java.util.Random;rnrnimport org.junit.After;rnimport org.junit.Before;rnimport org.junit.Test;rnimport org.springframework.context.ApplicationContext;rnimport org.springframework.context.support.ClassPathXmlApplicationContext;rnrnimport com.eastib.dao.FriendlyLinkDao;rnimport com.eastib.dao.IdioAlbumDao;rnimport com.eastib.dao.IdioTypeDao;rnimport com.eastib.dao.IdioVisitorDao;rnimport com.eastib.dao.UserForumGroupDao;rnimport com.eastib.dao.UserMainDao;rnimport com.eastib.model.FriendlyLink;rnimport com.eastib.model.IdioAlbum;rnimport com.eastib.model.IdioType;rnimport com.eastib.model.IdioVisitor;rnimport com.eastib.source.dao.ForumAdminDAO;rnimport com.eastib.source.dao.DbForumPostDAO;rnimport com.eastib.source.model.DbForumpostList;rnimport com.eastib.source.model.DbUserMain;rnrnpublic class TestFriendlyLinkDao rnrn private static ApplicationContext act=new ClassPathXmlApplicationContext("com/eastib/test/spring/applicationContext.xml");rnrn private static FriendlyLinkDao friendlyLinkDao=(FriendlyLinkDao)act.getBean("friendlyLinkDao");rn rnrn rn private static int id=0;rn rnrn @Beforern public void setUp() throws Exception rn rnrn @Afterrn public void tearDown() throws Exception rn rn /**rn * 新增rn * @throws Exceptionrn */rn @Testrn public void testSaveAndGet()throws Exceptionrn System.out.println("aa");rn FriendlyLink fl=new FriendlyLink();rn rn fl.setFlDate(new java.sql.Date(new java.util.Date().getTime()));rn rn fl.setFlIndex(true);rn rn fl.setFlName("网易");rn rn fl.setFlUrl("http://www.163.com");rnrn fl.setFlStatus(1);rn rn fl.setFlTitle("新闻");rn rn fl.setFlTemp("未用");rn rn friendlyLinkDao.saveObject(fl);rn rn rn public static void main(String[] args)throws Exceptionrn TestFriendlyLinkDao tf=new TestFriendlyLinkDao();rn rn tf.testSaveAndGet();rn rn rn rn rnrnrn这是一个友情链接功能的测试用例。rnrn我使用junit启动时:大家看控制台:rnrn10:36:58,281 INFO SettingsFactory:294 - Deleted entity synthetic identifier rollback: disabledrn10:36:58,281 INFO SettingsFactory:309 - Default entity-mode: pojorn10:36:58,281 INFO SettingsFactory:313 - Named query checking : enabledrnrn执行到这一步就不动,并且提出一个windows的错误提示,“javaw.exe遇到问题需要关闭...”下面的选项是希望我发送错误报告。rnrn大家也注意到我的代码里面是用main方法的,就是为了测试,我用main来执行时,是非常正常的!数据也正确的添加到数据库中了!rnrn我总结了一下:rn1.myeclipse6.0是可以正常的,myeclipse6.5执行unit后才出错的。rn2.myeclipse6.5如果不初始化spring的时候,也是可以正常执行的。rn3.hibernate的代码本身是没有问题的。rnrn请问大家,这是怎么回事?rn我如何才可以在myeclipse6.5中可以使用junit来初始化spring呢?rn谢谢!rn
JUnit多线程Test
今天测试SimpleDateFormat时用到多线程,但最初Junit并不理想,Mark一下。      Junit多线程测试如下,直接run会发现程序没有任何异常,但debug时SimpleDateFormatUtil却ParseException异常,说明Junit在多线程下Test是有bug的。【SimpleDateFormatUtil为Date解析工具类】 @Test public 
运行junit test失败
使用junit测试项目时,出现如下错误   java.lang.NoSuchMethodError: org.junit.runner.Request.classWithoutSuiteMethod(Ljava/lang/Class;)Lorg/junit/runner/Request;     at org.eclipse.jdt.internal.junit4.runner.JUnit4T...
GWT JUnit test
现在有一个java程序,用到的东西有eclipse,maven,gwt,Junit 4,现在我想用GWT JUnit test 进行测试,我建了一个简单的测试类,右击它,点“run as"时,没有GWT JUnit Test 这个选项,我应该如何做才会出现它呢!正在学习中,问题应该很幼稚,请各位指教,谢谢!
junit 执行单个@test
说明:当一个类存在多个@test的时候,如何执行单个@test 解决方法:找到outline工具栏。 我这里使用的是myeclipse开发,如下图所示:图中右上角位置有个开发模式切换,有myeclipse、Java,这里我们需要选择Java模式即可
Junit Test使用样例
Junit Test使用样例
Junit Test 常见问题
anyString()什么时候使用1.1).比如在controller层,API地址中有映射参数时,那么when的时候(模拟service层调用)就要用到anyString() eg: Controller Layer: @DeleteMapping(value = "/detail/lock/{guid}") @ApiOperation(value = "delete the l
解决导入maven项目时 jsp文件的出错的问题
依赖tomcat类库: 1.    项目右击—>build path —> configure build path — >libraries — > add libraries —> Server Runtime — >选择一个服务器lib —> ok 2.    windows—>Preferences—>Validation—>...
junit学习(二)——junit自动生成Test Method
上一篇中CalculateTest中的四个方法都是手敲的,要是方法比较少还好,要是比较多得敲到什么时候啊?下面说个半自动生成Test method的方法。 在MyEclipse的左侧视图中选中Calculate.java---->右击---->New---->Other....---->JUnit Test Case---->Next,然后就会弹出形如以下的图:...
junit common test case just for my test
junit test
Intellij中maven项目使用junit时,遇到的问题
Error:(3, 17) java: 程序包org.junit不存在 Error:(7, 6) java: 找不到符号   符号:   类 Test   位置: 类 SpringDeom1 大致的意思是,没有找到测试包 但是我导入了测试包 在网上百度了一下 说是因为编译的时候没有对测试包进行编译,导致没有找到测试包 然后我就用网上的方法,吧pom中的test去掉了,发现还是一样的报错...
hibernate junit时的问题
错误信息如下rnjava.lang.ExceptionInInitializerErrorrn at service.UserManager.exists(UserManager.java:8)rn at service.UserManagerTest.testExists(UserManagerTest.java:17)rn at sun.reflect.NativeMethodAccessorImpl.invoke0(Native Method)rn at sun.reflect.NativeMethodAccessorImpl.invoke(NativeMethodAccessorImpl.java:39)rn at sun.reflect.DelegatingMethodAccessorImpl.invoke(DelegatingMethodAccessorImpl.java:25)rn at java.lang.reflect.Method.invoke(Method.java:597)rn at org.junit.runners.model.FrameworkMethod$1.runReflectiveCall(FrameworkMethod.java:44)rn at org.junit.internal.runners.model.ReflectiveCallable.run(ReflectiveCallable.java:15)rn at org.junit.runners.model.FrameworkMethod.invokeExplosively(FrameworkMethod.java:41)rn at org.junit.internal.runners.statements.InvokeMethod.evaluate(InvokeMethod.java:20)rn at org.junit.internal.runners.statements.RunBefores.evaluate(RunBefores.java:28)rn at org.junit.internal.runners.statements.RunAfters.evaluate(RunAfters.java:31)rn at org.junit.runners.BlockJUnit4ClassRunner.runChild(BlockJUnit4ClassRunner.java:73)rn at org.junit.runners.BlockJUnit4ClassRunner.runChild(BlockJUnit4ClassRunner.java:46)rn at org.junit.runners.ParentRunner.runChildren(ParentRunner.java:180)rn at org.junit.runners.ParentRunner.access$000(ParentRunner.java:41)rn at org.junit.runners.ParentRunner$1.evaluate(ParentRunner.java:173)rn at org.junit.internal.runners.statements.RunBefores.evaluate(RunBefores.java:28)rn at org.junit.internal.runners.statements.RunAfters.evaluate(RunAfters.java:31)rn at org.junit.runners.ParentRunner.run(ParentRunner.java:220)rn at org.eclipse.jdt.internal.junit4.runner.JUnit4TestReference.run(JUnit4TestReference.java:46)rn at org.eclipse.jdt.internal.junit.runner.TestExecution.run(TestExecution.java:38)rn at org.eclipse.jdt.internal.junit.runner.RemoteTestRunner.runTests(RemoteTestRunner.java:467)rn at org.eclipse.jdt.internal.junit.runner.RemoteTestRunner.runTests(RemoteTestRunner.java:683)rn at org.eclipse.jdt.internal.junit.runner.RemoteTestRunner.run(RemoteTestRunner.java:390)rn at org.eclipse.jdt.internal.junit.runner.RemoteTestRunner.main(RemoteTestRunner.java:197)rnCaused by: org.hibernate.HibernateException: could not instantiate RegionFactory [org.hibernate.cache.impl.bridge.RegionFactoryCacheProviderBridge]rn at org.hibernate.cfg.SettingsFactory.createRegionFactory(SettingsFactory.java:389)rn at org.hibernate.cfg.SettingsFactory.buildSettings(SettingsFactory.java:262)rn at org.hibernate.cfg.Configuration.buildSettingsInternal(Configuration.java:2119)rn at org.hibernate.cfg.Configuration.buildSettings(Configuration.java:2115)rn at org.hibernate.cfg.Configuration.buildSessionFactory(Configuration.java:1339)rn at org.hibernate.cfg.AnnotationConfiguration.buildSessionFactory(AnnotationConfiguration.java:867)rn at util.HibernateUtil.(HibernateUtil.java:9)rn ... 26 morernCaused by: java.lang.reflect.InvocationTargetExceptionrn at sun.reflect.NativeConstructorAccessorImpl.newInstance0(Native Method)rn at sun.reflect.NativeConstructorAccessorImpl.newInstance(NativeConstructorAccessorImpl.java:39)rn at sun.reflect.DelegatingConstructorAccessorImpl.newInstance(DelegatingConstructorAccessorImpl.java:27)rn at java.lang.reflect.Constructor.newInstance(Constructor.java:513)rn at org.hibernate.cfg.SettingsFactory.createRegionFactory(SettingsFactory.java:384)rn ... 32 morernCaused by: org.hibernate.cache.CacheException: could not instantiate CacheProvider [org.hibernate.cache.internal.NoCacheProvider]rn at org.hibernate.cache.impl.bridge.RegionFactoryCacheProviderBridge.(RegionFactoryCacheProviderBridge.java:66)rn ... 37 morernCaused by: java.lang.ClassNotFoundException: org.hibernate.cache.internal.NoCacheProviderrn at java.net.URLClassLoader$1.run(URLClassLoader.java:200)rn at java.security.AccessController.doPrivileged(Native Method)rn at java.net.URLClassLoader.findClass(URLClassLoader.java:188)rn at java.lang.ClassLoader.loadClass(ClassLoader.java:307)rn at sun.misc.Launcher$AppClassLoader.loadClass(Launcher.java:301)rn at java.lang.ClassLoader.loadClass(ClassLoader.java:252)rn at java.lang.ClassLoader.loadClassInternal(ClassLoader.java:320)rn at java.lang.Class.forName0(Native Method)rn at java.lang.Class.forName(Class.java:169)rn at org.hibernate.util.ReflectHelper.classForName(ReflectHelper.java:192)rn at org.hibernate.cache.impl.bridge.RegionFactoryCacheProviderBridge.(RegionFactoryCacheProviderBridge.java:63)rn ... 37 morernrn————————————————————————————————————————————————hibernate配置文件如下rnrnrnrnrnrn rn com.mysql.jdbc.Driverrn jdbc:mysql://localhost/testrn rootrn rootrn org.hibernate.dialect.MySQLDialectrn 1rn threadrn org.hibernate.cache.internal.NoCacheProviderrn truern truern rn rnrnrn------------------------------------------------------------------------rnmodel层rnrnpackage model;rnrnimport javax.persistence.Entity;rnimport javax.persistence.GeneratedValue;rnimport javax.persistence.Id;rnrn@Entityrnpublic class User rn private int id;rn private String username;rn private String password;rn @Idrn @GeneratedValuern public int getId() rn return id;rn rn public void setId(int id) rn this.id = id;rn rnrn public String getUsername() rn return username;rn rn public void setUsername(String username) rn this.username = username;rn rn public String getPassword() rn return password;rn rn public void setPassword(String password) rn this.password = password;rn rn rnrnrn------------------------------------------------rnservice层rnpackage service;rnimport model.User;rnimport org.hibernate.SessionFactory;rnimport org.hibernate.classic.Session;rnimport util.HibernateUtil;rnpublic class UserManager rn public boolean exists(User u) throws Exception rn SessionFactory sf = HibernateUtil.getSessionFactory();rn Session s = sf.getCurrentSession();rn s.beginTransaction();rn long count = (Long)s.createQuery("select count(*) from User u where u.username = :username")rn .setString("username", u.getUsername())rn .uniqueResult();rn s.getTransaction().commit();rn if(count > 0) return true;rn return false;rn rn rn rn public void add(User u) throws Exception rn SessionFactory sf = HibernateUtil.getSessionFactory();rn Session s = sf.getCurrentSession();rn s.beginTransaction();rn s.save(u);rn s.getTransaction().commit();rnrn rn rn rnrn------------------------------rnutil层rnpackage util;rnrnimport org.hibernate.SessionFactory;rnimport org.hibernate.cfg.AnnotationConfiguration;rnrnpublic class HibernateUtil rn private static SessionFactory sf;rn static rn sf = new AnnotationConfiguration().configure().buildSessionFactory();rn rn rn public static SessionFactory getSessionFactory() rn return sf;rn rnrn---------------------------------rnjunit 类rnpackage service;rnrnimport org.junit.Assert;rnrnimport model.User;rnrnimport org.junit.Test;rnrnpublic class UserManagerTest rnrn @Testrn public void testExists() throws Exception rn UserManager um = new UserManager();rn User u = new User();rn System.out.print("gfgf");rn u.setUsername("a");rn boolean exists = um.exists(u); rn System.out.print(exists);rn Assert.assertEquals(true, exists);rn rn rnrn @Testrn public void testAdd() throws Exception rn UserManager um = new UserManager();rn User u = new User();rn rn u.setUsername("b");rn rn boolean exists = um.exists(u); rn if(!exists)rn um.add(u);rn u.setUsername("b");rn Assert.assertEquals(true,um.exists(u));rn rn rn elsern Assert.fail("not added");rn rn rn rn rnrnrn------------------rn导入的包rnantlr-2.7.6.jarrncommons-collections-3.1.jarrndom4j-1.6.1.jarrnejb3-persistence.jarrnhibernate-annotations.jarrnhibernate-commons-annotations.jarrnhibernate3.jarrnjavassist-3.9.0.GA.jarrnjta-1.1.jarrnlog4j-1.2.15.jarrnmysql-connector-java-3.1.13-bin.jarrnslf4j-api-1.5.8.jarrnslf4j-log4j12-1.5.8.jarrnrnrnrn哪里有错!
junit的test 方法执行两次
junit
junit 为什么不能识别@Test
我的junit4 输入@T 按ALT + / 可以打出 @Test 但是就是现实是syntax error, 这是为什么? 我也导入了这个包 import org.junit.Test; 各位大神 能否解救一下初学的小弟啊?
Android的JUnit Test单元测试(调试)
写程序就必然会遇到调试的时候,没有人写程序是一次成功没有出错的,这里主要是教怎么进行Android调试的,相信大多数学Android的程序员(媛)刚开始学Android的时候调试主要是用Log.i(String tag,String s),这样最原始的在logcat里显示的来判断自己的程序运行情况,当然我一开始也是这样用,但是后来用多了就会发现这样很费时间,自己也弄的很累,所以在网上找找有没有什么
junit test 单元测试简单示例
package cn.ce.sale.order.biz.impl; import junit.framework.TestCase; import org.springframework.context.ApplicationContext; import org.springframework.context.support.ClassPathXmlApplicationC...
JUnit Test Files Maker v1.02
这个是最新的版本,更正了v1.01的一个bug。 JUnit Test Files Maker 是一款批量生成JUnit测试用例文件的软件. (注意:JDK 版本要求 5.0以上,当前版本不支持中文路径和带有空格的路径)
JUnit Test Files Maker v1.01
目前最新版本为v1.02 ,已经上传,请下载那个版本的文件(不需要资源分)。 下载地址:http://download.csdn.net/source/1698278
@Test无发导入Junit
个人遇到的问题:@Test 按 ctrl+1  还是无法导入 项目右键 -------> Build Path ------> Add  Library -------> 选中 Junit  ----------> 进入Junit Library 界面  选中版本  ----》确定 这是本人遇到的问题。。。
Spring Test结合JUnit的单元测试
配置依赖文件名:pom.xml(部分) <!-- Spring 单元测试,需要JUint --> <dependency> <groupId>org.springframework</groupId> <artifactId>spring-test</artifactId> <version>4.1.
Junit @Test注解无法使用
今天遇到一个奇葩的问题 一个测试类如下 package test; import org.junit.* public class Test{ @Test public void test(){ } } 就这样一个简单的测试类@Test注解没有被IDE识别 是灰色 检查 pom配置没有问题jar包也有; 后来发现是我的类名Test跟注解的名字@Test一样导致的 把类...
JUnit Test Cases are not being generated
目前使用parasoft公司的Jtest5做unit test,可是无法自动产生Test case,希望指点一下,TIA!!rnrn相关post:rnhttp://forums.parasoft.com/index.php?act=ST&f=43&t=104&s=455e03929cd0bb7e29b4804815994ddb
关于 JUnit 中@Test注解的问题
@Test(expected = ArithmeticException.class)rn如何同时指定多个异常类?
关于eclipse下junit出错问题
在jdk8的环境下进行junit的jar包导入后会发现Syntax error, annotations are only available if source level is 1.5 or great这个问题。只要把jdk8换成jdk7就能解决问题。
新建maven项目时问题
有的时候新建maven项目会发现只有src/main/resources目录,没有src/main/java目录和Libraries目录等。 这是因为要求你的jre版本要在1.6以上。所以你可以改变你的jre版本。 项目右键-Build Path-Configure Build Path 然后选择Libraries进行修改。如果你没有jdk1.6以上的版本,自行百度下载配置一下,这里不做
采用ant执行junit时出错
rn rn rn rn rnrn如果把 这段话注释掉就可以成功rnrn可能是什么原因?rnrn [junit] Tests run: 1, Failures: 0, Errors: 0, Time elapsed: 0.005 secrn[junitreport] Processing D:\Testing\springsource\junit4\build\test\report\TESTS-TestSuites.xml to D:\Testing\springsource\junit4\build\test\report\html\junit-noframes.htmlrn[junitreport] Loading stylesheet jar:file:/D:/Tools/apache-ant-1.8.4/lib/ant-junit.jar!/org/apache/tools/ant/taskdefs/optional/junit/xsl/junit-noframes.xslrn[junitreport] : Error! 非 static Java 函数 'replace' 的第一个参数不是有效的对象引用。rn[junitreport] : Error! 无法将数据类型 'void' 转换为 'reference'。rn[junitreport] : Fatal Error! 无法编译样式表rn[junitreport] Failed to process D:\Testing\springsource\junit4\build\test\report\TESTS-TestSuites.xml
maven项目编译跳过test命令
笔记:mvn clean install -DskipTests
应该不是很难的问题
使用IE浏览器rnrn在一个文本框中,value已经有值,rn要用javascript使其中的某段字符呈选中状态rn怎么实现?
Maven项目在eclipse中使用junit进行单元测试时报错:ClassNotFoundException
Maven项目在eclipse中使用junit进行单元测试时报错:ClassNotFoundException
解决SVN检出的maven项目不是maven项目
现象:检出的maven项目有pom.xml文件,但是项目图标上没有M的标记,并且最主要的是没有maven所属的jar包。 解决方法: 1.window-->show view-->navigator 2.打开项目下的.project文件,如果有没发生错误的项目可以对照看看缺了什么 3.一般是内缺少org.maven.ide.eclipse.maven2Nature,加上就OK了。
在maven项目中使用Junit的assertThat()方法时,is()方法的使用
1.要使用is()方法首先需要导入hamcrest-library-1.3.jar和hamcrest-core-1.3.jar两个jar包 依赖配置:     org.hamcrest     hamcrest-library     1.3     test     junit     junit     4.12     test i
Spring和Junit整合出错
今天在Spring4.3.9和Junit4.10整合出错 demo代码如下 package mo.project.transfer; import org.junit.Test; import org.junit.runner.RunWith; import org.springframework.beans.factory.annotation.Autowired; import org...
为什么是./test,而不是test?
在linux中,用gcc把一个test.c程序编译好了后,为什么执行时用./test,而不是直接test??
Junit| Junit为某个类添加Test类
Junit为某个类添加Test类后生成的Class文件和该包下的配置文件都会放在和源码编译后的bin目录下
maven项目install时忽略执行test的几种方法
1.在项目所在文件夹根目录使用maven命令打包时: <!-- 不执行单元测试,也不编译测试类 --> mvn install -Dmaven.test.skip=true 或 <!-- 不执行单元测试,但会编译测试类,并在target/test-classes目录下生成相应的class --> mvn install -DskipTests=true 2.spring...
相关热词 c#异步发送kafka c#窗体编号 c# 操作二进制文件 c# 反射 机制 c#线程 窗体失去响应 c#角度转弧度 c# 解析gps数据 c# vs设置 语法版本 c# json含回车 c#多线程demo