ionic添加插件时报错Unable to load PlatformApi 5C

图片说明
求解决!刚学ionic,网上也没有相关问题!

1个回答

很可能是网络或者环境的问题。你重新试试。

Csdn user default icon
上传中...
上传图片
插入图片
抄袭、复制答案,以达到刷声望分或其他目的的行为,在CSDN问答是严格禁止的,一经发现立刻封号。是时候展现真正的技术了!
其他相关推荐
ionic 使用ngcordova插件时报错
![图片说明](https://img-ask.csdn.net/upload/201603/16/1458110564_251990.png)
ionic 使用 ngx-qrcode2 生成二维码时报错
使用 ngx-qrcode2 生成二维码时报错 。module.ts 已经引入 NgxQRCodeModule。求助!!! ![图片说明](https://img-ask.csdn.net/upload/201911/26/1574735556_715890.png) ![图片说明](https://img-ask.csdn.net/upload/201911/26/1574735211_635767.png)
(求助!纠结了几天了)最近用ionic开发了一个App,然后想打包安卓版本,打包后无法访问我局域网iis的服务端
最近用ionic开发了一个App,然后想打包安卓版本,安装了jdk,sdk,用ionic,cordova打包后无法访问我局域网iis的服务端,打包一个debug版本出来了,但是Ionic cordova build android -release -prod 这个打包出来是debug版本,没有像网上说的release 未签名版,奇怪.. 然后我试用KM盒子打包,因为是纯页面打包,不涉及sdk,,只是h5,访问是没有问题的.但是代码里需要ionic调用摄像头功能,km盒子不符合要求,所以端口跟地址是没有问题, 网上也百度了很多办法 1、cordova plugin add cordova-plugin-whitelist(添加白名单插件) 2、ionic cordova plugin add cordova-plugin-advanced-http (添加http组件) 这两种也试过,不行,![图片说明](https://img-ask.csdn.net/upload/201912/27/1577408329_683346.png)
Huilder 可以打包ionic的项目吗
开发了一个ionic项目,然后想用huilder打包可以吗,怎么弄==
运行ionic cordova platform add android不成功
各位大神: 在运用Ionic 开发手机APP的过程中遇到困难,ionic安装的是最新的长期支持版的,cordova安装的也是最新版的,但在运行ionic start shop tabs后,再运行ionic cordova platform add android为项目增加Android平台支持不成功,命令行窗口出现如下: C:\Users\WangQitong\jdshop>ionic cordova platform add android C:\Users\WangQitong\jdshop>"node" "C:\Users\WangQitong\AppData\Roaming\npm\\node_modules\ionic\bin\ionic" cordova platform add android > cordova.cmd platform add android C:\Users\WangQitong\jdshop>"node" "C:\Users\WangQitong\AppData\Roaming\npm\\node_modules\cordova\bin\cordova" "platform" "add" "android" Using cordova-fetch for cordova-android@^8.0.0 Failed to fetch platform cordova-android@^8.0.0 Probably this is either a connection problem, or platform spec is incorrect. Check your connection and platform name/version/URL. Error: npm: Command failed with exit code 4294963238 Error output: npm WARN rm not removing C:\Users\WangQitong\jdshop\node_modules\.bin\webdriver-manager.cmd as it wasn't installed by C:\Users\WangQitong\jdshop\node_modules\webdriver-manager npm WARN rm not removing C:\Users\WangQitong\jdshop\node_modules\.bin\webdriver-manager as it wasn't installed by C:\Users\WangQitong\jdshop\node_modules\webdriver-manager npm WARN rm not removing C:\Users\WangQitong\jdshop\node_modules\.bin\webdriver-manager.cmd as it wasn't installed by C:\Users\WangQitong\jdshop\node_modules\_webdriver-manager@12.1.7@webdriver-manager npm WARN rm not removing C:\Users\WangQitong\jdshop\node_modules\.bin\webdriver-manager as it wasn't installed by C:\Users\WangQitong\jdshop\node_modules\_webdriver-manager@12.1.7@webdriver-manager npm WARN webpack-dev-middleware@3.7.2 requires a peer of webpack@^4.0.0 but none is installed. You must install peer dependencies yourself. npm WARN The package @angular/compiler is included as both a dev and production dependency. npm ERR! code ENOENT npm ERR! syscall rename npm ERR! path C:\Users\WangQitong\jdshop\node_modules\_brace-expansion@1.1.11@brace-expansion\node_modules\balanced-match npm ERR! dest C:\Users\WangQitong\jdshop\node_modules\_brace-expansion@1.1.11@brace-expansion\node_modules\balanced-match npm ERR! errno -4058 npm ERR! enoent ENOENT: no such file or directory, rename 'C:\Users\WangQitong\jdshop\node_modules\_brace-expansion@1.1.11@brace-expansion\node_modules\balanced-match' -> 'C:\Users\WangQitong\jdshop\node_modules\_brace-expansion@1.1.11@brace-expansion\node_modules\balanced-match' npm ERR! enoent This is related to npm not being able to find a file. npm ERR! enoent npm ERR! A complete log of this run can be found in: npm ERR! C:\Users\WangQitong\AppData\Roaming\npm-cache\_logs\2019-11-01T12_41_07_880Z-debug.log > ionic cordova resources android --force > cordova-res.cmd android [cordova-res] [cordova-res] C:\Users\WangQitong\jdshop>"node" "C:\Users\WangQitong\AppData\Roaming\npm\\node_modules\cordova-res\bin\cordova-res" "android" [cordova-res] Generated 18 resources for android [cordova-res] Wrote to config.xml 请问是什么原因呢?
ionic angular 页面报错 ctrl 未定义
用angular做移动客户端页面,route代码如下, ``` angular.module('swpApp.question', ['ionic']).config(['$stateProvider', function($stateProvider) { $stateProvider .state('questionList', { url: '/questionList', cache:'false', resolve: { loginInfo:["$q",appLogin.loginToken],//用户登录信息 spwItemListCacah:["$q",function($q){ return pageScroll.loadCacahData($q,"myQuestion"); }]//缓存信息 }, templateUrl: "app/question/view/questionList.html", controller: 'QuestionListCtrl' }) .state('questionDetail', { url: '/questionDetail/:question_id', cache:'false', resolve: { loginInfo:["$q",appLogin.loginToken] }, templateUrl: "app/question/view/questionDetail.html", controller: 'QuestionDetailCtrl' }) }]); ``` 在主页面跳往子页面时 报错: ``` Error: [ng:areq] Argument 'QuestionDetailCtrl' is not a function, got undefined http://errors.angularjs.org/1.4.3/ng/areq?p0=QuestionDetailCtrl&p1=not%20a%20function%2C%20got%20undefined at ionic.bundle.js:8900 at assertArg (ionic.bundle.js:10602) at assertArgFn (ionic.bundle.js:10612) at ionic.bundle.js:17807 at self.appendViewElement (ionic.bundle.js:52338) at Object.switcher.render (ionic.bundle.js:50456) at Object.switcher.init (ionic.bundle.js:50376) at self.render (ionic.bundle.js:52198) at self.register (ionic.bundle.js:52156) at updateView (ionic.bundle.js:57577) ``` 各位大侠 知道是为什么么,是我QuestionDetailCtrl定义有问题么,仿照QuestionListCtrl定义的啊,QuestionListCtrl就么有问题。我是 新手,在线急等,帮帮忙 c币不多 了 ,不好意思
ionic 项目 ionic build android -release 打包时报错
![图片说明](https://img-ask.csdn.net/upload/201608/02/1470132176_561093.png)
ssm后台找不到url的handler?
本人用ionic3+ssm框架开发一款app,ionic端用http请求后台数据,结果出现以下情况 ![图片说明](https://img-ask.csdn.net/upload/201912/30/1577706020_984304.png) ionic端的请求路径如下: path: string = '/api/login';其中api是为了解决跨域配置的代理 本人配置文件如下: ## 1.applicationContext-dao.xml ``` <beans xmlns="http://www.springframework.org/schema/beans" xmlns:xsi="http://www.w3.org/2001/XMLSchema-instance" xmlns:mvc="http://www.springframework.org/schema/mvc" xmlns:context="http://www.springframework.org/schema/context" xmlns:aop="http://www.springframework.org/schema/aop" xmlns:tx="http://www.springframework.org/schema/tx" xsi:schemaLocation="http://www.springframework.org/schema/beans http://www.springframework.org/schema/beans/spring-beans-3.2.xsd http://www.springframework.org/schema/mvc http://www.springframework.org/schema/mvc/spring-mvc-3.2.xsd http://www.springframework.org/schema/context http://www.springframework.org/schema/context/spring-context-3.2.xsd http://www.springframework.org/schema/aop http://www.springframework.org/schema/aop/spring-aop-3.2.xsd http://www.springframework.org/schema/tx http://www.springframework.org/schema/tx/spring-tx-3.2.xsd "> <!-- 加载db.properties文件中的内容,db.properties文件中key命名要有一定的特殊规则 --> <context:property-placeholder location="classpath:db.properties" /> <!-- 配置数据源 ,dbcp --> <bean id="dataSource" class="org.apache.commons.dbcp.BasicDataSource" destroy-method="close"> <property name="driverClassName" value="${jdbc.driver}" /> <property name="url" value="${jdbc.url}" /> <property name="username" value="${jdbc.username}" /> <property name="password" value="${jdbc.password}" /> <property name="maxActive" value="30" /> <property name="maxIdle" value="5" /> </bean> <bean id="sqlSessionFactory" class="org.mybatis.spring.SqlSessionFactoryBean"> <property name="dataSource" ref="dataSource" /> <property name="configLocation" value="classpath:mybatis/sqlMapConfig.xml" /> </bean> <bean class="org.mybatis.spring.mapper.MapperScannerConfigurer"> <property name="basePackage" value="com.lqm.home.mapper"></property> <property name="sqlSessionFactoryBeanName" value="sqlSessionFactory" /> </bean> </beans> ``` ## 2.applicationContext-transaction.xml ``` <beans xmlns="http://www.springframework.org/schema/beans" xmlns:xsi="http://www.w3.org/2001/XMLSchema-instance" xmlns:mvc="http://www.springframework.org/schema/mvc" xmlns:context="http://www.springframework.org/schema/context" xmlns:aop="http://www.springframework.org/schema/aop" xmlns:tx="http://www.springframework.org/schema/tx" xsi:schemaLocation="http://www.springframework.org/schema/beans http://www.springframework.org/schema/beans/spring-beans-3.2.xsd http://www.springframework.org/schema/mvc http://www.springframework.org/schema/mvc/spring-mvc-3.2.xsd http://www.springframework.org/schema/context http://www.springframework.org/schema/context/spring-context-3.2.xsd http://www.springframework.org/schema/aop http://www.springframework.org/schema/aop/spring-aop-3.2.xsd http://www.springframework.org/schema/tx http://www.springframework.org/schema/tx/spring-tx-3.2.xsd"> <bean id="transactionManager" class="org.springframework.jdbc.datasource.DataSourceTransactionManager"> <property name="dataSource" ref="dataSource"/> </bean> <tx:advice id="txAdvice" transaction-manager="transactionManager"> <tx:attributes> <!-- 传播行为 --> <tx:method name="save*" propagation="REQUIRED"/> <tx:method name="delete*" propagation="REQUIRED"/> <tx:method name="insert*" propagation="REQUIRED"/> <tx:method name="update*" propagation="REQUIRED"/> <tx:method name="find*" propagation="SUPPORTS" read-only="true"/> <tx:method name="get*" propagation="SUPPORTS" read-only="true"/> <tx:method name="select*" propagation="SUPPORTS" read-only="true"/> </tx:attributes> </tx:advice> <!-- aop --> <aop:config> <aop:advisor advice-ref="txAdvice" pointcut="execution(* com.lqm.home.service.impl.*.*(..))"/> </aop:config> </beans> ``` ## 3.springmvc.xml ``` <beans xmlns="http://www.springframework.org/schema/beans" xmlns:xsi="http://www.w3.org/2001/XMLSchema-instance" xmlns:mvc="http://www.springframework.org/schema/mvc" xmlns:context="http://www.springframework.org/schema/context" xmlns:aop="http://www.springframework.org/schema/aop" xmlns:tx="http://www.springframework.org/schema/tx" xsi:schemaLocation="http://www.springframework.org/schema/beans http://www.springframework.org/schema/beans/spring-beans-3.2.xsd http://www.springframework.org/schema/mvc http://www.springframework.org/schema/mvc/spring-mvc-3.2.xsd http://www.springframework.org/schema/context http://www.springframework.org/schema/context/spring-context-3.2.xsd http://www.springframework.org/schema/aop http://www.springframework.org/schema/aop/spring-aop-3.2.xsd http://www.springframework.o rg/schema/tx http://www.springframework.org/schema/tx/spring-tx-3.2.xsd"> <mvc:annotation-driven></mvc:annotation-driven> <context:component-scan base-package="com.lqm.home.controller" use-default-filters="true"> <context:exclude-filter type="annotation" expression="org.springframework.stereotype.Controller"/> </context:component-scan> <!-- <context:component-scan base-package="com.lqm.home.controller"/> --> <context:component-scan base-package="com.lqm.home.service"/> <mvc:resources mapping="/**" location="/"/> <mvc:resources location="/js/" mapping="/js/**" /> <mvc:resources location="/img/" mapping="/img/**" /> <mvc:resources location="/css/" mapping="/css/**" /> <mvc:resources location="/html/" mapping="/html/**" /> <mvc:resources location="/upload/" mapping="/upload/**" /> <bean class="org.springframework.web.servlet.mvc.method.annotation.RequestMappingHandlerMapping"/> <bean class="org.springframework.web.servlet.mvc.method.annotation.RequestMappingHandlerAdapter"/> <bean class="org.springframework.web.servlet.view.InternalResourceViewResolver"> <property name="prefix" value="/WEB-INF/jsp/" /> <property name="suffix" value=".jsp" /> </bean> </beans> ``` ## 4.ehcache.xml ``` <ehcache xmlns:xsi="http://www.w3.org/2001/XMLSchema-instance" xsi:noNamespaceSchemaLocation="../config/ehcache.xsd"> <diskStore path="F:\develop\ehcache" /> <defaultCache maxElementsInMemory="1000" maxElementsOnDisk="10000000" eternal="false" overflowToDisk="false" timeToIdleSeconds="120" timeToLiveSeconds="120" diskExpiryThreadIntervalSeconds="120" memoryStoreEvictionPolicy="LRU"> </defaultCache> </ehcache> ``` ## 5.web.xml ``` <?xml version="1.0" encoding="UTF-8"?> <web-app xmlns:xsi="http://www.w3.org/2001/XMLSchema-instance" xmlns="http://java.sun.com/xml/ns/javaee" xsi:schemaLocation="http://java.sun.com/xml/ns/javaee http://java.sun.com/xml/ns/javaee/web-app_2_5.xsd" id="WebApp_ID" version="2.5"> <display-name>HomeServerDemo</display-name> <context-param> <param-name>contextConfigLocation</param-name> <param-value>/WEB-INF/classes/spring/applicationContext-*.xml</param-value> </context-param> <listener> <listener-class>org.springframework.web.context.ContextLoaderListener</listener-class> </listener> <filter> <filter-name>CharacterEncodingFilter</filter-name> <filter-class>org.springframework.web.filter.CharacterEncodingFilter</filter-class> <init-param> <param-name>encoding</param-name> <param-value>utf-8</param-value> </init-param> </filter> <filter-mapping> <filter-name>CharacterEncodingFilter</filter-name> <url-pattern>/*</url-pattern> </filter-mapping> <servlet> <servlet-name>springmvc</servlet-name> <servlet-class>org.springframework.web.servlet.DispatcherServlet</servlet-class> <init-param> <param-name>contextConfigLocation</param-name> <param-value>classpath:spring/springmvc.xml</param-value> </init-param> </servlet> <servlet-mapping> <servlet-name>springmvc</servlet-name> <url-pattern>/</url-pattern> </servlet-mapping> <welcome-file-list> <welcome-file>index.html</welcome-file> <welcome-file>index.htm</welcome-file> <welcome-file>index.jsp</welcome-file> <welcome-file>default.html</welcome-file> <welcome-file>default.htm</welcome-file> <welcome-file>default.jsp</welcome-file> </welcome-file-list> </web-app> ``` 本人在网上找了两天关于这一类的信息,但是却依旧没有解决问题,所以请各位帮忙看一下
webstorm中ionic项目启动报错
**报错信息** ``` > cordova run android --emulator Failed to run "javac -version", make sure that you have a JDK version 8 installed. You can get it from the following location: https://www.oracle.com/technetwork/java/javase/downloads/jdk8-downloads-2133151.html Your JAVA_HOME is invalid: D:Java\jdk1.8.0_181 ``` **项目的目录结构** ![项目目录结构](https://img-ask.csdn.net/upload/201905/15/1557904992_563094.jpg) **环境变量** ![图片说明](https://img-ask.csdn.net/upload/201905/15/1557905144_907322.jpg)![图片说明](https://img-ask.csdn.net/upload/201905/15/1557905154_437227.jpg)
ionic3打包出错,求大佬帮忙!!
今天打包的时候cordova build android就出现下面这个错误,以前都没有问题的,请问是哪的问题?该如何解决了,求具体如何操作。。。 C:\Users\Administrator\.gradle\caches\transforms-1\files-1.1\appcompat-v7-26.1.0.aar\ac54a0ace3996090bdb7ad492e3b5bcd\res\values\values.xml:246:5-69: AAPT: error: resource android:attr/fontVariationSettings not found. C:\Users\Administrator\.gradle\caches\transforms-1\files-1.1\appcompat-v7-26.1.0.aar\ac54a0ace3996090bdb7ad492e3b5bcd\res\values\values.xml:246:5-69: AAPT: error: resource android:attr/ttcIndex not found. D:\Code\YSDA\ysda\platforms\android\app\build\intermediates\incremental\mergeDebugResources\merged.dir\values\values.xml:248: error: resource android:attr/fontVariationSettings not found. D:\Code\YSDA\ysda\platforms\android\app\build\intermediates\incremental\mergeDebugResources\merged.dir\values\values.xml:248: error: resource android:attr/ttcIndex not found. error: failed linking references. =============== 全部的: PS D:\code\ysda\ysda> cordova build android cordova-android-support-gradle-release: Android platform: V7+ cordova-android-support-gradle-release: Wrote custom version '26.+' to D:\code\ysda\ysda\platforms\android\app\build.gra dle cordova-android-support-gradle-release: Wrote custom version '26.+' to D:\code\ysda\ysda\platforms\android\cordova-andro id-support-gradle-release\zxh-cordova-android-support-gradle-release.gradle Android Studio project detected cordova-android-support-gradle-release: Android platform: V7+ cordova-android-support-gradle-release: Wrote custom version '26.+' to D:\code\ysda\ysda\platforms\android\app\build.gra dle cordova-android-support-gradle-release: Wrote custom version '26.+' to D:\code\ysda\ysda\platforms\android\cordova-andro id-support-gradle-release\zxh-cordova-android-support-gradle-release.gradle ANDROID_HOME=C:\Users\Administrator\AppData\Local\Android\sdk JAVA_HOME=E:\Java\jdk1.8.0_91 studio Starting a Gradle Daemon (subsequent builds will be faster) BUILD SUCCESSFUL in 5s 1 actionable task: 1 executed Subproject Path: CordovaLib Subproject Path: app publishNonDefault is deprecated and has no effect anymore. All variants are now published. +----------------------------------------------------------------- | cordova-android-support-gradle-release: 26.+ +----------------------------------------------------------------- Configuration 'compile' in project ':app' is deprecated. Use 'implementation' instead. The Task.leftShift(Closure) method has been deprecated and is scheduled to be removed in Gradle 5.0. Please use Task.doL ast(Action) instead. at build_dxxuwns2wpt3q41rnhqfnnu3n.run(D:\Code\YSDA\ysda\platforms\android\app\build.gradle:152) :CordovaLib:preBuild UP-TO-DATE :CordovaLib:preDebugBuild UP-TO-DATE :CordovaLib:compileDebugAidl :CordovaLib:compileDebugRenderscript :CordovaLib:checkDebugManifest :CordovaLib:generateDebugBuildConfig :CordovaLib:prepareLintJar :CordovaLib:generateDebugResValues :CordovaLib:generateDebugResources :CordovaLib:packageDebugResources :CordovaLib:platformAttrExtractor :CordovaLib:processDebugManifest :CordovaLib:javaPreCompileDebug :CordovaLib:processDebugJavaRes NO-SOURCE :app:preBuild UP-TO-DATE :app:preDebugBuild :app:compileDebugAidl :CordovaLib:packageDebugRenderscript NO-SOURCE :app:compileDebugRenderscript :app:checkDebugManifest :app:generateDebugBuildConfig :app:prepareLintJar :app:generateDebugResValues :app:generateDebugResources :app:mergeDebugResources :app:createDebugCompatibleScreenManifests :app:processDebugManifest :app:splitsDiscoveryTaskDebug :app:compileDebugNdk NO-SOURCE :CordovaLib:mergeDebugShaders :CordovaLib:compileDebugShaders :CordovaLib:generateDebugAssets :CordovaLib:mergeDebugAssets :app:mergeDebugShaders :app:compileDebugShaders :app:generateDebugAssets :app:mergeDebugAssets :CordovaLib:compileDebugNdk NO-SOURCE :CordovaLib:mergeDebugJniLibFolders :CordovaLib:transformNativeLibsWithMergeJniLibsForDebug :CordovaLib:transformNativeLibsWithIntermediateJniLibsForDebug :app:mergeDebugJniLibFolders :app:processDebugJavaRes NO-SOURCE :app:validateSigningDebug :CordovaLib:processDebugResources :CordovaLib:generateDebugSources :CordovaLib:compileDebugJavaWithJavacע: ijЩ�����ļ�ʹ�û�����ѹ�ʱ�� API�� ע: �й���ϸ��Ϣ, ��ʹ�� -Xlint:deprecation ���±��롣 :CordovaLib:transformClassesAndResourcesWithPrepareIntermediateJarsForDebug :app:processDebugResourcesC:\Users\Administrator\.gradle\caches\transforms-1\files-1.1\appcompat-v7-26.1.0.aar\ac54a0ace 3996090bdb7ad492e3b5bcd\res\values\values.xml:246:5-69: AAPT: error: resource android:attr/fontVariationSettings not fou nd. C:\Users\Administrator\.gradle\caches\transforms-1\files-1.1\appcompat-v7-26.1.0.aar\ac54a0ace3996090bdb7ad492e3b5bcd\re s\values\values.xml:246:5-69: AAPT: error: resource android:attr/ttcIndex not found. D:\Code\YSDA\ysda\platforms\android\app\build\intermediates\incremental\mergeDebugResources\merged.dir\values\values.xml :248: error: resource android:attr/fontVariationSettings not found. D:\Code\YSDA\ysda\platforms\android\app\build\intermediates\incremental\mergeDebugResources\merged.dir\values\values.xml :248: error: resource android:attr/ttcIndex not found. error: failed linking references. Failed to execute aapt com.android.ide.common.process.ProcessException: Failed to execute aapt at com.android.builder.core.AndroidBuilder.processResources(AndroidBuilder.java:796) at com.android.build.gradle.tasks.ProcessAndroidResources.invokeAaptForSplit(ProcessAndroidResources.java:551) at com.android.build.gradle.tasks.ProcessAndroidResources.doFullTaskAction(ProcessAndroidResources.java:285) at com.android.build.gradle.internal.tasks.IncrementalTask.taskAction(IncrementalTask.java:109) at sun.reflect.GeneratedMethodAccessor182.invoke(Unknown Source) at sun.reflect.DelegatingMethodAccessorImpl.invoke(DelegatingMethodAccessorImpl.java:43) at java.lang.reflect.Method.invoke(Method.java:498) at org.gradle.internal.reflect.JavaMethod.invoke(JavaMethod.java:73) at org.gradle.api.internal.project.taskfactory.DefaultTaskClassInfoStore$IncrementalTaskAction.doExecute(Default TaskClassInfoStore.java:173) at org.gradle.api.internal.project.taskfactory.DefaultTaskClassInfoStore$StandardTaskAction.execute(DefaultTaskC lassInfoStore.java:134) at org.gradle.api.internal.project.taskfactory.DefaultTaskClassInfoStore$StandardTaskAction.execute(DefaultTaskC lassInfoStore.java:121) at org.gradle.api.internal.tasks.execution.ExecuteActionsTaskExecuter$1.run(ExecuteActionsTaskExecuter.java:122) at org.gradle.internal.progress.DefaultBuildOperationExecutor$RunnableBuildOperationWorker.execute(DefaultBuildO perationExecutor.java:336) at org.gradle.internal.progress.DefaultBuildOperationExecutor$RunnableBuildOperationWorker.execute(DefaultBuildO perationExecutor.java:328) at org.gradle.internal.progress.DefaultBuildOperationExecutor.execute(DefaultBuildOperationExecutor.java:197) at org.gradle.internal.progress.DefaultBuildOperationExecutor.run(DefaultBuildOperationExecutor.java:107) at org.gradle.api.internal.tasks.execution.ExecuteActionsTaskExecuter.executeAction(ExecuteActionsTaskExecuter.j ava:111) at org.gradle.api.internal.tasks.execution.ExecuteActionsTaskExecuter.executeActions(ExecuteActionsTaskExecuter. java:92) at org.gradle.api.internal.tasks.execution.ExecuteActionsTaskExecuter.execute(ExecuteActionsTaskExecuter.java:70 ) at org.gradle.api.internal.tasks.execution.SkipUpToDateTaskExecuter.execute(SkipUpToDateTaskExecuter.java:63) at org.gradle.api.internal.tasks.execution.ResolveTaskOutputCachingStateExecuter.execute(ResolveTaskOutputCachin gStateExecuter.java:54) at org.gradle.api.internal.tasks.execution.ValidatingTaskExecuter.execute(ValidatingTaskExecuter.java:58) at org.gradle.api.internal.tasks.execution.SkipEmptySourceFilesTaskExecuter.execute(SkipEmptySourceFilesTaskExec uter.java:88) at org.gradle.api.internal.tasks.execution.ResolveTaskArtifactStateTaskExecuter.execute(ResolveTaskArtifactState TaskExecuter.java:52) at org.gradle.api.internal.tasks.execution.SkipTaskWithNoActionsExecuter.execute(SkipTaskWithNoActionsExecuter.j ava:52) at org.gradle.api.internal.tasks.execution.SkipOnlyIfTaskExecuter.execute(SkipOnlyIfTaskExecuter.java:54) at org.gradle.api.internal.tasks.execution.ExecuteAtMostOnceTaskExecuter.execute(ExecuteAtMostOnceTaskExecuter.j ava:43) at org.gradle.api.internal.tasks.execution.CatchExceptionTaskExecuter.execute(CatchExceptionTaskExecuter.java:34 ) at org.gradle.execution.taskgraph.DefaultTaskGraphExecuter$EventFiringTaskWorker$1.run(DefaultTaskGraphExecuter. java:248) at org.gradle.internal.progress.DefaultBuildOperationExecutor$RunnableBuildOperationWorker.execute(DefaultBuildO perationExecutor.java:336) at org.gradle.internal.progress.DefaultBuildOperationExecutor$RunnableBuildOperationWorker.execute(DefaultBuildO perationExecutor.java:328) at org.gradle.internal.progress.DefaultBuildOperationExecutor.execute(DefaultBuildOperationExecutor.java:197) at org.gradle.internal.progress.DefaultBuildOperationExecutor.run(DefaultBuildOperationExecutor.java:107) at org.gradle.execution.taskgraph.DefaultTaskGraphExecuter$EventFiringTaskWorker.execute(DefaultTaskGraphExecute r.java:241) at org.gradle.execution.taskgraph.DefaultTaskGraphExecuter$EventFiringTaskWorker.execute(DefaultTaskGraphExecute r.java:230) at org.gradle.execution.taskgraph.DefaultTaskPlanExecutor$TaskExecutorWorker.processTask(DefaultTaskPlanExecutor .java:124) at org.gradle.execution.taskgraph.DefaultTaskPlanExecutor$TaskExecutorWorker.access$200(DefaultTaskPlanExecutor. java:80) at org.gradle.execution.taskgraph.DefaultTaskPlanExecutor$TaskExecutorWorker$1.execute(DefaultTaskPlanExecutor.j ava:105) at org.gradle.execution.taskgraph.DefaultTaskPlanExecutor$TaskExecutorWorker$1.execute(DefaultTaskPlanExecutor.j ava:99) at org.gradle.execution.taskgraph.DefaultTaskExecutionPlan.execute(DefaultTaskExecutionPlan.java:625) at org.gradle.execution.taskgraph.DefaultTaskExecutionPlan.executeWithTask(DefaultTaskExecutionPlan.java:580) at org.gradle.execution.taskgraph.DefaultTaskPlanExecutor$TaskExecutorWorker.run(DefaultTaskPlanExecutor.java:99 ) at org.gradle.execution.taskgraph.DefaultTaskPlanExecutor.process(DefaultTaskPlanExecutor.java:60) at org.gradle.execution.taskgraph.DefaultTaskGraphExecuter.execute(DefaultTaskGraphExecuter.java:128) at org.gradle.execution.SelectedTaskExecutionAction.execute(SelectedTaskExecutionAction.java:37) at org.gradle.execution.DefaultBuildExecuter.execute(DefaultBuildExecuter.java:37) at org.gradle.execution.DefaultBuildExecuter.access$000(DefaultBuildExecuter.java:23) at org.gradle.execution.DefaultBuildExecuter$1.proceed(DefaultBuildExecuter.java:43) at org.gradle.execution.DryRunBuildExecutionAction.execute(DryRunBuildExecutionAction.java:46) at org.gradle.execution.DefaultBuildExecuter.execute(DefaultBuildExecuter.java:37) at org.gradle.execution.DefaultBuildExecuter.execute(DefaultBuildExecuter.java:30) at org.gradle.initialization.DefaultGradleLauncher$ExecuteTasks.run(DefaultGradleLauncher.java:311) at org.gradle.internal.progress.DefaultBuildOperationExecutor$RunnableBuildOperationWorker.execute(DefaultBuildO perationExecutor.java:336) at org.gradle.internal.progress.DefaultBuildOperationExecutor$RunnableBuildOperationWorker.execute(DefaultBuildO perationExecutor.java:328) at org.gradle.internal.progress.DefaultBuildOperationExecutor.execute(DefaultBuildOperationExecutor.java:197) at org.gradle.internal.progress.DefaultBuildOperationExecutor.run(DefaultBuildOperationExecutor.java:107) at org.gradle.initialization.DefaultGradleLauncher.runTasks(DefaultGradleLauncher.java:202) at org.gradle.initialization.DefaultGradleLauncher.doBuildStages(DefaultGradleLauncher.java:132) at org.gradle.initialization.DefaultGradleLauncher.executeTasks(DefaultGradleLauncher.java:107) at org.gradle.internal.invocation.GradleBuildController$1.call(GradleBuildController.java:78) at org.gradle.internal.invocation.GradleBuildController$1.call(GradleBuildController.java:75) at org.gradle.internal.work.DefaultWorkerLeaseService.withLocks(DefaultWorkerLeaseService.java:152) at org.gradle.internal.invocation.GradleBuildController.doBuild(GradleBuildController.java:100) at org.gradle.internal.invocation.GradleBuildController.run(GradleBuildController.java:75) at org.gradle.tooling.internal.provider.ExecuteBuildActionRunner.run(ExecuteBuildActionRunner.java:28) at org.gradle.launcher.exec.ChainingBuildActionRunner.run(ChainingBuildActionRunner.java:35) at org.gradle.tooling.internal.provider.ValidatingBuildActionRunner.run(ValidatingBuildActionRunner.java:32) at org.gradle.launcher.exec.RunAsBuildOperationBuildActionRunner$1.run(RunAsBuildOperationBuildActionRunner.java :43) at org.gradle.internal.progress.DefaultBuildOperationExecutor$RunnableBuildOperationWorker.execute(DefaultBuildO perationExecutor.java:336) at org.gradle.internal.progress.DefaultBuildOperationExecutor$RunnableBuildOperationWorker.execute(DefaultBuildO perationExecutor.java:328) at org.gradle.internal.progress.DefaultBuildOperationExecutor.execute(DefaultBuildOperationExecutor.java:197) at org.gradle.internal.progress.DefaultBuildOperationExecutor.run(DefaultBuildOperationExecutor.java:107) at org.gradle.launcher.exec.RunAsBuildOperationBuildActionRunner.run(RunAsBuildOperationBuildActionRunner.java:4 0) at org.gradle.tooling.internal.provider.SubscribableBuildActionRunner.run(SubscribableBuildActionRunner.java:51) at org.gradle.launcher.exec.InProcessBuildActionExecuter.execute(InProcessBuildActionExecuter.java:45) at org.gradle.launcher.exec.InProcessBuildActionExecuter.execute(InProcessBuildActionExecuter.java:29) at org.gradle.launcher.exec.BuildTreeScopeBuildActionExecuter.execute(BuildTreeScopeBuildActionExecuter.java:39) at org.gradle.launcher.exec.BuildTreeScopeBuildActionExecuter.execute(BuildTreeScopeBuildActionExecuter.java:25) at org.gradle.tooling.internal.provider.ContinuousBuildActionExecuter.execute(ContinuousBuildActionExecuter.java :71) at org.gradle.tooling.internal.provider.ContinuousBuildActionExecuter.execute(ContinuousBuildActionExecuter.java :45) at org.gradle.tooling.internal.provider.ServicesSetupBuildActionExecuter.execute(ServicesSetupBuildActionExecute r.java:51) at org.gradle.tooling.internal.provider.ServicesSetupBuildActionExecuter.execute(ServicesSetupBuildActionExecute r.java:32) at org.gradle.tooling.internal.provider.GradleThreadBuildActionExecuter.execute(GradleThreadBuildActionExecuter. java:36) at org.gradle.tooling.internal.provider.GradleThreadBuildActionExecuter.execute(GradleThreadBuildActionExecuter. java:25) at org.gradle.tooling.internal.provider.ParallelismConfigurationBuildActionExecuter.execute(ParallelismConfigura tionBuildActionExecuter.java:43) at org.gradle.tooling.internal.provider.ParallelismConfigurationBuildActionExecuter.execute(ParallelismConfigura tionBuildActionExecuter.java:29) at org.gradle.tooling.internal.provider.StartParamsValidatingActionExecuter.execute(StartParamsValidatingActionE xecuter.java:64) at org.gradle.tooling.internal.provider.StartParamsValidatingActionExecuter.execute(StartParamsValidatingActionE xecuter.java:29) at org.gradle.tooling.internal.provider.SessionFailureReportingActionExecuter.execute(SessionFailureReportingAct ionExecuter.java:55) at org.gradle.tooling.internal.provider.SessionFailureReportingActionExecuter.execute(SessionFailureReportingAct ionExecuter.java:42) at org.gradle.tooling.internal.provider.SetupLoggingActionExecuter.execute(SetupLoggingActionExecuter.java:58) at org.gradle.tooling.internal.provider.SetupLoggingActionExecuter.execute(SetupLoggingActionExecuter.java:33) at org.gradle.launcher.daemon.server.exec.ExecuteBuild.doBuild(ExecuteBuild.java:67) at org.gradle.launcher.daemon.server.exec.BuildCommandOnly.execute(BuildCommandOnly.java:36) at org.gradle.launcher.daemon.server.api.DaemonCommandExecution.proceed(DaemonCommandExecution.java:120) at org.gradle.launcher.daemon.server.exec.WatchForDisconnection.execute(WatchForDisconnection.java:37) at org.gradle.launcher.daemon.server.api.DaemonCommandExecution.proceed(DaemonCommandExecution.java:120) at org.gradle.launcher.daemon.server.exec.ResetDeprecationLogger.execute(ResetDeprecationLogger.java:26) at org.gradle.launcher.daemon.server.api.DaemonCommandExecution.proceed(DaemonCommandExecution.java:120) at org.gradle.launcher.daemon.server.exec.RequestStopIfSingleUsedDaemon.execute(RequestStopIfSingleUsedDaemon.ja va:34) at org.gradle.launcher.daemon.server.api.DaemonCommandExecution.proceed(DaemonCommandExecution.java:120) at org.gradle.launcher.daemon.server.exec.ForwardClientInput$2.call(ForwardClientInput.java:74) at org.gradle.launcher.daemon.server.exec.ForwardClientInput$2.call(ForwardClientInput.java:72) at org.gradle.util.Swapper.swap(Swapper.java:38) at org.gradle.launcher.daemon.server.exec.ForwardClientInput.execute(ForwardClientInput.java:72) at org.gradle.launcher.daemon.server.api.DaemonCommandExecution.proceed(DaemonCommandExecution.java:120) at org.gradle.launcher.daemon.server.exec.LogAndCheckHealth.execute(LogAndCheckHealth.java:55) at org.gradle.launcher.daemon.server.api.DaemonCommandExecution.proceed(DaemonCommandExecution.java:120) at org.gradle.launcher.daemon.server.exec.LogToClient.doBuild(LogToClient.java:62) at org.gradle.launcher.daemon.server.exec.BuildCommandOnly.execute(BuildCommandOnly.java:36) at org.gradle.launcher.daemon.server.api.DaemonCommandExecution.proceed(DaemonCommandExecution.java:120) at org.gradle.launcher.daemon.server.exec.EstablishBuildEnvironment.doBuild(EstablishBuildEnvironment.java:82) at org.gradle.launcher.daemon.server.exec.BuildCommandOnly.execute(BuildCommandOnly.java:36) at org.gradle.launcher.daemon.server.api.DaemonCommandExecution.proceed(DaemonCommandExecution.java:120) at org.gradle.launcher.daemon.server.exec.StartBuildOrRespondWithBusy$1.run(StartBuildOrRespondWithBusy.java:50) at org.gradle.launcher.daemon.server.DaemonStateCoordinator$1.run(DaemonStateCoordinator.java:297) at org.gradle.internal.concurrent.ExecutorPolicy$CatchAndRecordFailures.onExecute(ExecutorPolicy.java:63) at org.gradle.internal.concurrent.ManagedExecutorImpl$1.run(ManagedExecutorImpl.java:46) at java.util.concurrent.ThreadPoolExecutor.runWorker(ThreadPoolExecutor.java:1142) at java.util.concurrent.ThreadPoolExecutor$Worker.run(ThreadPoolExecutor.java:617) at org.gradle.internal.concurrent.ThreadFactoryImpl$ManagedThreadRunnable.run(ThreadFactoryImpl.java:55) at java.lang.Thread.run(Thread.java:745) Caused by: java.util.concurrent.ExecutionException: java.util.concurrent.ExecutionException: com.android.tools.aapt2.Aap t2Exception: AAPT2 error: check logs for details at com.google.common.util.concurrent.AbstractFuture.getDoneValue(AbstractFuture.java:503) at com.google.common.util.concurrent.AbstractFuture.get(AbstractFuture.java:482) at com.google.common.util.concurrent.AbstractFuture$TrustedFuture.get(AbstractFuture.java:79) at com.android.builder.core.AndroidBuilder.processResources(AndroidBuilder.java:794) ... 121 more Caused by: java.util.concurrent.ExecutionException: com.android.tools.aapt2.Aapt2Exception: AAPT2 error: check logs for details at com.google.common.util.concurrent.AbstractFuture.getDoneValue(AbstractFuture.java:503) at com.google.common.util.concurrent.AbstractFuture.get(AbstractFuture.java:462) at com.google.common.util.concurrent.AbstractFuture$TrustedFuture.get(AbstractFuture.java:79) at com.android.builder.internal.aapt.v2.QueueableAapt2.lambda$makeValidatedPackage$1(QueueableAapt2.java:179) at java.util.concurrent.ThreadPoolExecutor.runWorker(ThreadPoolExecutor.java:1142) at java.util.concurrent.ThreadPoolExecutor$Worker.run(ThreadPoolExecutor.java:617) ... 1 more Caused by: com.android.tools.aapt2.Aapt2Exception: AAPT2 error: check logs for details at com.android.builder.png.AaptProcess$NotifierProcessOutput.handleOutput(AaptProcess.java:463) at com.android.builder.png.AaptProcess$NotifierProcessOutput.err(AaptProcess.java:415) at com.android.builder.png.AaptProcess$ProcessOutputFacade.err(AaptProcess.java:332) at com.android.utils.GrabProcessOutput$1.run(GrabProcessOutput.java:104) FAILED 36 actionable tasks: 36 executed FAILURE: Build failed with an exception. * What went wrong: Execution failed for task ':app:processDebugResources'. > Failed to execute aapt * Try: Run with --stacktrace option to get the stack trace. Run with --info or --debug option to get more log output. * Get more help at https://help.gradle.org BUILD FAILED in 31s cmd: Command failed with exit code 1 Error output: ע: ijЩ�����ļ�ʹ�û�����ѹ�ʱ�� API�� ע: �й���ϸ��Ϣ, ��ʹ�� -Xlint:deprecation ���±��롣 C:\Users\Administrator\.gradle\caches\transforms-1\files-1.1\appcompat-v7-26.1.0.aar\ac54a0ace3996090bdb7ad492e3b5bcd\re s\values\values.xml:246:5-69: AAPT: error: resource android:attr/fontVariationSettings not found. C:\Users\Administrator\.gradle\caches\transforms-1\files-1.1\appcompat-v7-26.1.0.aar\ac54a0ace3996090bdb7ad492e3b5bcd\re s\values\values.xml:246:5-69: AAPT: error: resource android:attr/ttcIndex not found. D:\Code\YSDA\ysda\platforms\android\app\build\intermediates\incremental\mergeDebugResources\merged.dir\values\values.xml :248: error: resource android:attr/fontVariationSettings not found. D:\Code\YSDA\ysda\platforms\android\app\build\intermediates\incremental\mergeDebugResources\merged.dir\values\values.xml :248: error: resource android:attr/ttcIndex not found. error: failed linking references. Failed to execute aapt com.android.ide.common.process.ProcessException: Failed to execute aapt at com.android.builder.core.AndroidBuilder.processResources(AndroidBuilder.java:796) at com.android.build.gradle.tasks.ProcessAndroidResources.invokeAaptForSplit(ProcessAndroidResources.java:551) at com.android.build.gradle.tasks.ProcessAndroidResources.doFullTaskAction(ProcessAndroidResources.java:285) at com.android.build.gradle.internal.tasks.IncrementalTask.taskAction(IncrementalTask.java:109) at sun.reflect.GeneratedMethodAccessor182.invoke(Unknown Source) at sun.reflect.DelegatingMethodAccessorImpl.invoke(DelegatingMethodAccessorImpl.java:43) at java.lang.reflect.Method.invoke(Method.java:498) at org.gradle.internal.reflect.JavaMethod.invoke(JavaMethod.java:73) at org.gradle.api.internal.project.taskfactory.DefaultTaskClassInfoStore$IncrementalTaskAction.doExecute(Default TaskClassInfoStore.java:173) at org.gradle.api.internal.project.taskfactory.DefaultTaskClassInfoStore$StandardTaskAction.execute(DefaultTaskC lassInfoStore.java:134) at org.gradle.api.internal.project.taskfactory.DefaultTaskClassInfoStore$StandardTaskAction.execute(DefaultTaskC lassInfoStore.java:121) at org.gradle.api.internal.tasks.execution.ExecuteActionsTaskExecuter$1.run(ExecuteActionsTaskExecuter.java:122) at org.gradle.internal.progress.DefaultBuildOperationExecutor$RunnableBuildOperationWorker.execute(DefaultBuildO perationExecutor.java:336) at org.gradle.internal.progress.DefaultBuildOperationExecutor$RunnableBuildOperationWorker.execute(DefaultBuildO perationExecutor.java:328) at org.gradle.internal.progress.DefaultBuildOperationExecutor.execute(DefaultBuildOperationExecutor.java:197) at org.gradle.internal.progress.DefaultBuildOperationExecutor.run(DefaultBuildOperationExecutor.java:107) at org.gradle.api.internal.tasks.execution.ExecuteActionsTaskExecuter.executeAction(ExecuteActionsTaskExecuter.j ava:111) at org.gradle.api.internal.tasks.execution.ExecuteActionsTaskExecuter.executeActions(ExecuteActionsTaskExecuter. java:92) at org.gradle.api.internal.tasks.execution.ExecuteActionsTaskExecuter.execute(ExecuteActionsTaskExecuter.java:70 ) at org.gradle.api.internal.tasks.execution.SkipUpToDateTaskExecuter.execute(SkipUpToDateTaskExecuter.java:63) at org.gradle.api.internal.tasks.execution.ResolveTaskOutputCachingStateExecuter.execute(ResolveTaskOutputCachin gStateExecuter.java:54) at org.gradle.api.internal.tasks.execution.ValidatingTaskExecuter.execute(ValidatingTaskExecuter.java:58) at org.gradle.api.internal.tasks.execution.SkipEmptySourceFilesTaskExecuter.execute(SkipEmptySourceFilesTaskExec uter.java:88) at org.gradle.api.internal.tasks.execution.ResolveTaskArtifactStateTaskExecuter.execute(ResolveTaskArtifactState TaskExecuter.java:52) at org.gradle.api.internal.tasks.execution.SkipTaskWithNoActionsExecuter.execute(SkipTaskWithNoActionsExecuter.j ava:52) at org.gradle.api.internal.tasks.execution.SkipOnlyIfTaskExecuter.execute(SkipOnlyIfTaskExecuter.java:54) at org.gradle.api.internal.tasks.execution.ExecuteAtMostOnceTaskExecuter.execute(ExecuteAtMostOnceTaskExecuter.j ava:43) at org.gradle.api.internal.tasks.execution.CatchExceptionTaskExecuter.execute(CatchExceptionTaskExecuter.java:34 ) at org.gradle.execution.taskgraph.DefaultTaskGraphExecuter$EventFiringTaskWorker$1.run(DefaultTaskGraphExecuter. java:248) at org.gradle.internal.progress.DefaultBuildOperationExecutor$RunnableBuildOperationWorker.execute(DefaultBuildO perationExecutor.java:336) at org.gradle.internal.progress.DefaultBuildOperationExecutor$RunnableBuildOperationWorker.execute(DefaultBuildO perationExecutor.java:328) at org.gradle.internal.progress.DefaultBuildOperationExecutor.execute(DefaultBuildOperationExecutor.java:197) at org.gradle.internal.progress.DefaultBuildOperationExecutor.run(DefaultBuildOperationExecutor.java:107) at org.gradle.execution.taskgraph.DefaultTaskGraphExecuter$EventFiringTaskWorker.execute(DefaultTaskGraphExecute r.java:241) at org.gradle.execution.taskgraph.DefaultTaskGraphExecuter$EventFiringTaskWorker.execute(DefaultTaskGraphExecute r.java:230) at org.gradle.execution.taskgraph.DefaultTaskPlanExecutor$TaskExecutorWorker.processTask(DefaultTaskPlanExecutor .java:124) at org.gradle.execution.taskgraph.DefaultTaskPlanExecutor$TaskExecutorWorker.access$200(DefaultTaskPlanExecutor. java:80) at org.gradle.execution.taskgraph.DefaultTaskPlanExecutor$TaskExecutorWorker$1.execute(DefaultTaskPlanExecutor.j ava:105) at org.gradle.execution.taskgraph.DefaultTaskPlanExecutor$TaskExecutorWorker$1.execute(DefaultTaskPlanExecutor.j ava:99) at org.gradle.execution.taskgraph.DefaultTaskExecutionPlan.execute(DefaultTaskExecutionPlan.java:625) at org.gradle.execution.taskgraph.DefaultTaskExecutionPlan.executeWithTask(DefaultTaskExecutionPlan.java:580) at org.gradle.execution.taskgraph.DefaultTaskPlanExecutor$TaskExecutorWorker.run(DefaultTaskPlanExecutor.java:99 ) at org.gradle.execution.taskgraph.DefaultTaskPlanExecutor.process(DefaultTaskPlanExecutor.java:60) at org.gradle.execution.taskgraph.DefaultTaskGraphExecuter.execute(DefaultTaskGraphExecuter.java:128) at org.gradle.execution.SelectedTaskExecutionAction.execute(SelectedTaskExecutionAction.java:37) at org.gradle.execution.DefaultBuildExecuter.execute(DefaultBuildExecuter.java:37) at org.gradle.execution.DefaultBuildExecuter.access$000(DefaultBuildExecuter.java:23) at org.gradle.execution.DefaultBuildExecuter$1.proceed(DefaultBuildExecuter.java:43) at org.gradle.execution.DryRunBuildExecutionAction.execute(DryRunBuildExecutionAction.java:46) at org.gradle.execution.DefaultBuildExecuter.execute(DefaultBuildExecuter.java:37) at org.gradle.execution.DefaultBuildExecuter.execute(DefaultBuildExecuter.java:30) at org.gradle.initialization.DefaultGradleLauncher$ExecuteTasks.run(DefaultGradleLauncher.java:311) at org.gradle.internal.progress.DefaultBuildOperationExecutor$RunnableBuildOperationWorker.execute(DefaultBuildO perationExecutor.java:336) at org.gradle.internal.progress.DefaultBuildOperationExecutor$RunnableBuildOperationWorker.execute(DefaultBuildO perationExecutor.java:328) at org.gradle.internal.progress.DefaultBuildOperationExecutor.execute(DefaultBuildOperationExecutor.java:197) at org.gradle.internal.progress.DefaultBuildOperationExecutor.run(DefaultBuildOperationExecutor.java:107) at org.gradle.initialization.DefaultGradleLauncher.runTasks(DefaultGradleLauncher.java:202) at org.gradle.initialization.DefaultGradleLauncher.doBuildStages(DefaultGradleLauncher.java:132) at org.gradle.initialization.DefaultGradleLauncher.executeTasks(DefaultGradleLauncher.java:107) at org.gradle.internal.invocation.GradleBuildController$1.call(GradleBuildController.java:78) at org.gradle.internal.invocation.GradleBuildController$1.call(GradleBuildController.java:75) at org.gradle.internal.work.DefaultWorkerLeaseService.withLocks(DefaultWorkerLeaseService.java:152) at org.gradle.internal.invocation.GradleBuildController.doBuild(GradleBuildController.java:100) at org.gradle.internal.invocation.GradleBuildController.run(GradleBuildController.java:75) at org.gradle.tooling.internal.provider.ExecuteBuildActionRunner.run(ExecuteBuildActionRunner.java:28) at org.gradle.launcher.exec.ChainingBuildActionRunner.run(ChainingBuildActionRunner.java:35) at org.gradle.tooling.internal.provider.ValidatingBuildActionRunner.run(ValidatingBuildActionRunner.java:32) at org.gradle.launcher.exec.RunAsBuildOperationBuildActionRunner$1.run(RunAsBuildOperationBuildActionRunner.java :43) at org.gradle.internal.progress.DefaultBuildOperationExecutor$RunnableBuildOperationWorker.execute(DefaultBuildO perationExecutor.java:336) at org.gradle.internal.progress.DefaultBuildOperationExecutor$RunnableBuildOperationWorker.execute(DefaultBuildO perationExecutor.java:328) at org.gradle.internal.progress.DefaultBuildOperationExecutor.execute(DefaultBuildOperationExecutor.java:197) at org.gradle.internal.progress.DefaultBuildOperationExecutor.run(DefaultBuildOperationExecutor.java:107) at org.gradle.launcher.exec.RunAsBuildOperationBuildActionRunner.run(RunAsBuildOperationBuildActionRunner.java:4 0) at org.gradle.tooling.internal.provider.SubscribableBuildActionRunner.run(SubscribableBuildActionRunner.java:51) at org.gradle.launcher.exec.InProcessBuildActionExecuter.execute(InProcessBuildActionExecuter.java:45) at org.gradle.launcher.exec.InProcessBuildActionExecuter.execute(InProcessBuildActionExecuter.java:29) at org.gradle.launcher.exec.BuildTreeScopeBuildActionExecuter.execute(BuildTreeScopeBuildActionExecuter.java:39) at org.gradle.launcher.exec.BuildTreeScopeBuildActionExecuter.execute(BuildTreeScopeBuildActionExecuter.java:25) at org.gradle.tooling.internal.provider.ContinuousBuildActionExecuter.execute(ContinuousBuildActionExecuter.java :71) at org.gradle.tooling.internal.provider.ContinuousBuildActionExecuter.execute(ContinuousBuildActionExecuter.java :45) at org.gradle.tooling.internal.provider.ServicesSetupBuildActionExecuter.execute(ServicesSetupBuildActionExecute r.java:51) at org.gradle.tooling.internal.provider.ServicesSetupBuildActionExecuter.execute(ServicesSetupBuildActionExecute r.java:32) at org.gradle.tooling.internal.provider.GradleThreadBuildActionExecuter.execute(GradleThreadBuildActionExecuter. java:36) at org.gradle.tooling.internal.provider.GradleThreadBuildActionExecuter.execute(GradleThreadBuildActionExecuter. java:25) at org.gradle.tooling.internal.provider.ParallelismConfigurationBuildActionExecuter.execute(ParallelismConfigura tionBuildActionExecuter.java:43) at org.gradle.tooling.internal.provider.ParallelismConfigurationBuildActionExecuter.execute(ParallelismConfigura tionBuildActionExecuter.java:29) at org.gradle.tooling.internal.provider.StartParamsValidatingActionExecuter.execute(StartParamsValidatingActionE xecuter.java:64) at org.gradle.tooling.internal.provider.StartParamsValidatingActionExecuter.execute(StartParamsValidatingActionE xecuter.java:29) at org.gradle.tooling.internal.provider.SessionFailureReportingActionExecuter.execute(SessionFailureReportingAct ionExecuter.java:55) at org.gradle.tooling.internal.provider.SessionFailureReportingActionExecuter.execute(SessionFailureReportingAct ionExecuter.java:42) at org.gradle.tooling.internal.provider.SetupLoggingActionExecuter.execute(SetupLoggingActionExecuter.java:58) at org.gradle.tooling.internal.provider.SetupLoggingActionExecuter.execute(SetupLoggingActionExecuter.java:33) at org.gradle.launcher.daemon.server.exec.ExecuteBuild.doBuild(ExecuteBuild.java:67) at org.gradle.launcher.daemon.server.exec.BuildCommandOnly.execute(BuildCommandOnly.java:36) at org.gradle.launcher.daemon.server.api.DaemonCommandExecution.proceed(DaemonCommandExecution.java:120) at org.gradle.launcher.daemon.server.exec.WatchForDisconnection.execute(WatchForDisconnection.java:37) at org.gradle.launcher.daemon.server.api.DaemonCommandExecution.proceed(DaemonCommandExecution.java:120) at org.gradle.launcher.daemon.server.exec.ResetDeprecationLogger.execute(ResetDeprecationLogger.java:26) at org.gradle.launcher.daemon.server.api.DaemonCommandExecution.proceed(DaemonCommandExecution.java:120) at org.gradle.launcher.daemon.server.exec.RequestStopIfSingleUsedDaemon.execute(RequestStopIfSingleUsedDaemon.ja va:34) at org.gradle.launcher.daemon.server.api.DaemonCommandExecution.proceed(DaemonCommandExecution.java:120) at org.gradle.launcher.daemon.server.exec.ForwardClientInput$2.call(ForwardClientInput.java:74) at org.gradle.launcher.daemon.server.exec.ForwardClientInput$2.call(ForwardClientInput.java:72) at org.gradle.util.Swapper.swap(Swapper.java:38) at org.gradle.launcher.daemon.server.exec.ForwardClientInput.execute(ForwardClientInput.java:72) at org.gradle.launcher.daemon.server.api.DaemonCommandExecution.proceed(DaemonCommandExecution.java:120) at org.gradle.launcher.daemon.server.exec.LogAndCheckHealth.execute(LogAndCheckHealth.java:55) at org.gradle.launcher.daemon.server.api.DaemonCommandExecution.proceed(DaemonCommandExecution.java:120) at org.gradle.launcher.daemon.server.exec.LogToClient.doBuild(LogToClient.java:62) at org.gradle.launcher.daemon.server.exec.BuildCommandOnly.execute(BuildCommandOnly.java:36) at org.gradle.launcher.daemon.server.api.DaemonCommandExecution.proceed(DaemonCommandExecution.java:120) at org.gradle.launcher.daemon.server.exec.EstablishBuildEnvironment.doBuild(EstablishBuildEnvironment.java:82) at org.gradle.launcher.daemon.server.exec.BuildCommandOnly.execute(BuildCommandOnly.java:36) at org.gradle.launcher.daemon.server.api.DaemonCommandExecution.proceed(DaemonCommandExecution.java:120) at org.gradle.launcher.daemon.server.exec.StartBuildOrRespondWithBusy$1.run(StartBuildOrRespondWithBusy.java:50) at org.gradle.launcher.daemon.server.DaemonStateCoordinator$1.run(DaemonStateCoordinator.java:297) at org.gradle.internal.concurrent.ExecutorPolicy$CatchAndRecordFailures.onExecute(ExecutorPolicy.java:63) at org.gradle.internal.concurrent.ManagedExecutorImpl$1.run(ManagedExecutorImpl.java:46) at java.util.concurrent.ThreadPoolExecutor.runWorker(ThreadPoolExecutor.java:1142) at java.util.concurrent.ThreadPoolExecutor$Worker.run(ThreadPoolExecutor.java:617) at org.gradle.internal.concurrent.ThreadFactoryImpl$ManagedThreadRunnable.run(ThreadFactoryImpl.java:55) at java.lang.Thread.run(Thread.java:745) Caused by: java.util.concurrent.ExecutionException: java.util.concurrent.ExecutionException: com.android.tools.aapt2.Aap t2Exception: AAPT2 error: check logs for details at com.google.common.util.concurrent.AbstractFuture.getDoneValue(AbstractFuture.java:503) at com.google.common.util.concurrent.AbstractFuture.get(AbstractFuture.java:482) at com.google.common.util.concurrent.AbstractFuture$TrustedFuture.get(AbstractFuture.java:79) at com.android.builder.core.AndroidBuilder.processResources(AndroidBuilder.java:794) ... 121 more Caused by: java.util.concurrent.ExecutionException: com.android.tools.aapt2.Aapt2Exception: AAPT2 error: check logs for details at com.google.common.util.concurrent.AbstractFuture.getDoneValue(AbstractFuture.java:503) at com.google.common.util.concurrent.AbstractFuture.get(AbstractFuture.java:462) at com.google.common.util.concurrent.AbstractFuture$TrustedFuture.get(AbstractFuture.java:79) at com.android.builder.internal.aapt.v2.QueueableAapt2.lambda$makeValidatedPackage$1(QueueableAapt2.java:179) at java.util.concurrent.ThreadPoolExecutor.runWorker(ThreadPoolExecutor.java:1142) at java.util.concurrent.ThreadPoolExecutor$Worker.run(ThreadPoolExecutor.java:617) ... 1 more Caused by: com.android.tools.aapt2.Aapt2Exception: AAPT2 error: check logs for details at com.android.builder.png.AaptProcess$NotifierProcessOutput.handleOutput(AaptProcess.java:463) at com.android.builder.png.AaptProcess$NotifierProcessOutput.err(AaptProcess.java:415) at com.android.builder.png.AaptProcess$ProcessOutputFacade.err(AaptProcess.java:332) at com.android.utils.GrabProcessOutput$1.run(GrabProcessOutput.java:104) FAILURE: Build failed with an exception. * What went wrong: Execution failed for task ':app:processDebugResources'. > Failed to execute aapt
idea 打开ionic项目 html文件中的内容报红?
刚刚新建的ionic项目,能运行,但是所有html里面的标签和文本都报红,是idea无法解释html语言吗?要怎么设置呢? ![图片说明](https://img-ask.csdn.net/upload/201909/25/1569388598_537388.png)
Ionic4 如何拦截安卓物理返回键?
现在遇到一个问题是,打包安卓后,从登录页面跳转到(tabs/home)首页,点击物理返回键会退回到登录页面,请问该怎么拦截,百度一大堆方法都不管用,注意是ionic4版本!!!
ionic报错 'hasOwnProperty' of undefined
执行到ionic platform add android这一步报错: TypeError: Cannot read property 'hasOwnProperty' of undefined ![图片说明](https://img-ask.csdn.net/upload/201611/12/1478951523_535628.png)
Angular ionic 跳转 href="#/category/1423/" 啥意思
<ion-item class="item-icon-left item-icon-right dark" id="menu-list-item19" href="#/category/1423/" menu-close="" data-componentid="list-item19"> <i class="icon ion-android-alarm-clock"></i>时尚鞋包 <i class="icon ion-ios-arrow-right"></i> <ion-option-button class="button-dark"></ion-option-button> </ion-item> 想问下 ionic href="#/category/1423/" 这种跳转方式是怎么跳转的?表示啥
ionic3 ionic serve 很慢要5分钟左右
ionic3 ionic serve 很慢要5分钟左右,项目做了一段时间后 页面越来越多,现在改一个ts,编译要很久.看了ionic serve 控制台打印出来的 主要的时间都在webpack上.有没有什么好的解决方案
一些关于Ionic的简单问题
因为没有接触过Ionic,所以有一些很低级的问题想请教各位大大 1、Ionic = Cordova + AngularJS + Ionic UI ,那么能够理解为Ionic只做前端没有做后台业务逻辑之类的吗? 2、Ionic创建一个项目,然后通过什么IDE来开发? 3、Ionic创建的项目是一个可以转化成各个平台的项目,然后添加对应的平台后就会将这个项目转为对应平台的项目,之后才进行业务逻辑开发?如果我添加android平台后在Eclipse中写了一些代码,可以转为ios吗?还是要在Xcode中编写? 谢谢。
ionic4.x ion-menu制作侧面菜单,页面多次跳转之后无法打开,出现了动画异常,求解?
调试中js出现:Error: ASSERT: _before() should be called while animating app.component.html代码: ``` <ion-app> <ion-menu menuId="first" side="start" > <ion-content> <ion-list> <ion-item style="text-align:center;" lines="none"> <ion-label><img src="../../../assets/icon/navigation/my_data_plan.png" style="width:64px;height:64px;" /></ion-label> </ion-item> <ion-item style="text-align:center;"> <ion-label>{{account}} <span *ngIf="isLogined" (click)="logout()"> &nbsp; {{loginOut}}</span> <span *ngIf="!isLogined" (click)="gotoLoginPage()">{{login}}</span> </ion-label> </ion-item> <ion-menu-toggle auto-hide="false"> <ion-item *ngFor="let navItem of navList" (click)="gotoPages(navItem.url)"> <ion-avatar slot="start"> <img src="{{navItem.icon}}"> </ion-avatar> <ion-label>{{navItem.title }}</ion-label> </ion-item> </ion-menu-toggle> </ion-list> </ion-content> </ion-menu> <ion-header> <ion-toolbar color="primary"> <ion-buttons slot="end"> <ion-button> <img src="../../../assets/icon/header/reset.png" style="width:30px;height:30px;" /> </ion-button> <ion-button> <img src="../../../assets/icon/header/off.png" style="width:30px;height:30px;" /> </ion-button> <!-- <ion-button (click)="openMenu()" style="border:1px solid #fff;--color:#fff;"> </ion-button> --> <ion-menu-button style="border:1px solid #fff;--color:#fff;"></ion-menu-button> </ion-buttons> <ion-title>Pokefi admin</ion-title> </ion-toolbar> </ion-header> <ion-router-outlet main></ion-router-outlet> </ion-app> ``` ``` app.component.ts代码: gotoPages(url: string) { this.menu.close('first'); location.reload(); if (url === Routes.Settings) { this.router.navigate([url]) } else if (url === Routes.Data_Plan_List || url === Routes.My_Data_Plans) { this.router.navigateByUrl(url); //this.router.navigate([this.isLogined ? url : Routes.User_Login]) } else { if (this.isLogined) { this.router.navigate([url]) } else { this.toastService.popToast('no_permission_warning', Ion_Color.Dark) this.router.navigate([Routes.User_Login]) } } } ``` ``` ```
webapp angular js ionic 开发时百度地图api kua'yu
return { getSiteLin: function (callback) { var url = 'http://api.map.baidu.com/geocoder?location=39.990912172420714,116.32715863448607&coord_type=gcj02&output=json&ak=GYcRqL9Ky1hxk6TXvpDQchSVmPu2minC&src=webapp.baidu.openAPIdemo' url+='&callback=JSON_CALLBACK' $http.jsonp(url) .success(function (data) { console.log(data) callback(data) }) }, ``` ```
ionic3开发公众号,怎么调用微信扫描二维码的功能?
使用ionic框架开发公众号项目,之前使用ionic自带的qrscanner扫码插件, 现在换一种方式调用微信扫描二维码功能,要怎么调用或者哪里有教程介绍之类的
Kafka实战(三) - Kafka的自我修养与定位
Apache Kafka是消息引擎系统,也是一个分布式流处理平台(Distributed Streaming Platform) Kafka是LinkedIn公司内部孵化的项目。LinkedIn最开始有强烈的数据强实时处理方面的需求,其内部的诸多子系统要执行多种类型的数据处理与分析,主要包括业务系统和应用程序性能监控,以及用户行为数据处理等。 遇到的主要问题: 数据正确性不足 数据的收集主要...
volatile 与 synchronize 详解
Java支持多个线程同时访问一个对象或者对象的成员变量,由于每个线程可以拥有这个变量的拷贝(虽然对象以及成员变量分配的内存是在共享内存中的,但是每个执行的线程还是可以拥有一份拷贝,这样做的目的是加速程序的执行,这是现代多核处理器的一个显著特性),所以程序在执行过程中,一个线程看到的变量并不一定是最新的。 volatile 关键字volatile可以用来修饰字段(成员变量),就是告知程序任何对该变量...
Java学习的正确打开方式
在博主认为,对于入门级学习java的最佳学习方法莫过于视频+博客+书籍+总结,前三者博主将淋漓尽致地挥毫于这篇博客文章中,至于总结在于个人,实际上越到后面你会发现学习的最好方式就是阅读参考官方文档其次就是国内的书籍,博客次之,这又是一个层次了,这里暂时不提后面再谈。博主将为各位入门java保驾护航,各位只管冲鸭!!!上天是公平的,只要不辜负时间,时间自然不会辜负你。 何谓学习?博主所理解的学习,它是一个过程,是一个不断累积、不断沉淀、不断总结、善于传达自己的个人见解以及乐于分享的过程。
程序员必须掌握的核心算法有哪些?
由于我之前一直强调数据结构以及算法学习的重要性,所以就有一些读者经常问我,数据结构与算法应该要学习到哪个程度呢?,说实话,这个问题我不知道要怎么回答你,主要取决于你想学习到哪些程度,不过针对这个问题,我稍微总结一下我学过的算法知识点,以及我觉得值得学习的算法。这些算法与数据结构的学习大多数是零散的,并没有一本把他们全部覆盖的书籍。下面是我觉得值得学习的一些算法以及数据结构,当然,我也会整理一些看过...
有哪些让程序员受益终生的建议
从业五年多,辗转两个大厂,出过书,创过业,从技术小白成长为基层管理,联合几个业内大牛回答下这个问题,希望能帮到大家,记得帮我点赞哦。 敲黑板!!!读了这篇文章,你将知道如何才能进大厂,如何实现财务自由,如何在工作中游刃有余,这篇文章很长,但绝对是精品,记得帮我点赞哦!!!! 一腔肺腑之言,能看进去多少,就看你自己了!!! 目录: 在校生篇: 为什么要尽量进大厂? 如何选择语言及方...
大学四年自学走来,这些私藏的实用工具/学习网站我贡献出来了
大学四年,看课本是不可能一直看课本的了,对于学习,特别是自学,善于搜索网上的一些资源来辅助,还是非常有必要的,下面我就把这几年私藏的各种资源,网站贡献出来给你们。主要有:电子书搜索、实用工具、在线视频学习网站、非视频学习网站、软件下载、面试/求职必备网站。 注意:文中提到的所有资源,文末我都给你整理好了,你们只管拿去,如果觉得不错,转发、分享就是最大的支持了。 一、电子书搜索 对于大部分程序员...
linux系列之常用运维命令整理笔录
本博客记录工作中需要的linux运维命令,大学时候开始接触linux,会一些基本操作,可是都没有整理起来,加上是做开发,不做运维,有些命令忘记了,所以现在整理成博客,当然vi,文件操作等就不介绍了,慢慢积累一些其它拓展的命令,博客不定时更新 free -m 其中:m表示兆,也可以用g,注意都要小写 Men:表示物理内存统计 total:表示物理内存总数(total=used+free) use...
比特币原理详解
一、什么是比特币 比特币是一种电子货币,是一种基于密码学的货币,在2008年11月1日由中本聪发表比特币白皮书,文中提出了一种去中心化的电子记账系统,我们平时的电子现金是银行来记账,因为银行的背后是国家信用。去中心化电子记账系统是参与者共同记账。比特币可以防止主权危机、信用风险。其好处不多做赘述,这一层面介绍的文章很多,本文主要从更深层的技术原理角度进行介绍。 二、问题引入 假设现有4个人...
GitHub开源史上最大规模中文知识图谱
近日,一直致力于知识图谱研究的 OwnThink 平台在 Github 上开源了史上最大规模 1.4 亿中文知识图谱,其中数据是以(实体、属性、值),(实体、关系、实体)混合的形式组织,数据格式采用 csv 格式。 到目前为止,OwnThink 项目开放了对话机器人、知识图谱、语义理解、自然语言处理工具。知识图谱融合了两千五百多万的实体,拥有亿级别的实体属性关系,机器人采用了基于知识图谱的语义感...
程序员接私活怎样防止做完了不给钱?
首先跟大家说明一点,我们做 IT 类的外包开发,是非标品开发,所以很有可能在开发过程中会有这样那样的需求修改,而这种需求修改很容易造成扯皮,进而影响到费用支付,甚至出现做完了项目收不到钱的情况。 那么,怎么保证自己的薪酬安全呢? 我们在开工前,一定要做好一些证据方面的准备(也就是“讨薪”的理论依据),这其中最重要的就是需求文档和验收标准。一定要让需求方提供这两个文档资料作为开发的基础。之后开发...
网页实现一个简单的音乐播放器(大佬别看。(⊙﹏⊙))
今天闲着无事,就想写点东西。然后听了下歌,就打算写个播放器。 于是乎用h5 audio的加上js简单的播放器完工了。 演示地点演示 html代码如下` music 这个年纪 七月的风 音乐 ` 然后就是css`*{ margin: 0; padding: 0; text-decoration: none; list-...
微信支付崩溃了,但是更让马化腾和张小龙崩溃的竟然是……
loonggg读完需要3分钟速读仅需1分钟事件还得还原到昨天晚上,10 月 29 日晚上 20:09-21:14 之间,微信支付发生故障,全国微信支付交易无法正常进行。然...
Python十大装B语法
Python 是一种代表简单思想的语言,其语法相对简单,很容易上手。不过,如果就此小视 Python 语法的精妙和深邃,那就大错特错了。本文精心筛选了最能展现 Python 语法之精妙的十个知识点,并附上详细的实例代码。如能在实战中融会贯通、灵活使用,必将使代码更为精炼、高效,同时也会极大提升代码B格,使之看上去更老练,读起来更优雅。
数据库优化 - SQL优化
以实际SQL入手,带你一步一步走上SQL优化之路!
2019年11月中国大陆编程语言排行榜
2019年11月2日,我统计了某招聘网站,获得有效程序员招聘数据9万条。针对招聘信息,提取编程语言关键字,并统计如下: 编程语言比例 rank pl_ percentage 1 java 33.62% 2 cpp 16.42% 3 c_sharp 12.82% 4 javascript 12.31% 5 python 7.93% 6 go 7.25% 7 p...
通俗易懂地给女朋友讲:线程池的内部原理
餐盘在灯光的照耀下格外晶莹洁白,女朋友拿起红酒杯轻轻地抿了一小口,对我说:“经常听你说线程池,到底线程池到底是个什么原理?”
《奇巧淫技》系列-python!!每天早上八点自动发送天气预报邮件到QQ邮箱
将代码部署服务器,每日早上定时获取到天气数据,并发送到邮箱。 也可以说是一个小型人工智障。 知识可以运用在不同地方,不一定非是天气预报。
经典算法(5)杨辉三角
杨辉三角 是经典算法,这篇博客对它的算法思想进行了讲解,并有完整的代码实现。
英特尔不为人知的 B 面
从 PC 时代至今,众人只知在 CPU、GPU、XPU、制程、工艺等战场中,英特尔在与同行硬件芯片制造商们的竞争中杀出重围,且在不断的成长进化中,成为全球知名的半导体公司。殊不知,在「刚硬」的背后,英特尔「柔性」的软件早已经做到了全方位的支持与支撑,并持续发挥独特的生态价值,推动产业合作共赢。 而对于这一不知人知的 B 面,很多人将其称之为英特尔隐形的翅膀,虽低调,但是影响力却不容小觑。 那么,在...
腾讯算法面试题:64匹马8个跑道需要多少轮才能选出最快的四匹?
昨天,有网友私信我,说去阿里面试,彻底的被打击到了。问了为什么网上大量使用ThreadLocal的源码都会加上private static?他被难住了,因为他从来都没有考虑过这个问题。无独有偶,今天笔者又发现有网友吐槽了一道腾讯的面试题,我们一起来看看。 腾讯算法面试题:64匹马8个跑道需要多少轮才能选出最快的四匹? 在互联网职场论坛,一名程序员发帖求助到。二面腾讯,其中一个算法题:64匹...
面试官:你连RESTful都不知道我怎么敢要你?
干货,2019 RESTful最贱实践
刷了几千道算法题,这些我私藏的刷题网站都在这里了!
遥想当年,机缘巧合入了 ACM 的坑,周边巨擘林立,从此过上了"天天被虐似死狗"的生活… 然而我是谁,我可是死狗中的战斗鸡,智力不够那刷题来凑,开始了夜以继日哼哧哼哧刷题的日子,从此"读题与提交齐飞, AC 与 WA 一色 ",我惊喜的发现被题虐既刺激又有快感,那一刻我泪流满面。这么好的事儿作为一个正直的人绝不能自己独享,经过激烈的颅内斗争,我决定把我私藏的十几个 T 的,阿不,十几个刷题网...
为啥国人偏爱Mybatis,而老外喜欢Hibernate/JPA呢?
关于SQL和ORM的争论,永远都不会终止,我也一直在思考这个问题。昨天又跟群里的小伙伴进行了一番讨论,感触还是有一些,于是就有了今天这篇文。 声明:本文不会下关于Mybatis和JPA两个持久层框架哪个更好这样的结论。只是摆事实,讲道理,所以,请各位看官勿喷。 一、事件起因 关于Mybatis和JPA孰优孰劣的问题,争论已经很多年了。一直也没有结论,毕竟每个人的喜好和习惯是大不相同的。我也看...
白话阿里巴巴Java开发手册高级篇
不久前,阿里巴巴发布了《阿里巴巴Java开发手册》,总结了阿里巴巴内部实际项目开发过程中开发人员应该遵守的研发流程规范,这些流程规范在一定程度上能够保证最终的项目交付质量,通过在时间中总结模式,并推广给广大开发人员,来避免研发人员在实践中容易犯的错误,确保最终在大规模协作的项目中达成既定目标。 无独有偶,笔者去年在公司里负责升级和制定研发流程、设计模板、设计标准、代码标准等规范,并在实际工作中进行...
SQL-小白最佳入门sql查询一
不要偷偷的查询我的个人资料,即使你再喜欢我,也不要这样,真的不好;
项目中的if else太多了,该怎么重构?
介绍 最近跟着公司的大佬开发了一款IM系统,类似QQ和微信哈,就是聊天软件。我们有一部分业务逻辑是这样的 if (msgType = "文本") { // dosomething } else if(msgType = "图片") { // doshomething } else if(msgType = "视频") { // doshomething } else { // doshom...
Nginx 原理和架构
Nginx 是一个免费的,开源的,高性能的 HTTP 服务器和反向代理,以及 IMAP / POP3 代理服务器。Nginx 以其高性能,稳定性,丰富的功能,简单的配置和低资源消耗而闻名。 Nginx 的整体架构 Nginx 里有一个 master 进程和多个 worker 进程。master 进程并不处理网络请求,主要负责调度工作进程:加载配置、启动工作进程及非停升级。worker 进程负责处...
YouTube排名第一的励志英文演讲《Dream(梦想)》
Idon’t know what that dream is that you have, I don't care how disappointing it might have been as you've been working toward that dream,but that dream that you’re holding in your mind, that it’s po...
“狗屁不通文章生成器”登顶GitHub热榜,分分钟写出万字形式主义大作
一、垃圾文字生成器介绍 最近在浏览GitHub的时候,发现了这样一个骨骼清奇的雷人项目,而且热度还特别高。 项目中文名:狗屁不通文章生成器 项目英文名:BullshitGenerator 根据作者的介绍,他是偶尔需要一些中文文字用于GUI开发时测试文本渲染,因此开发了这个废话生成器。但由于生成的废话实在是太过富于哲理,所以最近已经被小伙伴们给玩坏了。 他的文风可能是这样的: 你发现,...
程序员:我终于知道post和get的区别
是一个老生常谈的话题,然而随着不断的学习,对于以前的认识有很多误区,所以还是需要不断地总结的,学而时习之,不亦说乎
相关热词 c# 引用mysql c#动态加载非托管dll c# 两个表数据同步 c# 返回浮点json c# imap 链接状态 c# 漂亮字 c# 上取整 除法 c#substring c#中延时关闭 c#线段拖拉
立即提问