求教安装MSYS2+MingW64问题 5C

求教:win7/MyEclipse下安装MSYS2+Mingw64时CDT应该用什么版本,在哪里能查到?
在win7/MyEclipse下装MSYS2+Mingw64时,MSYS2.exe中:gcc -v 能看到,windows/cmd中 gcc -v 也能看到。但是WyEclipse/toolchain中:没有MinGW。
是不是CDT版本问题?
JDK用的是1.8.0-171应该是无关的吧?

1个回答

具体怎么安装,看你是想选择Posix Make还是GNU Make了。

Csdn user default icon
上传中...
上传图片
插入图片
抄袭、复制答案,以达到刷声望分或其他目的的行为,在CSDN问答是严格禁止的,一经发现立刻封号。是时候展现真正的技术了!
其他相关推荐
求教安装MSYS2+MingW64问题
求教:win7/MyEclipse下安装MSYS2+Mingw64时CDT应该用什么版本,在哪里能查到? 在win7/MyEclipse下装MSYS2+Mingw64时,MSYS2.exe中:gcc -v 能看到,windows/cmd中 gcc -v 也能看到。但是WyEclipse/toolchain中:没有MinGW。 是不是CDT版本问题? JDK用的是1.8.0-171应该是无关的吧?
mingw MSYS2 编译ACE出错
操作系统是WIN7 64位,我用QT中自带的mingw,mingw版本是7.3,在MSYS2中编译ACE,ACE版本是6.5.5,出现如下错误 g++.exe: error: .shobj/Configu: No such file or directory mingw32-make[1]: *** [E:/ACE_wrappers/include/makeinclude/rules.lib.GNU:245: libACE.dll] Error 1 mingw32-make[1]: Leaving directory 'E:/ACE_wrappers/ace' mingw32-make: *** [GNUmakefile:44: ACE] Error 2 ![图片说明](https://img-ask.csdn.net/upload/201906/09/1560053143_932285.png) 我把ACE的版本换成6.5.0出现相同的错误,但提示有点不同 ![图片说明](https://img-ask.csdn.net/upload/201906/09/1560053237_182274.png) 都是找不到一个.shobj/Configu(.shobj/Co)的文件,makefile中的源文件都能完成编译,.shobj是编译过程中自动创建的存放.o文件的文件夹,我感觉是在获取.shobj/Configu的文件时,文件名被截断了,但找不到在哪,请高手指点,谢谢。
codeblocks+mingw,msys编译pjsip
我使用的是win32下codeblocks,使用mingw/gcc编译器,我想要安装pjsip应该怎么操作,查找了很多的资料,知道pjsip是支持交叉编译的,win32+mingw,但是我就是无法编译成功 make[1]: execvp: make: Resource temporarily unavailable make[1]: *** [depend] Error 127 make[1]: Leaving directory '/e/pjproject-2.2.1/pjmedia/build' make: *** [dep] Error 1 后来用cygwin试了一下,提示说是speex/speex_echo.h找不到,但是没有问题啊,文件夹中是有的啊 麻烦大家告诉我这是什么情况,怎么修正 如果有codeblocks+mingw下编译成功的pjsip,给我一份也好,多谢
windows环境下 vala程序生成c文件问题
目前在研究交叉环境,使用mingw32编译项目,项目中有vala程序。 程序命令使用过程为: ``` #cmake -G "MinGW Makefiles" ... #make #make install ``` 在进行make命令的时候,vala程序生成了新的c文件,其中生成的c文件中,都有类似此行报错: ``` #line 1199 "D:\msys64\mingw64\share/vala-0.30/vapi/glib-2.0.vapi" ``` 修改成下面之后: ``` #line 1199 "D:/msys64/mingw64/share/vala-0.30/vapi/glib-2.0.vapi" ``` 不报错,是否有大侠知道怎么才能在CMakeLists中修改这个路径斜杠问题,或者是哪里可以修改? 不想每次都手动去修改
msys2 mediaInfo 头文件引用问题
我使用 msys2 64 位 在引用 mediainfo 头文件时 报错。 ![图片说明](https://img-ask.csdn.net/upload/201602/26/1456472474_784316.png) 没有C币,无法悬赏。
用msys编译GMP、PBC库是出现错误,求万能的大神帮忙解决!
用msys编译GMP、PBC库是出现如下错误,求万能的大神帮忙解决! ![图片说明](https://img-ask.csdn.net/upload/201512/14/1450093275_306813.jpg) ![图片说明](https://img-ask.csdn.net/upload/201512/15/1450154311_902355.jpg) Config.log如下: This file contains any messages produced by compilers while running configure, to aid debugging if configure makes a mistake. It was created by GNU MP configure 6.1.0, which was generated by GNU Autoconf 2.69. Invocation command line was $ ./configure CPPGLAGS=-D_USE_MINGW_ANSI_STDIO=0--enable-static --disable-shared --------- Platform. ## --------- hostname = Mr-Chen uname -m = i686 uname -r = 1.0.17(0.48/3/2) uname -s = MINGW32_NT-6.1 uname -v = 2011-04-24 23:39 /usr/bin/ uname -p = unknown /bin/ uname -X = unknown /bin/arch = unknown /usr/bin/arch -k = unknown /usr/convex/getsysinfo = unknown /usr/bin/hostinfo = unknown /bin/machine = unknown /usr/bin/oslevel = unknown /bin/universe = unknown PATH: . PATH: /usr/local/bin PATH: /mingw/bin PATH: /bin PATH: /d/ActivePerl/site/bin PATH: /d/ActivePerl/bin PATH: /c/Program Files (x86)/NVIDIA Corporation/PhysX/Common PATH: /c/Windows/system32 PATH: /c/Windows PATH: /c/Windows/System32/Wbem PATH: /c/Windows/System32/WindowsPowerShell/v1.0/ PATH: %QUARTUS_ROOTDIR%/bin PATH: /c/Program Files (x86)/Common Files/Ulead Systems/MPEG PATH: /c/Program Files (x86)/Microsoft SQL Server/80/Tools/Binn/ PATH: /d/Latex/CTEX/UserData/miktex/bin PATH: /d/Latex/CTEX/MiKTeX/miktex/bin PATH: /d/Latex/CTEX/CTeX/ctex/bin PATH: /d/Latex/CTEX/CTeX/cct/bin PATH: /d/Latex/CTEX/CTeX/ty/bin PATH: /d/Latex/CTEX/Ghostscript/gs9.05/bin PATH: /d/Latex/CTEX/GSview/gsview PATH: /d/Latex/CTEX/WinEdt PATH: /c/Program Files/Microsoft SQL Server/110/Tools/Binn/ PATH: /c/MinGW/bin/ PATH: /d/ActivePerl/site/bin/ PATH: /d/ActivePerl/bin/ PATH: /c/Program Files (x86)/Microsoft SQL Server/100/Tools/Binn/ PATH: /c/Program Files/Microsoft SQL Server/100/Tools/Binn/ PATH: /c/Program Files/Microsoft SQL Server/100/DTS/Binn/ PATH: /d/VS2010/VC/bin/ PATH: /d/MinGw/bin ----------- Core tests. ----------- configure:3055: checking build system type configure:3069: result: sandybridge-pc-mingw32 configure:3089: checking host system type configure:3102: result: sandybridge-pc-mingw32 configure:3139: checking for a BSD-compatible install configure:3207: result: /bin/install -c configure:3218: checking whether build environment is sane configure:3273: result: yes configure:3424: checking for a thread-safe mkdir -p configure:3463: result: /bin/mkdir -p configure:3470: checking for gawk configure:3486: found /bin/gawk configure:3497: result: gawk configure:3508: checking whether make sets $(MAKE) configure:3530: result: yes configure:3559: checking whether make supports nested variables configure:3576: result: yes configure:3705: checking whether to enable maintainer-specific portions of Makefiles configure:3714: result: no User: ABI= CC= CFLAGS=(unset) CPPFLAGS=(unset) MPN_PATH= GMP: abilist=64 x32 32 cclist=gcc icc cc configure:5749: gcc 2>&1 | grep xlc >/dev/null configure:5752: $? = 1 configure:5806: checking compiler gcc -O2 -pedantic -fomit-frame-pointer -m64 Test compile: configure:5820: gcc -O2 -pedantic -fomit-frame-pointer -m64 conftest.c >&5 conftest.c:1:0: sorry, unimplemented: 64-bit mode not compiled in configure:5823: $? = 1 failed program was: int main () { return 0; } configure:6909: result: no configure:5727: cc -c conftest.c >&5 configure:5730: $? = 0 configure:5733: checking whether cc is gcc configure:5735: result: yes configure:5749: cc 2>&1 | grep xlc >/dev/null configure:5752: $? = 1 configure:5806: checking compiler cc -O2 -pedantic -fomit-frame-pointer -m64 Test compile: configure:5820: cc -O2 -pedantic -fomit-frame-pointer -m64 conftest.c >&5 conftest.c:1:0: sorry, unimplemented: 64-bit mode not compiled in configure:5823: $? = 1 failed program was: int main () { return 0; } configure:6909: result: no configure:5749: gcc 2>&1 | grep xlc >/dev/null configure:5752: $? = 1 configure:5806: checking compiler gcc -O2 -pedantic -fomit-frame-pointer -mx32 Test compile: configure:5820: gcc -O2 -pedantic -fomit-frame-pointer -mx32 conftest.c >&5 cc1.exe: error: unrecognized command line option '-mx32' configure:5823: $? = 1 failed program was: int main () { return 0; } configure:6909: result: no configure:5727: cc -c conftest.c >&5 configure:5730: $? = 0 configure:5733: checking whether cc is gcc configure:5735: result: yes configure:5749: cc 2>&1 | grep xlc >/dev/null configure:5752: $? = 1 configure:5806: checking compiler cc -O2 -pedantic -fomit-frame-pointer -mx32 Test compile: configure:5820: cc -O2 -pedantic -fomit-frame-pointer -mx32 conftest.c >&5 cc1.exe: error: unrecognized command line option '-mx32' configure:5823: $? = 1 failed program was: int main () { return 0; } configure:6909: result: no configure:5749: gcc 2>&1 | grep xlc >/dev/null configure:5752: $? = 1 configure:5806: checking compiler gcc -m32 -O2 -pedantic -fomit-frame-pointer Test compile: configure:5820: gcc -m32 -O2 -pedantic -fomit-frame-pointer conftest.c >&5 configure:5823: $? = 0 configure:5828: ./a.out || ./b.out || ./a.exe || ./a_out.exe || ./conftest ./configure: line 5829: ./a.out: No such file or directory ./configure: line 5829: ./b.out: No such file or directory configure:5831: $? = 0 Test compile: function pointer return configure:5874: gcc -m32 -O2 -pedantic -fomit-frame-pointer conftest.c >&5 configure:5877: $? = 0 configure:5882: ./a.out || ./b.out || ./a.exe || ./a_out.exe || ./conftest ./configure: line 5883: ./a.out: No such file or directory ./configure: line 5883: ./b.out: No such file or directory configure:5885: $? = 0 Test compile: cmov instruction configure:5930: gcc -m32 -O2 -pedantic -fomit-frame-pointer conftest.c >&5 configure:5933: $? = 0 configure:5938: ./a.out || ./b.out || ./a.exe || ./a_out.exe || ./conftest ./configure: line 5939: ./a.out: No such file or directory ./configure: line 5939: ./b.out: No such file or directory configure:5941: $? = 0 Test compile: double -> ulong conversion configure:5987: gcc -m32 -O2 -pedantic -fomit-frame-pointer conftest.c >&5 configure:5990: $? = 0 configure:5995: ./a.out || ./b.out || ./a.exe || ./a_out.exe || ./conftest ./configure: line 5996: ./a.out: No such file or directory ./configure: line 5996: ./b.out: No such file or directory configure:5998: $? = 0 Test compile: double negation configure:6042: gcc -m32 -O2 -pedantic -fomit-frame-pointer conftest.c >&5 configure:6045: $? = 0 configure:6050: ./a.out || ./b.out || ./a.exe || ./a_out.exe || ./conftest ./configure: line 6051: ./a.out: No such file or directory ./configure: line 6051: ./b.out: No such file or directory configure:6053: $? = 0 Test compile: double -> float conversion configure:6098: gcc -m32 -O2 -pedantic -fomit-frame-pointer conftest.c >&5 configure:6101: $? = 0 configure:6106: ./a.out || ./b.out || ./a.exe || ./a_out.exe || ./conftest ./configure: line 6107: ./a.out: No such file or directory ./configure: line 6107: ./b.out: No such file or directory configure:6109: $? = 0 Test compile: gnupro alpha ev6 char spilling configure:6183: gcc -m32 -O2 -pedantic -fomit-frame-pointer conftest.c >&5 configure:6186: $? = 0 configure:6191: ./a.out || ./b.out || ./a.exe || ./a_out.exe || ./conftest ./configure: line 6192: ./a.out: No such file or directory ./configure: line 6192: ./b.out: No such file or directory configure:6194: $? = 0 Test compile: __builtin_alloca availability configure:6234: gcc -m32 -O2 -pedantic -fomit-frame-pointer conftest.c >&5 c:/mingw/bin/../lib/gcc/mingw32/4.6.2/../../../libmingw32.a(main.o): In function main': C:\MinGW\msys\1.0\src\mingwrt/../mingw/main.c:73: undefined reference toWinMain@16' collect2: ld returned 1 exit status configure:6237: $? = 1 failed program was: int k; int foo () { __builtin_alloca (k); } Test compile: abs int -> double conversion configure:6358: gcc -m32 -O2 -pedantic -fomit-frame-pointer conftest.c >&5 configure:6361: $? = 0 configure:6366: ./a.out || ./b.out || ./a.exe || ./a_out.exe || ./conftest ./configure: line 6367: ./a.out: No such file or directory ./configure: line 6367: ./b.out: No such file or directory configure:6369: $? = 0 Test compile: long long reliability test 1 configure:6423: gcc -m32 -O2 -pedantic -fomit-frame-pointer conftest.c >&5 conftest.c:6:23: warning: ISO C90 does not support 'long long' [-Wlong-long] configure:6426: $? = 0 configure:6431: ./a.out || ./b.out || ./a.exe || ./a_out.exe || ./conftest ./configure: line 6432: ./a.out: No such file or directory ./configure: line 6432: ./b.out: No such file or directory configure:6434: $? = 0 Test compile: long long reliability test 2 configure:6484: gcc -m32 -O2 -pedantic -fomit-frame-pointer conftest.c >&5 conftest.c: In function 'f': conftest.c:7:26: warning: ISO C90 does not support 'long long' [-Wlong-long] configure:6487: $? = 0 configure:6492: ./a.out || ./b.out || ./a.exe || ./a_out.exe || ./conftest ./configure: line 6493: ./a.out: No such file or directory ./configure: line 6493: ./b.out: No such file or directory configure:6495: $? = 0 Test compile: freebsd hacked gcc configure:6545: gcc -m32 -O2 -pedantic -fomit-frame-pointer conftest.c >&5 configure:6548: $? = 0 configure:6553: ./a.out || ./b.out || ./a.exe || ./a_out.exe || ./conftest ./configure: line 6554: ./a.out: No such file or directory ./configure: line 6554: ./b.out: No such file or directory configure:6556: $? = 0 Test compile: mpn_lshift_com optimization configure:6644: gcc -m32 -O2 -pedantic -fomit-frame-pointer conftest.c >&5 configure:6647: $? = 0 configure:6652: ./a.out || ./b.out || ./a.exe || ./a_out.exe || ./conftest ./configure: line 6653: ./a.out: No such file or directory ./configure: line 6653: ./b.out: No such file or directory configure:6655: $? = 0 Test compile: mpn_lshift_com optimization 2 configure:6752: gcc -m32 -O2 -pedantic -fomit-frame-pointer conftest.c >&5 configure:6755: $? = 0 configure:6760: ./a.out || ./b.out || ./a.exe || ./a_out.exe || ./conftest ./configure: line 6761: ./a.out: No such file or directory ./configure: line 6761: ./b.out: No such file or directory configure:6763: $? = 0 configure:6909: result: yes configure: testlist sizeof-long-4 configure:7084: checking compiler gcc -m32 -O2 -pedantic -fomit-frame-pointer has sizeof(long)==4 configure:7097: gcc -m32 -O2 -pedantic -fomit-frame-pointer -c conftest.c >&5 configure:7100: $? = 0 configure:7105: result: yes configure:7423: checking compiler gcc -m32 -O2 -pedantic -fomit-frame-pointer -mtune=sandybridge Test compile: configure:7437: gcc -m32 -O2 -pedantic -fomit-frame-pointer -mtune=sandybridge conftest.c >&5 conftest.c:1:0: error: bad value (sandybridge) for -mtune= switch configure:7440: $? = 1 failed program was: int main () { return 0; } configure:8526: result: no configure:7423: checking compiler gcc -m32 -O2 -pedantic -fomit-frame-pointer -mtune=corei7 Test compile: configure:7437: gcc -m32 -O2 -pedantic -fomit-frame-pointer -mtune=corei7 conftest.c >&5 configure:7440: $? = 0 configure:7445: ./a.out || ./b.out || ./a.exe || ./a_out.exe || ./conftest ./configure: line 7446: ./a.out: No such file or directory ./configure: line 7446: ./b.out: No such file or directory configure:7448: $? = 0 Test compile: function pointer return configure:7491: gcc -m32 -O2 -pedantic -fomit-frame-pointer -mtune=corei7 conftest.c >&5 configure:7494: $? = 0 configure:7499: ./a.out || ./b.out || ./a.exe || ./a_out.exe || ./conftest ./configure: line 7500: ./a.out: No such file or directory ./configure: line 7500: ./b.out: No such file or directory configure:7502: $? = 0 Test compile: cmov instruction configure:7547: gcc -m32 -O2 -pedantic -fomit-frame-pointer -mtune=corei7 conftest.c >&5 configure:7550: $? = 0 configure:7555: ./a.out || ./b.out || ./a.exe || ./a_out.exe || ./conftest ./configure: line 7556: ./a.out: No such file or directory ./configure: line 7556: ./b.out: No such file or directory configure:7558: $? = 0 Test compile: double -> ulong conversion configure:7604: gcc -m32 -O2 -pedantic -fomit-frame-pointer -mtune=corei7 conftest.c >&5 configure:7607: $? = 0 configure:7612: ./a.out || ./b.out || ./a.exe || ./a_out.exe || ./conftest ./configure: line 7613: ./a.out: No such file or directory ./configure: line 7613: ./b.out: No such file or directory configure:7615: $? = 0 Test compile: double negation configure:7659: gcc -m32 -O2 -pedantic -fomit-frame-pointer -mtune=corei7 conftest.c >&5 configure:7662: $? = 0 configure:7667: ./a.out || ./b.out || ./a.exe || ./a_out.exe || ./conftest ./configure: line 7668: ./a.out: No such file or directory ./configure: line 7668: ./b.out: No such file or directory configure:7670: $? = 0 Test compile: double -> float conversion configure:7715: gcc -m32 -O2 -pedantic -fomit-frame-pointer -mtune=corei7 conftest.c >&5 configure:7718: $? = 0 configure:7723: ./a.out || ./b.out || ./a.exe || ./a_out.exe || ./conftest ./configure: line 7724: ./a.out: No such file or directory ./configure: line 7724: ./b.out: No such file or directory configure:7726: $? = 0 Test compile: gnupro alpha ev6 char spilling configure:7800: gcc -m32 -O2 -pedantic -fomit-frame-pointer -mtune=corei7 conftest.c >&5 configure:7803: $? = 0 configure:7808: ./a.out || ./b.out || ./a.exe || ./a_out.exe || ./conftest ./configure: line 7809: ./a.out: No such file or directory ./configure: line 7809: ./b.out: No such file or directory configure:7811: $? = 0 Test compile: __builtin_alloca availability configure:7851: gcc -m32 -O2 -pedantic -fomit-frame-pointer -mtune=corei7 conftest.c >&5 c:/mingw/bin/../lib/gcc/mingw32/4.6.2/../../../libmingw32.a(main.o): In function main': C:\MinGW\msys\1.0\src\mingwrt/../mingw/main.c:73: undefined reference toWinMain@16' collect2: ld returned 1 exit status configure:7854: $? = 1 failed program was: int k; int foo () { __builtin_alloca (k); } Test compile: abs int -> double conversion configure:7975: gcc -m32 -O2 -pedantic -fomit-frame-pointer -mtune=corei7 conftest.c >&5 configure:7978: $? = 0 configure:7983: ./a.out || ./b.out || ./a.exe || ./a_out.exe || ./conftest ./configure: line 7984: ./a.out: No such file or directory ./configure: line 7984: ./b.out: No such file or directory configure:7986: $? = 0 Test compile: long long reliability test 1 configure:8040: gcc -m32 -O2 -pedantic -fomit-frame-pointer -mtune=corei7 conftest.c >&5 conftest.c:6:23: warning: ISO C90 does not support 'long long' [-Wlong-long] configure:8043: $? = 0 configure:8048: ./a.out || ./b.out || ./a.exe || ./a_out.exe || ./conftest ./configure: line 8049: ./a.out: No such file or directory ./configure: line 8049: ./b.out: No such file or directory configure:8051: $? = 0 Test compile: long long reliability test 2 configure:8101: gcc -m32 -O2 -pedantic -fomit-frame-pointer -mtune=corei7 conftest.c >&5 conftest.c: In function 'f': conftest.c:7:26: warning: ISO C90 does not support 'long long' [-Wlong-long] configure:8104: $? = 0 configure:8109: ./a.out || ./b.out || ./a.exe || ./a_out.exe || ./conftest ./configure: line 8110: ./a.out: No such file or directory ./configure: line 8110: ./b.out: No such file or directory configure:8112: $? = 0 Test compile: freebsd hacked gcc configure:8162: gcc -m32 -O2 -pedantic -fomit-frame-pointer -mtune=corei7 conftest.c >&5 configure:8165: $? = 0 configure:8170: ./a.out || ./b.out || ./a.exe || ./a_out.exe || ./conftest ./configure: line 8171: ./a.out: No such file or directory ./configure: line 8171: ./b.out: No such file or directory configure:8173: $? = 0 Test compile: mpn_lshift_com optimization configure:8261: gcc -m32 -O2 -pedantic -fomit-frame-pointer -mtune=corei7 conftest.c >&5 configure:8264: $? = 0 configure:8269: ./a.out || ./b.out || ./a.exe || ./a_out.exe || ./conftest ./configure: line 8270: ./a.out: No such file or directory ./configure: line 8270: ./b.out: No such file or directory configure:8272: $? = 0 Test compile: mpn_lshift_com optimization 2 configure:8369: gcc -m32 -O2 -pedantic -fomit-frame-pointer -mtune=corei7 conftest.c >&5 configure:8372: $? = 0 configure:8377: ./a.out || ./b.out || ./a.exe || ./a_out.exe || ./conftest ./configure: line 8378: ./a.out: No such file or directory ./configure: line 8378: ./b.out: No such file or directory configure:8380: $? = 0 configure:8526: result: yes configure:7423: checking compiler gcc -m32 -O2 -pedantic -fomit-frame-pointer -mtune=corei7 -march=sandybridge Test compile: configure:7437: gcc -m32 -O2 -pedantic -fomit-frame-pointer -mtune=corei7 -march=sandybridge conftest.c >&5 conftest.c:1:0: error: bad value (sandybridge) for -march= switch configure:7440: $? = 1 failed program was: int main () { return 0; } configure:8526: result: no configure:7423: checking compiler gcc -m32 -O2 -pedantic -fomit-frame-pointer -mtune=corei7 -march=corei7 Test compile: configure:7437: gcc -m32 -O2 -pedantic -fomit-frame-pointer -mtune=corei7 -march=corei7 conftest.c >&5 configure:7440: $? = 0 configure:7445: ./a.out || ./b.out || ./a.exe || ./a_out.exe || ./conftest ./configure: line 7446: ./a.out: No such file or directory ./configure: line 7446: ./b.out: No such file or directory configure:7448: $? = 0 Test compile: function pointer return configure:7491: gcc -m32 -O2 -pedantic -fomit-frame-pointer -mtune=corei7 -march=corei7 conftest.c >&5 configure:7494: $? = 0 configure:7499: ./a.out || ./b.out || ./a.exe || ./a_out.exe || ./conftest ./configure: line 7500: ./a.out: No such file or directory ./configure: line 7500: ./b.out: No such file or directory configure:7502: $? = 0 Test compile: cmov instruction configure:7547: gcc -m32 -O2 -pedantic -fomit-frame-pointer -mtune=corei7 -march=corei7 conftest.c >&5 configure:7550: $? = 0 configure:7555: ./a.out || ./b.out || ./a.exe || ./a_out.exe || ./conftest ./configure: line 7556: ./a.out: No such file or directory ./configure: line 7556: ./b.out: No such file or directory configure:7558: $? = 0 Test compile: double -> ulong conversion configure:7604: gcc -m32 -O2 -pedantic -fomit-frame-pointer -mtune=corei7 -march=corei7 conftest.c >&5 configure:7607: $? = 0 configure:7612: ./a.out || ./b.out || ./a.exe || ./a_out.exe || ./conftest ./configure: line 7613: ./a.out: No such file or directory ./configure: line 7613: ./b.out: No such file or directory configure:7615: $? = 0 Test compile: double negation configure:7659: gcc -m32 -O2 -pedantic -fomit-frame-pointer -mtune=corei7 -march=corei7 conftest.c >&5 configure:7662: $? = 0 configure:7667: ./a.out || ./b.out || ./a.exe || ./a_out.exe || ./conftest ./configure: line 7668: ./a.out: No such file or directory ./configure: line 7668: ./b.out: No such file or directory configure:7670: $? = 0 Test compile: double -> float conversion configure:7715: gcc -m32 -O2 -pedantic -fomit-frame-pointer -mtune=corei7 -march=corei7 conftest.c >&5 configure:7718: $? = 0 configure:7723: ./a.out || ./b.out || ./a.exe || ./a_out.exe || ./conftest ./configure: line 7724: ./a.out: No such file or directory ./configure: line 7724: ./b.out: No such file or directory configure:7726: $? = 0 Test compile: gnupro alpha ev6 char spilling configure:7800: gcc -m32 -O2 -pedantic -fomit-frame-pointer -mtune=corei7 -march=corei7 conftest.c >&5 configure:7803: $? = 0 configure:7808: ./a.out || ./b.out || ./a.exe || ./a_out.exe || ./conftest ./configure: line 7809: ./a.out: No such file or directory ./configure: line 7809: ./b.out: No such file or directory configure:7811: $? = 0 Test compile: __builtin_alloca availability configure:7851: gcc -m32 -O2 -pedantic -fomit-frame-pointer -mtune=corei7 -march=corei7 conftest.c >&5 c:/mingw/bin/../lib/gcc/mingw32/4.6.2/../../../libmingw32.a(main.o): In function main': C:\MinGW\msys\1.0\src\mingwrt/../mingw/main.c:73: undefined reference toWinMain@16' collect2: ld returned 1 exit status configure:7854: $? = 1 failed program was: int k; int foo () { __builtin_alloca (k); } Test compile: abs int -> double conversion configure:7975: gcc -m32 -O2 -pedantic -fomit-frame-pointer -mtune=corei7 -march=corei7 conftest.c >&5 configure:7978: $? = 0 configure:7983: ./a.out || ./b.out || ./a.exe || ./a_out.exe || ./conftest ./configure: line 7984: ./a.out: No such file or directory ./configure: line 7984: ./b.out: No such file or directory configure:7986: $? = 0 Test compile: long long reliability test 1 configure:8040: gcc -m32 -O2 -pedantic -fomit-frame-pointer -mtune=corei7 -march=corei7 conftest.c >&5 conftest.c:6:23: warning: ISO C90 does not support 'long long' [-Wlong-long] configure:8043: $? = 0 configure:8048: ./a.out || ./b.out || ./a.exe || ./a_out.exe || ./conftest ./configure: line 8049: ./a.out: No such file or directory ./configure: line 8049: ./b.out: No such file or directory configure:8051: $? = 0 Test compile: long long reliability test 2 configure:8101: gcc -m32 -O2 -pedantic -fomit-frame-pointer -mtune=corei7 -march=corei7 conftest.c >&5 conftest.c: In function 'f': conftest.c:7:26: warning: ISO C90 does not support 'long long' [-Wlong-long] configure:8104: $? = 0 configure:8109: ./a.out || ./b.out || ./a.exe || ./a_out.exe || ./conftest ./configure: line 8110: ./a.out: No such file or directory ./configure: line 8110: ./b.out: No such file or directory configure:8112: $? = 0 Test compile: freebsd hacked gcc configure:8162: gcc -m32 -O2 -pedantic -fomit-frame-pointer -mtune=corei7 -march=corei7 conftest.c >&5 configure:8165: $? = 0 configure:8170: ./a.out || ./b.out || ./a.exe || ./a_out.exe || ./conftest ./configure: line 8171: ./a.out: No such file or directory ./configure: line 8171: ./b.out: No such file or directory configure:8173: $? = 0 Test compile: mpn_lshift_com optimization configure:8261: gcc -m32 -O2 -pedantic -fomit-frame-pointer -mtune=corei7 -march=corei7 conftest.c >&5 configure:8264: $? = 0 configure:8269: ./a.out || ./b.out || ./a.exe || ./a_out.exe || ./conftest ./configure: line 8270: ./a.out: No such file or directory ./configure: line 8270: ./b.out: No such file or directory configure:8272: $? = 0 Test compile: mpn_lshift_com optimization 2 configure:8369: gcc -m32 -O2 -pedantic -fomit-frame-pointer -mtune=corei7 -march=corei7 conftest.c >&5 configure:8372: $? = 0 configure:8377: ./a.out || ./b.out || ./a.exe || ./a_out.exe || ./conftest ./configure: line 8378: ./a.out: No such file or directory ./configure: line 8378: ./b.out: No such file or directory configure:8380: $? = 0 configure:8526: result: yes configure:7423: checking compiler gcc -m32 -O2 -pedantic -fomit-frame-pointer -mtune=corei7 -march=corei7 -mno-cygwin Test compile: configure:7437: gcc -m32 -O2 -pedantic -fomit-frame-pointer -mtune=corei7 -march=corei7 -mno-cygwin conftest.c >&5 cc1.exe: error: unrecognized command line option '-mno-cygwin' configure:7440: $? = 1 failed program was: int main () { return 0; } configure:8526: result: no configure:8679: checking for gcc configure:8706: result: gcc configure:8935: checking for C compiler version configure:8944: gcc --version >&5 gcc.exe (GCC) 4.6.2 Copyright (C) 2011 Free Software Foundation, Inc. This is free software; see the source for copying conditions. There is NO warranty; not even for MERCHANTABILITY or FITNESS FOR A PARTICULAR PURPOSE. configure:8955: $? = 0 configure:8944: gcc -v >&5 Using built-in specs. COLLECT_GCC=c:\MinGW\bin\gcc.exe COLLECT_LTO_WRAPPER=c:/mingw/bin/../libexec/gcc/mingw32/4.6.2/lto-wrapper.exe Target: mingw32 Configured with: ../gcc-4.6.2/configure --enable-languages=c,c++,ada,fortran,objc,obj-c++ --disable-sjlj-exceptions --with-dwarf2 --enable-shared --enable-libgomp --disable-win32-registry --enable-libstdcxx-debug --enable-version-specific-runtime-libs --build=mingw32 --prefix=/mingw Thread model: win32 gcc version 4.6.2 (GCC) configure:8955: $? = 0 configure:8944: gcc -V >&5 gcc.exe: error: unrecognized option '-V' gcc.exe: fatal error: no input files compilation terminated. configure:8955: $? = 1 configure:8944: gcc -qversion >&5 gcc.exe: error: unrecognized option '-qversion' gcc.exe: fatal error: no input files compilation terminated. configure:8955: $? = 1 configure:8975: checking whether the C compiler works configure:8997: gcc -m32 -O2 -pedantic -fomit-frame-pointer -mtune=corei7 -march=corei7 D:\gmp-6.1.0 conftest.c >&5 c:/mingw/bin/../lib/gcc/mingw32/4.6.2/../../../../mingw32/bin/ld.exe: cannot find D:\gmp-6.1.0: Permission denied collect2: ld returned 1 exit status configure:9001: $? = 1 configure:9039: result: no configure: failed program was: | /* confdefs.h / | #define PACKAGE_NAME "GNU MP" | #define PACKAGE_TARNAME "gmp" | #define PACKAGE_VERSION "6.1.0" | #define PACKAGE_STRING "GNU MP 6.1.0" | #define PACKAGE_BUGREPORT "gmp-bugs@gmplib.org, see https://gmplib.org/manual/Reporting-Bugs.html" | #define PACKAGE_URL "http://www.gnu.org/software/gmp/" | #define PACKAGE "gmp" | #define VERSION "6.1.0" | #define WANT_ASSEMBLY 1 | #define WANT_FFT 1 | #define HAVE_HOST_CPU_sandybridge 1 | #define HOST_DOS64 1 | #define HAVE_SPEED_CYCLECOUNTER 2 | #define HAVE_CALLING_CONVENTIONS 1 | / end confdefs.h. */ | | int | main () | { | | ; | return 0; | } configure:9044: error: in /d/gmp-6.1.0': configure:9046: error: C compiler cannot create executables Seeconfig.log' for more details ---------------- Cache variables. ---------------- ac_cv_build=sandybridge-pc-mingw32 ac_cv_env_ABI_set= ac_cv_env_ABI_value= ac_cv_env_CCC_set= ac_cv_env_CCC_value= ac_cv_env_CC_FOR_BUILD_set= ac_cv_env_CC_FOR_BUILD_value= ac_cv_env_CC_set= ac_cv_env_CC_value= ac_cv_env_CFLAGS_set= ac_cv_env_CFLAGS_value= ac_cv_env_CPPFLAGS_set= ac_cv_env_CPPFLAGS_value= ac_cv_env_CPP_FOR_BUILD_set= ac_cv_env_CPP_FOR_BUILD_value= ac_cv_env_CPP_set= ac_cv_env_CPP_value= ac_cv_env_CXXCPP_set= ac_cv_env_CXXCPP_value= ac_cv_env_CXXFLAGS_set= ac_cv_env_CXXFLAGS_value= ac_cv_env_CXX_set= ac_cv_env_CXX_value= ac_cv_env_LDFLAGS_set=set ac_cv_env_LDFLAGS_value='D:\gmp-6.1.0' ac_cv_env_LIBS_set= ac_cv_env_LIBS_value= ac_cv_env_LT_SYS_LIBRARY_PATH_set= ac_cv_env_LT_SYS_LIBRARY_PATH_value= ac_cv_env_M4_set= ac_cv_env_M4_value= ac_cv_env_YACC_set= ac_cv_env_YACC_value= ac_cv_env_YFLAGS_set= ac_cv_env_YFLAGS_value= ac_cv_env_build_alias_set= ac_cv_env_build_alias_value= ac_cv_env_host_alias_set= ac_cv_env_host_alias_value= ac_cv_env_target_alias_set= ac_cv_env_target_alias_value= ac_cv_host=sandybridge-pc-mingw32 ac_cv_path_install='/bin/install -c' ac_cv_path_mkdir=/bin/mkdir ac_cv_prog_AWK=gawk ac_cv_prog_ac_ct_CC=gcc ac_cv_prog_make_make_set=yes am_cv_make_support_nested_variables=yes ----------------- Output variables. ----------------- ABI='32' ACLOCAL='${SHELL} /d/gmp-6.1.0/missing aclocal-1.15' AMTAR='$${TAR-tar}' AM_BACKSLASH='\' AM_DEFAULT_V='$(AM_DEFAULT_VERBOSITY)' AM_DEFAULT_VERBOSITY='1' AM_V='$(V)' AR='' AS='' ASMFLAGS='' AUTOCONF='${SHELL} /d/gmp-6.1.0/missing autoconf' AUTOHEADER='${SHELL} /d/gmp-6.1.0/missing autoheader' AUTOMAKE='${SHELL} /d/gmp-6.1.0/missing automake-1.15' AWK='gawk' CALLING_CONVENTIONS_OBJS='x86call.lo x86check$U.lo' CC='gcc' CCAS='' CC_FOR_BUILD='' CFLAGS='-m32 -O2 -pedantic -fomit-frame-pointer -mtune=corei7 -march=corei7' CPP='' CPPFLAGS='' CPP_FOR_BUILD='' CXX='' CXXCPP='' CXXFLAGS='' CYGPATH_W='echo' DEFN_LONG_LONG_LIMB='/* #undef LONG_LONG_LIMB */' DEFS='' DLLTOOL='' DSYMUTIL='' DUMPBIN='' ECHO_C='' ECHO_N='-n' ECHO_T='' EGREP='' ENABLE_STATIC_FALSE='' ENABLE_STATIC_TRUE='' EXEEXT='' EXEEXT_FOR_BUILD='' FGREP='' GMP_LDFLAGS='' GMP_LIMB_BITS='' GMP_NAIL_BITS='0' GREP='' HAVE_CLOCK_01='' HAVE_CPUTIME_01='' HAVE_GETRUSAGE_01='' HAVE_GETTIMEOFDAY_01='' HAVE_HOST_CPU_FAMILY_power='0' HAVE_HOST_CPU_FAMILY_powerpc='0' HAVE_SIGACTION_01='' HAVE_SIGALTSTACK_01='' HAVE_SIGSTACK_01='' HAVE_STACK_T_01='' HAVE_SYS_RESOURCE_H_01='' INSTALL_DATA='${INSTALL} -m 644' INSTALL_PROGRAM='${INSTALL}' INSTALL_SCRIPT='${INSTALL}' INSTALL_STRIP_PROGRAM='$(install_sh) -c -s' LD='' LDFLAGS='D:\gmp-6.1.0' LEX='' LEXLIB='' LEX_OUTPUT_ROOT='' LIBCURSES='' LIBGMPXX_LDFLAGS='' LIBGMP_DLL='' LIBGMP_LDFLAGS='' LIBM='' LIBM_FOR_BUILD='' LIBOBJS='' LIBREADLINE='' LIBS='' LIBTOOL='' LIPO='' LN_S='' LTLIBOBJS='' LT_SYS_LIBRARY_PATH='' M4='' MAINT='#' MAINTAINER_MODE_FALSE='' MAINTAINER_MODE_TRUE='#' MAKEINFO='${SHELL} /d/gmp-6.1.0/missing makeinfo' MANIFEST_TOOL='' MKDIR_P='/bin/mkdir -p' NM='' NMEDIT='' OBJDUMP='' OBJEXT='' OTOOL64='' OTOOL='' PACKAGE='gmp' PACKAGE_BUGREPORT='gmp-bugs@gmplib.org, see https://gmplib.org/manual/Reporting-Bugs.html' PACKAGE_NAME='GNU MP' PACKAGE_STRING='GNU MP 6.1.0' PACKAGE_TARNAME='gmp' PACKAGE_URL='http://www.gnu.org/software/gmp/' PACKAGE_VERSION='6.1.0' PATH_SEPARATOR=':' RANLIB='' SED='' SET_MAKE='' SHELL='/bin/sh' SPEED_CYCLECOUNTER_OBJ='pentium.lo' STRIP='' TAL_OBJECT='' TUNE_LIBS='' TUNE_SQR_OBJ='' U_FOR_BUILD='' VERSION='6.1.0' WANT_CXX_FALSE='' WANT_CXX_TRUE='' WITH_READLINE_01='' YACC='' YFLAGS='' ac_ct_AR='' ac_ct_CC='gcc' ac_ct_CXX='' ac_ct_DUMPBIN='' am_EXEEXT_FALSE='' am__EXEEXT_TRUE='' am__isrc='' am__leading_dot='.' am__tar='$${TAR-tar} chof - "$$tardir"' am__untar='$${TAR-tar} xf -' bindir='${exec_prefix}/bin' build='sandybridge-pc-mingw32' build_alias='' build_cpu='sandybridge' build_os='mingw32' build_vendor='pc' datadir='${datarootdir}' datarootdir='${prefix}/share' docdir='${datarootdir}/doc/${PACKAGE_TARNAME}' dvidir='${docdir}' exec_prefix='NONE' gmp_srclinks='' host='sandybridge-pc-mingw32' host_alias='' host_cpu='sandybridge' host_os='mingw32' host_vendor='pc' htmldir='${docdir}' includedir='${prefix}/include' infodir='${datarootdir}/info' install_sh='${SHELL} /d/gmp-6.1.0/install-sh' libdir='${exec_prefix}/lib' libexecdir='${exec_prefix}/libexec' localedir='${datarootdir}/locale' localstatedir='${prefix}/var' mandir='${datarootdir}/man' mkdir_p='$(MKDIR_P)' mpn_objects='' mpn_objs_in_libgmp='' oldincludedir='/usr/include' pdfdir='${docdir}' prefix='NONE' program_transform_name='s,x,x,' psdir='${docdir}' sbindir='${exec_prefix}/sbin' sharedstatedir='${prefix}/com' sysconfdir='${prefix}/etc' target_alias='' ----------- confdefs.h. ----------- /* confdefs.h */ #define PACKAGE_NAME "GNU MP" #define PACKAGE_TARNAME "gmp" #define PACKAGE_VERSION "6.1.0" #define PACKAGE_STRING "GNU MP 6.1.0" #define PACKAGE_BUGREPORT "gmp-bugs@gmplib.org, see https://gmplib.org/manual/Reporting-Bugs.html" #define PACKAGE_URL "http://www.gnu.org/software/gmp/" #define PACKAGE "gmp" #define VERSION "6.1.0" #define WANT_ASSEMBLY 1 #define WANT_FFT 1 #define HAVE_HOST_CPU_sandybridge 1 #define HOST_DOS64 1 #define HAVE_SPEED_CYCLECOUNTER 2 #define HAVE_CALLING_CONVENTIONS 1 configure: exit 77
利用mingw编译 thrift库
环境:windows7 下用QT开发,编译器为mingw。 状况:想通过mingw+msys编译Thrift库,通过msys执行./configuare命令,出现找不到sys/un.h等头文件的问题 百度的了解到这些事linux下面的文件,在mingw下面的sys头文件夹下面并没有这些头文件,像这种问题如何编译?谢谢
安装anaconda后输入conda info 报错求解
想问下这个administrator : false; offline mode : false是什么问题怎么解决. 并且输入python后显示是环境变量但未激活。并且安装后桌面找不到anaconda的图标。望大神救救我!!! active environment : base active env location : D:\anaconda shell level : 1 user config file : C:\Users\Katharine\.condarc populated config files : conda version : 4.7.10 conda-build version : 3.18.8 python version : 3.7.3.final.0 virtual packages : __cuda=10.0 base environment : D:\anaconda (writable) channel URLs : https://repo.anaconda.com/pkgs/main/win-64 https://repo.anaconda.com/pkgs/main/noarch https://repo.anaconda.com/pkgs/r/win-64 https://repo.anaconda.com/pkgs/r/noarch https://repo.anaconda.com/pkgs/msys2/win-64 https://repo.anaconda.com/pkgs/msys2/noarch package cache : D:\anaconda\pkgs C:\Users\Katharine\.conda\pkgs C:\Users\Katharine\AppData\Local\conda\conda\pkgs envs directories : D:\anaconda\envs C:\Users\Katharine\.conda\envs C:\Users\Katharine\AppData\Local\conda\conda\envs platform : win-64 user-agent : conda/4.7.10 requests/2.22.0 CPython/3.7.3 Windows/10 Windows/10.0.17134 administrator : False netrc file : None offline mode : False
MinGw编译GMP库时出错,跪求大神解答
![出错截图](https://img-ask.csdn.net/upload/201512/11/1449818918_325729.jpg) Config.log如下: This file contains any messages produced by compilers while running configure, to aid debugging if configure makes a mistake. It was created by GNU MP configure 6.1.0, which was generated by GNU Autoconf 2.69. Invocation command line was $ ./configure CPPGLAGS=-D_USE_MINGW_ANSI_STDIO=0--enable-static --disable-shared ## --------- ## ## Platform. ## ## --------- ## hostname = Mr-Chen uname -m = i686 uname -r = 1.0.17(0.48/3/2) uname -s = MINGW32_NT-6.1 uname -v = 2011-04-24 23:39 /usr/bin/ uname -p = unknown /bin/ uname -X = unknown /bin/arch = unknown /usr/bin/arch -k = unknown /usr/convex/getsysinfo = unknown /usr/bin/hostinfo = unknown /bin/machine = unknown /usr/bin/oslevel = unknown /bin/universe = unknown PATH: . PATH: /usr/local/bin PATH: /mingw/bin PATH: /bin PATH: /d/ActivePerl/site/bin PATH: /d/ActivePerl/bin PATH: /c/Program Files (x86)/NVIDIA Corporation/PhysX/Common PATH: /c/Windows/system32 PATH: /c/Windows PATH: /c/Windows/System32/Wbem PATH: /c/Windows/System32/WindowsPowerShell/v1.0/ PATH: %QUARTUS_ROOTDIR%/bin PATH: /c/Program Files (x86)/Common Files/Ulead Systems/MPEG PATH: /c/Program Files (x86)/Microsoft SQL Server/80/Tools/Binn/ PATH: /d/Latex/CTEX/UserData/miktex/bin PATH: /d/Latex/CTEX/MiKTeX/miktex/bin PATH: /d/Latex/CTEX/CTeX/ctex/bin PATH: /d/Latex/CTEX/CTeX/cct/bin PATH: /d/Latex/CTEX/CTeX/ty/bin PATH: /d/Latex/CTEX/Ghostscript/gs9.05/bin PATH: /d/Latex/CTEX/GSview/gsview PATH: /d/Latex/CTEX/WinEdt PATH: /c/Program Files/Microsoft SQL Server/110/Tools/Binn/ PATH: /c/MinGW/bin/ PATH: /d/ActivePerl/site/bin/ PATH: /d/ActivePerl/bin/ PATH: /c/Program Files (x86)/Microsoft SQL Server/100/Tools/Binn/ PATH: /c/Program Files/Microsoft SQL Server/100/Tools/Binn/ PATH: /c/Program Files/Microsoft SQL Server/100/DTS/Binn/ PATH: /d/VS2010/VC/bin/ PATH: /d/MinGw/bin ## ----------- ## ## Core tests. ## ## ----------- ## configure:3055: checking build system type configure:3069: result: sandybridge-pc-mingw32 configure:3089: checking host system type configure:3102: result: sandybridge-pc-mingw32 configure:3139: checking for a BSD-compatible install configure:3207: result: /bin/install -c configure:3218: checking whether build environment is sane configure:3273: result: yes configure:3424: checking for a thread-safe mkdir -p configure:3463: result: /bin/mkdir -p configure:3470: checking for gawk configure:3486: found /bin/gawk configure:3497: result: gawk configure:3508: checking whether make sets $(MAKE) configure:3530: result: yes configure:3559: checking whether make supports nested variables configure:3576: result: yes configure:3705: checking whether to enable maintainer-specific portions of Makefiles configure:3714: result: no User: ABI= CC= CFLAGS=(unset) CPPFLAGS=(unset) MPN_PATH= GMP: abilist=64 x32 32 cclist=gcc icc cc configure:5749: gcc 2>&1 | grep xlc >/dev/null configure:5752: $? = 1 configure:5806: checking compiler gcc -O2 -pedantic -fomit-frame-pointer -m64 Test compile: configure:5820: gcc -O2 -pedantic -fomit-frame-pointer -m64 conftest.c >&5 conftest.c:1:0: sorry, unimplemented: 64-bit mode not compiled in configure:5823: $? = 1 failed program was: int main () { return 0; } configure:6909: result: no configure:5727: cc -c conftest.c >&5 configure:5730: $? = 0 configure:5733: checking whether cc is gcc configure:5735: result: yes configure:5749: cc 2>&1 | grep xlc >/dev/null configure:5752: $? = 1 configure:5806: checking compiler cc -O2 -pedantic -fomit-frame-pointer -m64 Test compile: configure:5820: cc -O2 -pedantic -fomit-frame-pointer -m64 conftest.c >&5 conftest.c:1:0: sorry, unimplemented: 64-bit mode not compiled in configure:5823: $? = 1 failed program was: int main () { return 0; } configure:6909: result: no configure:5749: gcc 2>&1 | grep xlc >/dev/null configure:5752: $? = 1 configure:5806: checking compiler gcc -O2 -pedantic -fomit-frame-pointer -mx32 Test compile: configure:5820: gcc -O2 -pedantic -fomit-frame-pointer -mx32 conftest.c >&5 cc1.exe: error: unrecognized command line option '-mx32' configure:5823: $? = 1 failed program was: int main () { return 0; } configure:6909: result: no configure:5727: cc -c conftest.c >&5 configure:5730: $? = 0 configure:5733: checking whether cc is gcc configure:5735: result: yes configure:5749: cc 2>&1 | grep xlc >/dev/null configure:5752: $? = 1 configure:5806: checking compiler cc -O2 -pedantic -fomit-frame-pointer -mx32 Test compile: configure:5820: cc -O2 -pedantic -fomit-frame-pointer -mx32 conftest.c >&5 cc1.exe: error: unrecognized command line option '-mx32' configure:5823: $? = 1 failed program was: int main () { return 0; } configure:6909: result: no configure:5749: gcc 2>&1 | grep xlc >/dev/null configure:5752: $? = 1 configure:5806: checking compiler gcc -m32 -O2 -pedantic -fomit-frame-pointer Test compile: configure:5820: gcc -m32 -O2 -pedantic -fomit-frame-pointer conftest.c >&5 configure:5823: $? = 0 configure:5828: ./a.out || ./b.out || ./a.exe || ./a_out.exe || ./conftest ./configure: line 5829: ./a.out: No such file or directory ./configure: line 5829: ./b.out: No such file or directory configure:5831: $? = 0 Test compile: function pointer return configure:5874: gcc -m32 -O2 -pedantic -fomit-frame-pointer conftest.c >&5 configure:5877: $? = 0 configure:5882: ./a.out || ./b.out || ./a.exe || ./a_out.exe || ./conftest ./configure: line 5883: ./a.out: No such file or directory ./configure: line 5883: ./b.out: No such file or directory configure:5885: $? = 0 Test compile: cmov instruction configure:5930: gcc -m32 -O2 -pedantic -fomit-frame-pointer conftest.c >&5 configure:5933: $? = 0 configure:5938: ./a.out || ./b.out || ./a.exe || ./a_out.exe || ./conftest ./configure: line 5939: ./a.out: No such file or directory ./configure: line 5939: ./b.out: No such file or directory configure:5941: $? = 0 Test compile: double -> ulong conversion configure:5987: gcc -m32 -O2 -pedantic -fomit-frame-pointer conftest.c >&5 configure:5990: $? = 0 configure:5995: ./a.out || ./b.out || ./a.exe || ./a_out.exe || ./conftest ./configure: line 5996: ./a.out: No such file or directory ./configure: line 5996: ./b.out: No such file or directory configure:5998: $? = 0 Test compile: double negation configure:6042: gcc -m32 -O2 -pedantic -fomit-frame-pointer conftest.c >&5 configure:6045: $? = 0 configure:6050: ./a.out || ./b.out || ./a.exe || ./a_out.exe || ./conftest ./configure: line 6051: ./a.out: No such file or directory ./configure: line 6051: ./b.out: No such file or directory configure:6053: $? = 0 Test compile: double -> float conversion configure:6098: gcc -m32 -O2 -pedantic -fomit-frame-pointer conftest.c >&5 configure:6101: $? = 0 configure:6106: ./a.out || ./b.out || ./a.exe || ./a_out.exe || ./conftest ./configure: line 6107: ./a.out: No such file or directory ./configure: line 6107: ./b.out: No such file or directory configure:6109: $? = 0 Test compile: gnupro alpha ev6 char spilling configure:6183: gcc -m32 -O2 -pedantic -fomit-frame-pointer conftest.c >&5 configure:6186: $? = 0 configure:6191: ./a.out || ./b.out || ./a.exe || ./a_out.exe || ./conftest ./configure: line 6192: ./a.out: No such file or directory ./configure: line 6192: ./b.out: No such file or directory configure:6194: $? = 0 Test compile: __builtin_alloca availability configure:6234: gcc -m32 -O2 -pedantic -fomit-frame-pointer conftest.c >&5 c:/mingw/bin/../lib/gcc/mingw32/4.6.2/../../../libmingw32.a(main.o): In function `main': C:\MinGW\msys\1.0\src\mingwrt/../mingw/main.c:73: undefined reference to `WinMain@16' collect2: ld returned 1 exit status configure:6237: $? = 1 failed program was: int k; int foo () { __builtin_alloca (k); } Test compile: abs int -> double conversion configure:6358: gcc -m32 -O2 -pedantic -fomit-frame-pointer conftest.c >&5 configure:6361: $? = 0 configure:6366: ./a.out || ./b.out || ./a.exe || ./a_out.exe || ./conftest ./configure: line 6367: ./a.out: No such file or directory ./configure: line 6367: ./b.out: No such file or directory configure:6369: $? = 0 Test compile: long long reliability test 1 configure:6423: gcc -m32 -O2 -pedantic -fomit-frame-pointer conftest.c >&5 conftest.c:6:23: warning: ISO C90 does not support 'long long' [-Wlong-long] configure:6426: $? = 0 configure:6431: ./a.out || ./b.out || ./a.exe || ./a_out.exe || ./conftest ./configure: line 6432: ./a.out: No such file or directory ./configure: line 6432: ./b.out: No such file or directory configure:6434: $? = 0 Test compile: long long reliability test 2 configure:6484: gcc -m32 -O2 -pedantic -fomit-frame-pointer conftest.c >&5 conftest.c: In function 'f': conftest.c:7:26: warning: ISO C90 does not support 'long long' [-Wlong-long] configure:6487: $? = 0 configure:6492: ./a.out || ./b.out || ./a.exe || ./a_out.exe || ./conftest ./configure: line 6493: ./a.out: No such file or directory ./configure: line 6493: ./b.out: No such file or directory configure:6495: $? = 0 Test compile: freebsd hacked gcc configure:6545: gcc -m32 -O2 -pedantic -fomit-frame-pointer conftest.c >&5 configure:6548: $? = 0 configure:6553: ./a.out || ./b.out || ./a.exe || ./a_out.exe || ./conftest ./configure: line 6554: ./a.out: No such file or directory ./configure: line 6554: ./b.out: No such file or directory configure:6556: $? = 0 Test compile: mpn_lshift_com optimization configure:6644: gcc -m32 -O2 -pedantic -fomit-frame-pointer conftest.c >&5 configure:6647: $? = 0 configure:6652: ./a.out || ./b.out || ./a.exe || ./a_out.exe || ./conftest ./configure: line 6653: ./a.out: No such file or directory ./configure: line 6653: ./b.out: No such file or directory configure:6655: $? = 0 Test compile: mpn_lshift_com optimization 2 configure:6752: gcc -m32 -O2 -pedantic -fomit-frame-pointer conftest.c >&5 configure:6755: $? = 0 configure:6760: ./a.out || ./b.out || ./a.exe || ./a_out.exe || ./conftest ./configure: line 6761: ./a.out: No such file or directory ./configure: line 6761: ./b.out: No such file or directory configure:6763: $? = 0 configure:6909: result: yes configure: testlist sizeof-long-4 configure:7084: checking compiler gcc -m32 -O2 -pedantic -fomit-frame-pointer has sizeof(long)==4 configure:7097: gcc -m32 -O2 -pedantic -fomit-frame-pointer -c conftest.c >&5 configure:7100: $? = 0 configure:7105: result: yes configure:7423: checking compiler gcc -m32 -O2 -pedantic -fomit-frame-pointer -mtune=sandybridge Test compile: configure:7437: gcc -m32 -O2 -pedantic -fomit-frame-pointer -mtune=sandybridge conftest.c >&5 conftest.c:1:0: error: bad value (sandybridge) for -mtune= switch configure:7440: $? = 1 failed program was: int main () { return 0; } configure:8526: result: no configure:7423: checking compiler gcc -m32 -O2 -pedantic -fomit-frame-pointer -mtune=corei7 Test compile: configure:7437: gcc -m32 -O2 -pedantic -fomit-frame-pointer -mtune=corei7 conftest.c >&5 configure:7440: $? = 0 configure:7445: ./a.out || ./b.out || ./a.exe || ./a_out.exe || ./conftest ./configure: line 7446: ./a.out: No such file or directory ./configure: line 7446: ./b.out: No such file or directory configure:7448: $? = 0 Test compile: function pointer return configure:7491: gcc -m32 -O2 -pedantic -fomit-frame-pointer -mtune=corei7 conftest.c >&5 configure:7494: $? = 0 configure:7499: ./a.out || ./b.out || ./a.exe || ./a_out.exe || ./conftest ./configure: line 7500: ./a.out: No such file or directory ./configure: line 7500: ./b.out: No such file or directory configure:7502: $? = 0 Test compile: cmov instruction configure:7547: gcc -m32 -O2 -pedantic -fomit-frame-pointer -mtune=corei7 conftest.c >&5 configure:7550: $? = 0 configure:7555: ./a.out || ./b.out || ./a.exe || ./a_out.exe || ./conftest ./configure: line 7556: ./a.out: No such file or directory ./configure: line 7556: ./b.out: No such file or directory configure:7558: $? = 0 Test compile: double -> ulong conversion configure:7604: gcc -m32 -O2 -pedantic -fomit-frame-pointer -mtune=corei7 conftest.c >&5 configure:7607: $? = 0 configure:7612: ./a.out || ./b.out || ./a.exe || ./a_out.exe || ./conftest ./configure: line 7613: ./a.out: No such file or directory ./configure: line 7613: ./b.out: No such file or directory configure:7615: $? = 0 Test compile: double negation configure:7659: gcc -m32 -O2 -pedantic -fomit-frame-pointer -mtune=corei7 conftest.c >&5 configure:7662: $? = 0 configure:7667: ./a.out || ./b.out || ./a.exe || ./a_out.exe || ./conftest ./configure: line 7668: ./a.out: No such file or directory ./configure: line 7668: ./b.out: No such file or directory configure:7670: $? = 0 Test compile: double -> float conversion configure:7715: gcc -m32 -O2 -pedantic -fomit-frame-pointer -mtune=corei7 conftest.c >&5 configure:7718: $? = 0 configure:7723: ./a.out || ./b.out || ./a.exe || ./a_out.exe || ./conftest ./configure: line 7724: ./a.out: No such file or directory ./configure: line 7724: ./b.out: No such file or directory configure:7726: $? = 0 Test compile: gnupro alpha ev6 char spilling configure:7800: gcc -m32 -O2 -pedantic -fomit-frame-pointer -mtune=corei7 conftest.c >&5 configure:7803: $? = 0 configure:7808: ./a.out || ./b.out || ./a.exe || ./a_out.exe || ./conftest ./configure: line 7809: ./a.out: No such file or directory ./configure: line 7809: ./b.out: No such file or directory configure:7811: $? = 0 Test compile: __builtin_alloca availability configure:7851: gcc -m32 -O2 -pedantic -fomit-frame-pointer -mtune=corei7 conftest.c >&5 c:/mingw/bin/../lib/gcc/mingw32/4.6.2/../../../libmingw32.a(main.o): In function `main': C:\MinGW\msys\1.0\src\mingwrt/../mingw/main.c:73: undefined reference to `WinMain@16' collect2: ld returned 1 exit status configure:7854: $? = 1 failed program was: int k; int foo () { __builtin_alloca (k); } Test compile: abs int -> double conversion configure:7975: gcc -m32 -O2 -pedantic -fomit-frame-pointer -mtune=corei7 conftest.c >&5 configure:7978: $? = 0 configure:7983: ./a.out || ./b.out || ./a.exe || ./a_out.exe || ./conftest ./configure: line 7984: ./a.out: No such file or directory ./configure: line 7984: ./b.out: No such file or directory configure:7986: $? = 0 Test compile: long long reliability test 1 configure:8040: gcc -m32 -O2 -pedantic -fomit-frame-pointer -mtune=corei7 conftest.c >&5 conftest.c:6:23: warning: ISO C90 does not support 'long long' [-Wlong-long] configure:8043: $? = 0 configure:8048: ./a.out || ./b.out || ./a.exe || ./a_out.exe || ./conftest ./configure: line 8049: ./a.out: No such file or directory ./configure: line 8049: ./b.out: No such file or directory configure:8051: $? = 0 Test compile: long long reliability test 2 configure:8101: gcc -m32 -O2 -pedantic -fomit-frame-pointer -mtune=corei7 conftest.c >&5 conftest.c: In function 'f': conftest.c:7:26: warning: ISO C90 does not support 'long long' [-Wlong-long] configure:8104: $? = 0 configure:8109: ./a.out || ./b.out || ./a.exe || ./a_out.exe || ./conftest ./configure: line 8110: ./a.out: No such file or directory ./configure: line 8110: ./b.out: No such file or directory configure:8112: $? = 0 Test compile: freebsd hacked gcc configure:8162: gcc -m32 -O2 -pedantic -fomit-frame-pointer -mtune=corei7 conftest.c >&5 configure:8165: $? = 0 configure:8170: ./a.out || ./b.out || ./a.exe || ./a_out.exe || ./conftest ./configure: line 8171: ./a.out: No such file or directory ./configure: line 8171: ./b.out: No such file or directory configure:8173: $? = 0 Test compile: mpn_lshift_com optimization configure:8261: gcc -m32 -O2 -pedantic -fomit-frame-pointer -mtune=corei7 conftest.c >&5 configure:8264: $? = 0 configure:8269: ./a.out || ./b.out || ./a.exe || ./a_out.exe || ./conftest ./configure: line 8270: ./a.out: No such file or directory ./configure: line 8270: ./b.out: No such file or directory configure:8272: $? = 0 Test compile: mpn_lshift_com optimization 2 configure:8369: gcc -m32 -O2 -pedantic -fomit-frame-pointer -mtune=corei7 conftest.c >&5 configure:8372: $? = 0 configure:8377: ./a.out || ./b.out || ./a.exe || ./a_out.exe || ./conftest ./configure: line 8378: ./a.out: No such file or directory ./configure: line 8378: ./b.out: No such file or directory configure:8380: $? = 0 configure:8526: result: yes configure:7423: checking compiler gcc -m32 -O2 -pedantic -fomit-frame-pointer -mtune=corei7 -march=sandybridge Test compile: configure:7437: gcc -m32 -O2 -pedantic -fomit-frame-pointer -mtune=corei7 -march=sandybridge conftest.c >&5 conftest.c:1:0: error: bad value (sandybridge) for -march= switch configure:7440: $? = 1 failed program was: int main () { return 0; } configure:8526: result: no configure:7423: checking compiler gcc -m32 -O2 -pedantic -fomit-frame-pointer -mtune=corei7 -march=corei7 Test compile: configure:7437: gcc -m32 -O2 -pedantic -fomit-frame-pointer -mtune=corei7 -march=corei7 conftest.c >&5 configure:7440: $? = 0 configure:7445: ./a.out || ./b.out || ./a.exe || ./a_out.exe || ./conftest ./configure: line 7446: ./a.out: No such file or directory ./configure: line 7446: ./b.out: No such file or directory configure:7448: $? = 0 Test compile: function pointer return configure:7491: gcc -m32 -O2 -pedantic -fomit-frame-pointer -mtune=corei7 -march=corei7 conftest.c >&5 configure:7494: $? = 0 configure:7499: ./a.out || ./b.out || ./a.exe || ./a_out.exe || ./conftest ./configure: line 7500: ./a.out: No such file or directory ./configure: line 7500: ./b.out: No such file or directory configure:7502: $? = 0 Test compile: cmov instruction configure:7547: gcc -m32 -O2 -pedantic -fomit-frame-pointer -mtune=corei7 -march=corei7 conftest.c >&5 configure:7550: $? = 0 configure:7555: ./a.out || ./b.out || ./a.exe || ./a_out.exe || ./conftest ./configure: line 7556: ./a.out: No such file or directory ./configure: line 7556: ./b.out: No such file or directory configure:7558: $? = 0 Test compile: double -> ulong conversion configure:7604: gcc -m32 -O2 -pedantic -fomit-frame-pointer -mtune=corei7 -march=corei7 conftest.c >&5 configure:7607: $? = 0 configure:7612: ./a.out || ./b.out || ./a.exe || ./a_out.exe || ./conftest ./configure: line 7613: ./a.out: No such file or directory ./configure: line 7613: ./b.out: No such file or directory configure:7615: $? = 0 Test compile: double negation configure:7659: gcc -m32 -O2 -pedantic -fomit-frame-pointer -mtune=corei7 -march=corei7 conftest.c >&5 configure:7662: $? = 0 configure:7667: ./a.out || ./b.out || ./a.exe || ./a_out.exe || ./conftest ./configure: line 7668: ./a.out: No such file or directory ./configure: line 7668: ./b.out: No such file or directory configure:7670: $? = 0 Test compile: double -> float conversion configure:7715: gcc -m32 -O2 -pedantic -fomit-frame-pointer -mtune=corei7 -march=corei7 conftest.c >&5 configure:7718: $? = 0 configure:7723: ./a.out || ./b.out || ./a.exe || ./a_out.exe || ./conftest ./configure: line 7724: ./a.out: No such file or directory ./configure: line 7724: ./b.out: No such file or directory configure:7726: $? = 0 Test compile: gnupro alpha ev6 char spilling configure:7800: gcc -m32 -O2 -pedantic -fomit-frame-pointer -mtune=corei7 -march=corei7 conftest.c >&5 configure:7803: $? = 0 configure:7808: ./a.out || ./b.out || ./a.exe || ./a_out.exe || ./conftest ./configure: line 7809: ./a.out: No such file or directory ./configure: line 7809: ./b.out: No such file or directory configure:7811: $? = 0 Test compile: __builtin_alloca availability configure:7851: gcc -m32 -O2 -pedantic -fomit-frame-pointer -mtune=corei7 -march=corei7 conftest.c >&5 c:/mingw/bin/../lib/gcc/mingw32/4.6.2/../../../libmingw32.a(main.o): In function `main': C:\MinGW\msys\1.0\src\mingwrt/../mingw/main.c:73: undefined reference to `WinMain@16' collect2: ld returned 1 exit status configure:7854: $? = 1 failed program was: int k; int foo () { __builtin_alloca (k); } Test compile: abs int -> double conversion configure:7975: gcc -m32 -O2 -pedantic -fomit-frame-pointer -mtune=corei7 -march=corei7 conftest.c >&5 configure:7978: $? = 0 configure:7983: ./a.out || ./b.out || ./a.exe || ./a_out.exe || ./conftest ./configure: line 7984: ./a.out: No such file or directory ./configure: line 7984: ./b.out: No such file or directory configure:7986: $? = 0 Test compile: long long reliability test 1 configure:8040: gcc -m32 -O2 -pedantic -fomit-frame-pointer -mtune=corei7 -march=corei7 conftest.c >&5 conftest.c:6:23: warning: ISO C90 does not support 'long long' [-Wlong-long] configure:8043: $? = 0 configure:8048: ./a.out || ./b.out || ./a.exe || ./a_out.exe || ./conftest ./configure: line 8049: ./a.out: No such file or directory ./configure: line 8049: ./b.out: No such file or directory configure:8051: $? = 0 Test compile: long long reliability test 2 configure:8101: gcc -m32 -O2 -pedantic -fomit-frame-pointer -mtune=corei7 -march=corei7 conftest.c >&5 conftest.c: In function 'f': conftest.c:7:26: warning: ISO C90 does not support 'long long' [-Wlong-long] configure:8104: $? = 0 configure:8109: ./a.out || ./b.out || ./a.exe || ./a_out.exe || ./conftest ./configure: line 8110: ./a.out: No such file or directory ./configure: line 8110: ./b.out: No such file or directory configure:8112: $? = 0 Test compile: freebsd hacked gcc configure:8162: gcc -m32 -O2 -pedantic -fomit-frame-pointer -mtune=corei7 -march=corei7 conftest.c >&5 configure:8165: $? = 0 configure:8170: ./a.out || ./b.out || ./a.exe || ./a_out.exe || ./conftest ./configure: line 8171: ./a.out: No such file or directory ./configure: line 8171: ./b.out: No such file or directory configure:8173: $? = 0 Test compile: mpn_lshift_com optimization configure:8261: gcc -m32 -O2 -pedantic -fomit-frame-pointer -mtune=corei7 -march=corei7 conftest.c >&5 configure:8264: $? = 0 configure:8269: ./a.out || ./b.out || ./a.exe || ./a_out.exe || ./conftest ./configure: line 8270: ./a.out: No such file or directory ./configure: line 8270: ./b.out: No such file or directory configure:8272: $? = 0 Test compile: mpn_lshift_com optimization 2 configure:8369: gcc -m32 -O2 -pedantic -fomit-frame-pointer -mtune=corei7 -march=corei7 conftest.c >&5 configure:8372: $? = 0 configure:8377: ./a.out || ./b.out || ./a.exe || ./a_out.exe || ./conftest ./configure: line 8378: ./a.out: No such file or directory ./configure: line 8378: ./b.out: No such file or directory configure:8380: $? = 0 configure:8526: result: yes configure:7423: checking compiler gcc -m32 -O2 -pedantic -fomit-frame-pointer -mtune=corei7 -march=corei7 -mno-cygwin Test compile: configure:7437: gcc -m32 -O2 -pedantic -fomit-frame-pointer -mtune=corei7 -march=corei7 -mno-cygwin conftest.c >&5 cc1.exe: error: unrecognized command line option '-mno-cygwin' configure:7440: $? = 1 failed program was: int main () { return 0; } configure:8526: result: no configure:8679: checking for gcc configure:8706: result: gcc configure:8935: checking for C compiler version configure:8944: gcc --version >&5 gcc.exe (GCC) 4.6.2 Copyright (C) 2011 Free Software Foundation, Inc. This is free software; see the source for copying conditions. There is NO warranty; not even for MERCHANTABILITY or FITNESS FOR A PARTICULAR PURPOSE. configure:8955: $? = 0 configure:8944: gcc -v >&5 Using built-in specs. COLLECT_GCC=c:\MinGW\bin\gcc.exe COLLECT_LTO_WRAPPER=c:/mingw/bin/../libexec/gcc/mingw32/4.6.2/lto-wrapper.exe Target: mingw32 Configured with: ../gcc-4.6.2/configure --enable-languages=c,c++,ada,fortran,objc,obj-c++ --disable-sjlj-exceptions --with-dwarf2 --enable-shared --enable-libgomp --disable-win32-registry --enable-libstdcxx-debug --enable-version-specific-runtime-libs --build=mingw32 --prefix=/mingw Thread model: win32 gcc version 4.6.2 (GCC) configure:8955: $? = 0 configure:8944: gcc -V >&5 gcc.exe: error: unrecognized option '-V' gcc.exe: fatal error: no input files compilation terminated. configure:8955: $? = 1 configure:8944: gcc -qversion >&5 gcc.exe: error: unrecognized option '-qversion' gcc.exe: fatal error: no input files compilation terminated. configure:8955: $? = 1 configure:8975: checking whether the C compiler works configure:8997: gcc -m32 -O2 -pedantic -fomit-frame-pointer -mtune=corei7 -march=corei7 D:\gmp-6.1.0 conftest.c >&5 c:/mingw/bin/../lib/gcc/mingw32/4.6.2/../../../../mingw32/bin/ld.exe: cannot find D:\gmp-6.1.0: Permission denied collect2: ld returned 1 exit status configure:9001: $? = 1 configure:9039: result: no configure: failed program was: | /* confdefs.h */ | #define PACKAGE_NAME "GNU MP" | #define PACKAGE_TARNAME "gmp" | #define PACKAGE_VERSION "6.1.0" | #define PACKAGE_STRING "GNU MP 6.1.0" | #define PACKAGE_BUGREPORT "gmp-bugs@gmplib.org, see https://gmplib.org/manual/Reporting-Bugs.html" | #define PACKAGE_URL "http://www.gnu.org/software/gmp/" | #define PACKAGE "gmp" | #define VERSION "6.1.0" | #define WANT_ASSEMBLY 1 | #define WANT_FFT 1 | #define HAVE_HOST_CPU_sandybridge 1 | #define HOST_DOS64 1 | #define HAVE_SPEED_CYCLECOUNTER 2 | #define HAVE_CALLING_CONVENTIONS 1 | /* end confdefs.h. */ | | int | main () | { | | ; | return 0; | } configure:9044: error: in `/d/gmp-6.1.0': configure:9046: error: C compiler cannot create executables See `config.log' for more details ## ---------------- ## ## Cache variables. ## ## ---------------- ## ac_cv_build=sandybridge-pc-mingw32 ac_cv_env_ABI_set= ac_cv_env_ABI_value= ac_cv_env_CCC_set= ac_cv_env_CCC_value= ac_cv_env_CC_FOR_BUILD_set= ac_cv_env_CC_FOR_BUILD_value= ac_cv_env_CC_set= ac_cv_env_CC_value= ac_cv_env_CFLAGS_set= ac_cv_env_CFLAGS_value= ac_cv_env_CPPFLAGS_set= ac_cv_env_CPPFLAGS_value= ac_cv_env_CPP_FOR_BUILD_set= ac_cv_env_CPP_FOR_BUILD_value= ac_cv_env_CPP_set= ac_cv_env_CPP_value= ac_cv_env_CXXCPP_set= ac_cv_env_CXXCPP_value= ac_cv_env_CXXFLAGS_set= ac_cv_env_CXXFLAGS_value= ac_cv_env_CXX_set= ac_cv_env_CXX_value= ac_cv_env_LDFLAGS_set=set ac_cv_env_LDFLAGS_value='D:\gmp-6.1.0' ac_cv_env_LIBS_set= ac_cv_env_LIBS_value= ac_cv_env_LT_SYS_LIBRARY_PATH_set= ac_cv_env_LT_SYS_LIBRARY_PATH_value= ac_cv_env_M4_set= ac_cv_env_M4_value= ac_cv_env_YACC_set= ac_cv_env_YACC_value= ac_cv_env_YFLAGS_set= ac_cv_env_YFLAGS_value= ac_cv_env_build_alias_set= ac_cv_env_build_alias_value= ac_cv_env_host_alias_set= ac_cv_env_host_alias_value= ac_cv_env_target_alias_set= ac_cv_env_target_alias_value= ac_cv_host=sandybridge-pc-mingw32 ac_cv_path_install='/bin/install -c' ac_cv_path_mkdir=/bin/mkdir ac_cv_prog_AWK=gawk ac_cv_prog_ac_ct_CC=gcc ac_cv_prog_make_make_set=yes am_cv_make_support_nested_variables=yes ## ----------------- ## ## Output variables. ## ## ----------------- ## ABI='32' ACLOCAL='${SHELL} /d/gmp-6.1.0/missing aclocal-1.15' AMTAR='$${TAR-tar}' AM_BACKSLASH='\' AM_DEFAULT_V='$(AM_DEFAULT_VERBOSITY)' AM_DEFAULT_VERBOSITY='1' AM_V='$(V)' AR='' AS='' ASMFLAGS='' AUTOCONF='${SHELL} /d/gmp-6.1.0/missing autoconf' AUTOHEADER='${SHELL} /d/gmp-6.1.0/missing autoheader' AUTOMAKE='${SHELL} /d/gmp-6.1.0/missing automake-1.15' AWK='gawk' CALLING_CONVENTIONS_OBJS='x86call.lo x86check$U.lo' CC='gcc' CCAS='' CC_FOR_BUILD='' CFLAGS='-m32 -O2 -pedantic -fomit-frame-pointer -mtune=corei7 -march=corei7' CPP='' CPPFLAGS='' CPP_FOR_BUILD='' CXX='' CXXCPP='' CXXFLAGS='' CYGPATH_W='echo' DEFN_LONG_LONG_LIMB='/* #undef _LONG_LONG_LIMB */' DEFS='' DLLTOOL='' DSYMUTIL='' DUMPBIN='' ECHO_C='' ECHO_N='-n' ECHO_T='' EGREP='' ENABLE_STATIC_FALSE='' ENABLE_STATIC_TRUE='' EXEEXT='' EXEEXT_FOR_BUILD='' FGREP='' GMP_LDFLAGS='' GMP_LIMB_BITS='' GMP_NAIL_BITS='0' GREP='' HAVE_CLOCK_01='' HAVE_CPUTIME_01='' HAVE_GETRUSAGE_01='' HAVE_GETTIMEOFDAY_01='' HAVE_HOST_CPU_FAMILY_power='0' HAVE_HOST_CPU_FAMILY_powerpc='0' HAVE_SIGACTION_01='' HAVE_SIGALTSTACK_01='' HAVE_SIGSTACK_01='' HAVE_STACK_T_01='' HAVE_SYS_RESOURCE_H_01='' INSTALL_DATA='${INSTALL} -m 644' INSTALL_PROGRAM='${INSTALL}' INSTALL_SCRIPT='${INSTALL}' INSTALL_STRIP_PROGRAM='$(install_sh) -c -s' LD='' LDFLAGS='D:\gmp-6.1.0' LEX='' LEXLIB='' LEX_OUTPUT_ROOT='' LIBCURSES='' LIBGMPXX_LDFLAGS='' LIBGMP_DLL='' LIBGMP_LDFLAGS='' LIBM='' LIBM_FOR_BUILD='' LIBOBJS='' LIBREADLINE='' LIBS='' LIBTOOL='' LIPO='' LN_S='' LTLIBOBJS='' LT_SYS_LIBRARY_PATH='' M4='' MAINT='#' MAINTAINER_MODE_FALSE='' MAINTAINER_MODE_TRUE='#' MAKEINFO='${SHELL} /d/gmp-6.1.0/missing makeinfo' MANIFEST_TOOL='' MKDIR_P='/bin/mkdir -p' NM='' NMEDIT='' OBJDUMP='' OBJEXT='' OTOOL64='' OTOOL='' PACKAGE='gmp' PACKAGE_BUGREPORT='gmp-bugs@gmplib.org, see https://gmplib.org/manual/Reporting-Bugs.html' PACKAGE_NAME='GNU MP' PACKAGE_STRING='GNU MP 6.1.0' PACKAGE_TARNAME='gmp' PACKAGE_URL='http://www.gnu.org/software/gmp/' PACKAGE_VERSION='6.1.0' PATH_SEPARATOR=':' RANLIB='' SED='' SET_MAKE='' SHELL='/bin/sh' SPEED_CYCLECOUNTER_OBJ='pentium.lo' STRIP='' TAL_OBJECT='' TUNE_LIBS='' TUNE_SQR_OBJ='' U_FOR_BUILD='' VERSION='6.1.0' WANT_CXX_FALSE='' WANT_CXX_TRUE='' WITH_READLINE_01='' YACC='' YFLAGS='' ac_ct_AR='' ac_ct_CC='gcc' ac_ct_CXX='' ac_ct_DUMPBIN='' am__EXEEXT_FALSE='' am__EXEEXT_TRUE='' am__isrc='' am__leading_dot='.' am__tar='$${TAR-tar} chof - "$$tardir"' am__untar='$${TAR-tar} xf -' bindir='${exec_prefix}/bin' build='sandybridge-pc-mingw32' build_alias='' build_cpu='sandybridge' build_os='mingw32' build_vendor='pc' datadir='${datarootdir}' datarootdir='${prefix}/share' docdir='${datarootdir}/doc/${PACKAGE_TARNAME}' dvidir='${docdir}' exec_prefix='NONE' gmp_srclinks='' host='sandybridge-pc-mingw32' host_alias='' host_cpu='sandybridge' host_os='mingw32' host_vendor='pc' htmldir='${docdir}' includedir='${prefix}/include' infodir='${datarootdir}/info' install_sh='${SHELL} /d/gmp-6.1.0/install-sh' libdir='${exec_prefix}/lib' libexecdir='${exec_prefix}/libexec' localedir='${datarootdir}/locale' localstatedir='${prefix}/var' mandir='${datarootdir}/man' mkdir_p='$(MKDIR_P)' mpn_objects='' mpn_objs_in_libgmp='' oldincludedir='/usr/include' pdfdir='${docdir}' prefix='NONE' program_transform_name='s,x,x,' psdir='${docdir}' sbindir='${exec_prefix}/sbin' sharedstatedir='${prefix}/com' sysconfdir='${prefix}/etc' target_alias='' ## ----------- ## ## confdefs.h. ## ## ----------- ## /* confdefs.h */ #define PACKAGE_NAME "GNU MP" #define PACKAGE_TARNAME "gmp" #define PACKAGE_VERSION "6.1.0" #define PACKAGE_STRING "GNU MP 6.1.0" #define PACKAGE_BUGREPORT "gmp-bugs@gmplib.org, see https://gmplib.org/manual/Reporting-Bugs.html" #define PACKAGE_URL "http://www.gnu.org/software/gmp/" #define PACKAGE "gmp" #define VERSION "6.1.0" #define WANT_ASSEMBLY 1 #define WANT_FFT 1 #define HAVE_HOST_CPU_sandybridge 1 #define HOST_DOS64 1 #define HAVE_SPEED_CYCLECOUNTER 2 #define HAVE_CALLING_CONVENTIONS 1 configure: exit 77
conda update --all 失败
我想升级numpy,原先先后尝试conda update --all 以及conda update numpy,是可以的,但都因为网络还是什么原因中断了,两个命令都尝试了两次,都中断了。 后来过了一会,我再尝试conda update --all 以及conda update numpy,失败了,报错,报错原因都差不多,以下是conda update --all的报错代码,请各位大佬救救我,小白我万分感谢 ``` (base) C:\Users\RZW>conda update --all # >>>>>>>>>>>>>>>>>>>>>> ERROR REPORT <<<<<<<<<<<<<<<<<<<<<< Traceback (most recent call last): File "D:\Program files\Anaconda\lib\site-packages\libarchive\ffi.py", line 55, in <module> libarchive = ctypes.cdll.LoadLibrary(libarchive_path) File "D:\Program files\Anaconda\lib\ctypes\__init__.py", line 434, in LoadLibrary return self._dlltype(name) File "D:\Program files\Anaconda\lib\ctypes\__init__.py", line 356, in __init__ self._handle = _dlopen(self._name, mode) OSError: [WinError 126] 找不到指定的模块。 During handling of the above exception, another exception occurred: Traceback (most recent call last): File "D:\Program files\Anaconda\lib\site-packages\conda\exceptions.py", line 1062, in __call__ return func(*args, **kwargs) File "D:\Program files\Anaconda\lib\site-packages\conda\cli\main.py", line 84, in _main exit_code = do_call(args, p) File "D:\Program files\Anaconda\lib\site-packages\conda\cli\conda_argparse.py", line 82, in do_call exit_code = getattr(module, func_name)(args, parser) File "D:\Program files\Anaconda\lib\site-packages\conda\cli\main_update.py", line 20, in execute install(args, parser, 'update') File "D:\Program files\Anaconda\lib\site-packages\conda\cli\install.py", line 116, in install if context.use_only_tar_bz2: File "D:\Program files\Anaconda\lib\site-packages\conda\base\context.py", line 664, in use_only_tar_bz2 import conda_package_handling.api File "D:\Program files\Anaconda\lib\site-packages\conda_package_handling\api.py", line 3, in <module> from libarchive.exception import ArchiveError as _LibarchiveArchiveError File "D:\Program files\Anaconda\lib\site-packages\libarchive\__init__.py", line 1, in <module> from .entry import ArchiveEntry File "D:\Program files\Anaconda\lib\site-packages\libarchive\entry.py", line 6, in <module> from . import ffi File "D:\Program files\Anaconda\lib\site-packages\libarchive\ffi.py", line 57, in <module> raise ImportError("Failed to load libarchive library from %s - are any dependencies missing?" ImportError: Failed to load libarchive library from %s - are any dependencies missing?Is your environment activated? `$ D:\Program files\Anaconda\Scripts\conda-script.py update --all` environment variables: CIO_TEST=<not set> CONDA_DEFAULT_ENV=base CONDA_EXE=D:\Program files\Anaconda\condabin\..\Scripts\conda.exe CONDA_EXES="D:\Program files\Anaconda\condabin\..\Scripts\conda.exe" CONDA_PREFIX=D:\Program files\Anaconda CONDA_PROMPT_MODIFIER=(base) CONDA_PYTHON_EXE=D:\Program files\Anaconda\python.exe CONDA_ROOT=D:\Program files\Anaconda CONDA_SHLVL=1 HOMEPATH=\Users\RZW MOZ_PLUGIN_PATH=D:\Program files\Zeon\Gaaiho\Gaaiho Reader\Bin PATH=D:\Program files\Anaconda\Library\bin;D:\Program files\Anaconda;D:\Program files\Anaconda\Library\mingw-w64\bin;D:\Program files\Anaconda\Library\usr\bin;D:\Program files\Anaconda\Library\bin;D:\Program files\Anaconda\Scripts;D:\Program files\Anaconda\bin;D:\Program files\Anaconda;D:\Program files\Anaconda\Library\mingw-w64\bin;D:\Program files\Anaconda\Library\usr\bin;D:\Program files\Anaconda\Library\bin;D:\Program files\Anaconda\Scripts;D:\Program files\Anaconda\bin;D:\Program files\ Anaconda\condabin;C:\Windows\system32;C:\Windows;C:\Windows\System32\W bem;C:\Windows\System32\WindowsPowerShell\v1.0\锛汥:\Program files\Anaconda锛汥:\Program files\Anaconda\Scripts锛汥:\Program files\Anaconda\envs\tensorflow\Lib\site-packages;D:\Program files\Anaconda\Library\bin;D:\Program files\Anaconda;D:\Program files\Anaconda\Library\mingw-w64\bin;D:\Program files\Anaconda\Library\usr\bin;D:\Program files\Anaconda\Library\bin;D:\Program files\Anaconda\Scripts;D:\Program files PSMODULEPATH=C:\Windows\system32\WindowsPowerShell\v1.0\Modules\ REQUESTS_CA_BUNDLE=<not set> SSL_CERT_FILE=<not set> active environment : base active env location : D:\Program files\Anaconda shell level : 1 user config file : C:\Users\RZW\.condarc populated config files : C:\Users\RZW\.condarc conda version : 4.7.11 conda-build version : 3.18.8 python version : 3.7.3.final.0 virtual packages : base environment : D:\Program files\Anaconda (writable) channel URLs : https://mirrors.tuna.tsinghua.edu.cn/anaconda/cloud/msys2/win-64 https://mirrors.tuna.tsinghua.edu.cn/anaconda/cloud/msys2/noarch https://mirrors.tuna.tsinghua.edu.cn/anaconda/cloud/conda-forge/win-64 https://mirrors.tuna.tsinghua.edu.cn/anaconda/cloud/conda-forge/noarch https://mirrors.tuna.tsinghua.edu.cn/anaconda/pkgs/free/win-64 https://mirrors.tuna.tsinghua.edu.cn/anaconda/pkgs/free/noarch https://repo.anaconda.com/pkgs/main/win-64 https://repo.anaconda.com/pkgs/main/noarch https://repo.anaconda.com/pkgs/r/win-64 https://repo.anaconda.com/pkgs/r/noarch https://repo.anaconda.com/pkgs/msys2/win-64 https://repo.anaconda.com/pkgs/msys2/noarch package cache : D:\Program files\Anaconda\pkgs C:\Users\RZW\.conda\pkgs C:\Users\RZW\AppData\Local\conda\conda\pkgs envs directories : D:\Program files\Anaconda\envs C:\Users\RZW\.conda\envs C:\Users\RZW\AppData\Local\conda\conda\envs platform : win-64 user-agent : conda/4.7.11 requests/2.22.0 CPython/3.7.3 Windows/10 Windows/10.0.10240 administrator : False netrc file : None offline mode : False An unexpected error has occurred. Conda has prepared the above report. If submitted, this report will be used by core maintainers to improve future releases of conda. Would you like conda to send this report to the core maintainers? [y/N]: ```
C++ while 计算1到10的和
错误信息: ``` cd 'D:\C++\workspace\CppApplication_2' D:\C++\MSYS\bin\make.exe -f Makefile CONF=Debug "/D/C++/MSYS/bin/make.exe" -f nbproject/Makefile-Debug.mk QMAKE= SUBPROJECTS= .build-conf make.exe[1]: Entering directory `/d/C++/workspace/CppApplication_2' "/D/C++/MSYS/bin/make.exe" -f nbproject/Makefile-Debug.mk dist/Debug/MinGW-Windows/cppapplication_2.exe make.exe[2]: Entering directory `/d/C++/workspace/CppApplication_2' mkdir -p build/Debug/MinGW-Windows rm -f "build/Debug/MinGW-Windows/main.o.d" g++ -c -g -MMD -MP -MF "build/Debug/MinGW-Windows/main.o.d" -o build/Debug/MinGW-Windows/main.o main.cpp mkdir -p dist/Debug/MinGW-Windows g++ -o dist/Debug/MinGW-Windows/cppapplication_2 build/Debug/MinGW-Windows/main.o d:/c++/mingw/bin/../lib/gcc/mingw32/5.3.0/../../../../mingw32/bin/ld.exe: cannot find -lpthread collect2.exe: error: ld returned 1 exit status make.exe[2]: *** [dist/Debug/MinGW-Windows/cppapplication_2.exe] Error 1 make.exe[2]: Leaving directory `/d/C++/workspace/CppApplication_2' make.exe[1]: *** [.build-conf] Error 2 make.exe[1]: Leaving directory `/d/C++/workspace/CppApplication_2' make.exe": *** [.build-impl] Error 2 构建 FAILED (退出值2, 总时间: 556ms) ``` ![图片说明](https://img-ask.csdn.net/upload/201608/27/1472285652_227900.png) ![图片说明](https://img-ask.csdn.net/upload/201608/27/1472285662_251070.png)
ESP32 windows开发环境的搭建. 第四步:安装 Python 软件包 出错?
![图片说明](https://img-ask.csdn.net/upload/201904/23/1556030915_616259.jpg) 问题描述:买了个ESP32-CAM开发板,按官方教程搭建WINDOWS开发环境。 网址:(https://docs.espressif.com/projects/esp-idf/zh_CN/latest/get-started/index.html#get-started-get-packages)。 操作到,第四步:安装 Python 软件包 ,Msys2提示 “-bash: python: 未找到命令”。 请问我哪里做错了? PS.已安装Python2.7.16
undefined reference to `_Unwind_Resume'
OS:windows 7 IDE:codeblocks 12.12 c complier:mingw32-gcc.exe C++ complier:mingw32-g++.exe 错误提示:undefined reference to `_Unwind_Resume'| 在IDE中运行FLTK的模板程序“hello world”时出现错误 ——————————————————分割线—————————————— 如下是所有错误信息: ||=== Build: Debug in fltk_test01 (compiler: GNU GCC Compiler) ===| C:\msys\1.0\local\lib\libfltk.a(Fl_Window.o):Fl_Window.cxx:(.text$_ZN9Fl_WindowC2EiiiiPKc+0x72)||undefined reference to `_Unwind_Resume'| C:\msys\1.0\local\lib\libfltk.a(Fl_Window.o):Fl_Window.cxx:(.text$_ZN9Fl_WindowC2EiiPKc+0x80)||undefined reference to `_Unwind_Resume'| C:\msys\1.0\local\lib\libfltk.a(Fl_Window.o):Fl_Window.cxx:(.text$_ZN9Fl_WindowD2Ev+0x6e)||undefined reference to `_Unwind_Resume'| C:\msys\1.0\local\lib\libfltk.a(Fl_Window.o):Fl_Window.cxx:(.eh_frame+0x83)||undefined reference to `__gxx_personality_v0'| C:\msys\1.0\local\lib\libfltk.a(Fl_Group.o):Fl_Group.cxx:(.text$_ZN15Fl_Input_Choice7menu_cbEP9Fl_WidgetPv[__ZN15Fl_Input_Choice7menu_cbEP9Fl_WidgetPv]+0xfe)||undefined reference to `_Unwind_Resume'| C:\msys\1.0\local\lib\libfltk.a(Fl_Group.o):Fl_Group.cxx:(.text$_ZN15Fl_Input_Choice6inp_cbEP9Fl_WidgetPv[__ZN15Fl_Input_Choice6inp_cbEP9Fl_WidgetPv]+0x87)||undefined reference to `_Unwind_Resume'| C:\msys\1.0\local\lib\libfltk.a(Fl_Group.o):Fl_Group.cxx:(.text$_ZN8Fl_Group6handleEi+0x581)||undefined reference to `_Unwind_Resume'| C:\msys\1.0\local\lib\libfltk.a(Fl_Group.o):Fl_Group.cxx:(.text$_ZN8Fl_GroupD2Ev+0x37)||undefined reference to `_Unwind_Resume'| C:\msys\1.0\local\lib\libfltk.a(Fl_Group.o):Fl_Group.cxx:(.text$_ZN15Fl_Input_ChoiceC2EiiiiPKc+0x19c)||undefined reference to `_Unwind_Resume'| C:\msys\1.0\local\lib\libfltk.a(Fl_Group.o):Fl_Group.cxx:(.eh_frame+0x157)||undefined reference to `__gxx_personality_v0'| C:\msys\1.0\local\lib\libfltk.a(Fl_Group.o):Fl_Group.cxx:(.eh_frame$_ZN15Fl_Input_Choice7menu_cbEP9Fl_WidgetPv+0x13)||undefined reference to `__gxx_personality_v0'| C:\msys\1.0\local\lib\libfltk.a(Fl_Group.o):Fl_Group.cxx:(.eh_frame$_ZN15Fl_Input_Choice6inp_cbEP9Fl_WidgetPv+0x13)||undefined reference to `__gxx_personality_v0'| C:\msys\1.0\local\lib\libfltk.a(Fl_Group.o):Fl_Group.cxx:(.eh_frame$_ZN10Fl_SpinnerD1Ev+0x13)||undefined reference to `__gxx_personality_v0'| C:\msys\1.0\local\lib\libfltk.a(Fl_Group.o):Fl_Group.cxx:(.eh_frame$_ZN10Fl_SpinnerD0Ev+0x13)||undefined reference to `__gxx_personality_v0'| C:\msys\1.0\local\lib\libfltk.a(Fl.o):Fl.cxx:(.text$_ZN2Fl4copyEPKciiS1_+0x196)||undefined reference to `_Unwind_Resume'| C:\msys\1.0\local\lib\libfltk.a(Fl.o):Fl.cxx:(.text$_ZN2Fl6optionENS_9Fl_OptionE+0x285)||undefined reference to `_Unwind_Resume'| C:\msys\1.0\local\lib\libfltk.a(Fl.o):Fl.cxx:(.text$_ZN2Fl6optionENS_9Fl_OptionE+0x2a3)||undefined reference to `_Unwind_Resume'| C:\msys\1.0\local\lib\libfltk.a(Fl.o):Fl.cxx:(.eh_frame+0xb4b)||undefined reference to `__gxx_personality_v0'| C:\msys\1.0\local\lib\libfltk.a(Fl_get_system_colors.o):Fl_get_system_colors.cxx:(.text$_ZN2Fl13reload_schemeEv+0x737)||undefined reference to `_Unwind_Resume'| C:\msys\1.0\local\lib\libfltk.a(Fl_get_system_colors.o):Fl_get_system_colors.cxx:(.text.startup._GLOBAL__sub_I__ZN2Fl10backgroundEhhh+0xa7)||undefined reference to `_Unwind_Resume'| C:\msys\1.0\local\lib\libfltk.a(Fl_get_system_colors.o):Fl_get_system_colors.cxx:(.eh_frame+0x157)||undefined reference to `__gxx_personality_v0'| C:\msys\1.0\local\lib\libfltk.a(Fl_Window_shape.o):Fl_Window_shape.cxx:(.text$_ZN9Fl_Window13shape_pixmap_EP9Fl_Pixmap+0x64)||undefined reference to `_Unwind_Resume'| C:\msys\1.0\local\lib\libfltk.a(Fl_Window_shape.o):Fl_Window_shape.cxx:(.eh_frame+0x113)||undefined reference to `__gxx_personality_v0'| C:\msys\1.0\local\lib\libfltk.a(Fl_Widget.o):Fl_Widget.cxx:(.text$_ZN9Fl_Widget11do_callbackEPS_Pv+0x5e)||undefined reference to `_Unwind_Resume'| C:\msys\1.0\local\lib\libfltk.a(Fl_Widget.o):Fl_Widget.cxx:(.eh_frame+0x30b)||undefined reference to `__gxx_personality_v0'| C:\msys\1.0\local\lib\libfltk.a(Fl_Menu_Button.o):Fl_Menu_Button.cxx:(.text$_ZN14Fl_Menu_Button5popupEv+0xe9)||undefined reference to `_Unwind_Resume'| C:\msys\1.0\local\lib\libfltk.a(Fl_Menu_Button.o):Fl_Menu_Button.cxx:(.eh_frame+0x7f)||undefined reference to `__gxx_personality_v0'| C:\msys\1.0\local\lib\libfltk.a(Fl_Button.o):Fl_Button.cxx:(.text$_ZN9Fl_Button19simulate_key_actionEv+0x94)||undefined reference to `_Unwind_Resume'| C:\msys\1.0\local\lib\libfltk.a(Fl_Button.o):Fl_Button.cxx:(.text$_ZN9Fl_Button6handleEi+0x3c5)||undefined reference to `_Unwind_Resume'| C:\msys\1.0\local\lib\libfltk.a(Fl_Button.o):Fl_Button.cxx:(.text$_ZN9Fl_Button6handleEi+0x3d6)||undefined reference to `_Unwind_Resume'| C:\msys\1.0\local\lib\libfltk.a(Fl_Button.o):Fl_Button.cxx:(.eh_frame+0x103)||undefined reference to `__gxx_personality_v0'| C:\msys\1.0\local\lib\libfltk.a(Fl_Menu_.o):Fl_Menu_.cxx:(.text$_ZN8Fl_Menu_D2Ev+0x37)||undefined reference to `_Unwind_Resume'| C:\msys\1.0\local\lib\libfltk.a(Fl_Menu_.o):Fl_Menu_.cxx:(.eh_frame+0x2bb)||undefined reference to `__gxx_personality_v0'| C:\msys\1.0\local\lib\libfltk.a(Fl_Tooltip.o):Fl_Tooltip.cxx:(.text$_ZL15tooltip_timeoutPv+0x10b)||undefined reference to `_Unwind_Resume'| C:\msys\1.0\local\lib\libfltk.a(Fl_Tooltip.o):Fl_Tooltip.cxx:(.eh_frame+0xdf)||undefined reference to `__gxx_personality_v0'| C:\msys\1.0\local\lib\libfltk.a(fl_font.o):fl_font.cxx:(.text$_ZL7fl_fontP18Fl_Graphics_Driveriii+0xf4)||undefined reference to `_Unwind_Resume'| C:\msys\1.0\local\lib\libfltk.a(fl_font.o):fl_font.cxx:(.eh_frame+0xa3)||undefined reference to `__gxx_personality_v0'| C:\msys\1.0\local\lib\libfltk.a(Fl_Image.o):Fl_Image.cxx:(.text$_ZN12Fl_RGB_ImageD2Ev+0x3c)||undefined reference to `_Unwind_Resume'| C:\msys\1.0\local\lib\libfltk.a(Fl_Image.o):Fl_Image.cxx:(.text$_ZN12Fl_RGB_ImageC2EPK9Fl_Pixmapj+0x95)||undefined reference to `_Unwind_Resume'| C:\msys\1.0\local\lib\libfltk.a(Fl_Image.o):Fl_Image.cxx:(.eh_frame+0x1f7)||undefined reference to `__gxx_personality_v0'| C:\msys\1.0\local\lib\libfltk.a(Fl_Double_Window.o):Fl_Double_Window.cxx:(.text$_ZN16Fl_Double_WindowD2Ev+0x37)||undefined reference to `_Unwind_Resume'| C:\msys\1.0\local\lib\libfltk.a(Fl_Double_Window.o):Fl_Double_Window.cxx:(.eh_frame+0x4b)||undefined reference to `__gxx_personality_v0'| C:\msys\1.0\local\lib\libfltk.a(Fl_Preferences.o):Fl_Preferences.cxx:(.text$_ZN14Fl_PreferencesC2EPKcS1_S1_+0x85)||undefined reference to `_Unwind_Resume'| C:\msys\1.0\local\lib\libfltk.a(Fl_Preferences.o):Fl_Preferences.cxx:(.text$_ZN14Fl_PreferencesC2ENS_4RootEPKcS2_+0x85)||undefined reference to `_Unwind_Resume'| C:\msys\1.0\local\lib\libfltk.a(Fl_Preferences.o):Fl_Preferences.cxx:(.text$_ZN17Fl_Plugin_ManagerC2EPKc+0x72)||undefined reference to `_Unwind_Resume'| C:\msys\1.0\local\lib\libfltk.a(Fl_Preferences.o):Fl_Preferences.cxx:(.text$_ZN17Fl_Plugin_Manager6pluginEi+0x7f)||undefined reference to `_Unwind_Resume'| C:\msys\1.0\local\lib\libfltk.a(Fl_Preferences.o):Fl_Preferences.cxx:(.text$_ZN17Fl_Plugin_Manager6pluginEPKc+0xa9)||undefined reference to `_Unwind_Resume'| C:\msys\1.0\local\lib\libfltk.a(Fl_Preferences.o):Fl_Preferences.cxx:(.eh_frame+0x8fb)||undefined reference to `__gxx_personality_v0'| C:\msys\1.0\local\lib\libfltk.a(Fl_Pixmap.o):Fl_Pixmap.cxx:(.text$_ZN9Fl_PixmapD2Ev+0x3e)||undefined reference to `_Unwind_Resume'| C:\msys\1.0\local\lib\libfltk.a(Fl_Pixmap.o):Fl_Pixmap.cxx:(.text$_ZN9Fl_Pixmap4copyEii+0x416)||undefined reference to `_Unwind_Resume'| ||More errors follow but not being shown.| ||Edit the max errors limit in compiler options...| ||=== Build failed: 50 error(s), 0 warning(s) (0 minute(s), 1 second(s)) ===| ————————————分割线—————————————— 由于我在网上找了很多相关资料,里面所说的mingw版本问题和makefile命令完全不懂,请最好能step by step讲解一下,谢谢! 再次感谢!
C++ 基本IO 加和出现错误
实现加法算法,代码和错误信息如下: ``` #include <iostream> using namespace std; /* * */ int main() { cout<<"Enter two numbers:"<<endl; int v1 = 0,v2 = 0; cin >> v1 >> v2; cout << "The sum of " << v1 << "and" << v2 << "is" << v1 + v2 << endl; return 0; ``` ``` cd 'D:\C++\workspace\CppApplication_1' D:\C++\MSYS\bin\make.exe -f Makefile CONF=Debug "/D/C++/MSYS/bin/make.exe" -f nbproject/Makefile-Debug.mk QMAKE= SUBPROJECTS= .build-conf make.exe[1]: Entering directory `/d/C++/workspace/CppApplication_1' "/D/C++/MSYS/bin/make.exe" -f nbproject/Makefile-Debug.mk dist/Debug/MinGW-Windows/cppapplication_1.exe make.exe[2]: Entering directory `/d/C++/workspace/CppApplication_1' mkdir -p dist/Debug/MinGW-Windows g++ -o dist/Debug/MinGW-Windows/cppapplication_1 build/Debug/MinGW-Windows/main.o d:/c++/mingw/bin/../lib/gcc/mingw32/5.3.0/../../../../mingw32/bin/ld.exe: cannot find -lpthread collect2.exe: error: ld returned 1 exit status make.exe[2]: *** [dist/Debug/MinGW-Windows/cppapplication_1.exe] Error 1 make.exe[2]: Leaving directory `/d/C++/workspace/CppApplication_1' make.exe[1]: *** [.build-conf] Error 2 make.exe[1]: Leaving directory `/d/C++/workspace/CppApplication_1' make.exe": *** [.build-impl] Error 2 构建 FAILED (退出值2, 总时间: 306ms) ```
Ruby在windows下安装三方包出错
Ruby在windows下安装三方包出错比如jekyll时候出错“ERROR: Failed to build gem native extension.”,请问如何解决这歌错误并成功安装jekyll。另外我想知道ruby,rubygems,rubydevki,msys2之间的关系和区别,ruby初学者,请尽可能讲的通俗易懂一点,非常谢谢。
Anaconda使用conda更新或安装报错
Win10,Anaconda3,python3.6,使用conda或者pip命令upgrade或者install都会报错 以为是因为版本冲突,Anaconda重装了也没有用,帮忙看看是什么错误啦谢谢~ ``` --conda upgrade conda Fetching package metadata ...An unexpected error has occurred. Please consider posting the following information to the conda GitHub issue tracker at: https://github.com/conda/conda/issues Current conda install: platform : win-64 conda version : 4.3.27 conda is private : False conda-env version : 4.3.27 conda-build version : 3.0.22 python version : 3.6.2.final.0 requests version : 2.18.4 root environment : C:\Anaconda3 (writable) default environment : C:\Anaconda3 envs directories : C:\Anaconda3\envs C:\Users\Yvette~1\AppData\Local\conda\conda\envs C:\Users\Yvette\.conda\envs package cache : C:\Anaconda3\pkgs C:\Users\Yvette~1\AppData\Local\conda\conda\pkgs channel URLs : https://mirrors.tuna.tsinghua.edu.cn/anaconda/pkgs/free/win-64 https://mirrors.tuna.tsinghua.edu.cn/anaconda/pkgs/free/noarch https://repo.continuum.io/pkgs/main/win-64 https://repo.continuum.io/pkgs/main/noarch https://repo.continuum.io/pkgs/free/win-64 https://repo.continuum.io/pkgs/free/noarch https://repo.continuum.io/pkgs/r/win-64 https://repo.continuum.io/pkgs/r/noarch https://repo.continuum.io/pkgs/pro/win-64 https://repo.continuum.io/pkgs/pro/noarch https://repo.continuum.io/pkgs/msys2/win-64 https://repo.continuum.io/pkgs/msys2/noarch config file : C:\Users\陈惠宇宝宝\.condarc netrc file : None offline mode : False user-agent : conda/4.3.27 requests/2.18.4 CPython/3.6.2 Windows/10 Windows/10.0.15063 administrator : False `$ C:\Anaconda3\Scripts\conda upgrade conda` Traceback (most recent call last): File "C:\Anaconda3\lib\site-packages\conda\exceptions.py", line 640, in conda_exception_handler return_value = func(*args, **kwargs) File "C:\Anaconda3\lib\site-packages\conda\cli\main.py", line 140, in _main exit_code = args.func(args, p) File "C:\Anaconda3\lib\site-packages\conda\cli\main_update.py", line 65, in execute install(args, parser, 'update') File "C:\Anaconda3\lib\site-packages\conda\cli\install.py", line 231, in install unknown=index_args['unknown'], prefix=prefix) File "C:\Anaconda3\lib\site-packages\conda\core\index.py", line 101, in get_index index = fetch_index(channel_priority_map, use_cache=use_cache) File "C:\Anaconda3\lib\site-packages\conda\core\index.py", line 120, in fetch_index repodatas = collect_all_repodata(use_cache, tasks) File "C:\Anaconda3\lib\site-packages\conda\core\repodata.py", line 75, in collect_all_repodata repodatas = _collect_repodatas_serial(use_cache, tasks) File "C:\Anaconda3\lib\site-packages\conda\core\repodata.py", line 485, in _collect_repodatas_serial for url, schan, pri in tasks] File "C:\Anaconda3\lib\site-packages\conda\core\repodata.py", line 485, in <listcomp> for url, schan, pri in tasks] File "C:\Anaconda3\lib\site-packages\conda\core\repodata.py", line 115, in func res = f(*args, **kwargs) File "C:\Anaconda3\lib\site-packages\conda\core\repodata.py", line 464, in fetch_repodata mod_etag_headers.get('_mod')) File "C:\Anaconda3\lib\site-packages\conda\core\repodata.py", line 144, in fetch_repodata_remote_request timeout=timeout) File "C:\Anaconda3\lib\site-packages\requests\sessions.py", line 521, in get return self.request('GET', url, **kwargs) File "C:\Anaconda3\lib\site-packages\requests\sessions.py", line 508, in request resp = self.send(prep, **send_kwargs) File "C:\Anaconda3\lib\site-packages\requests\sessions.py", line 618, in send r = adapter.send(request, **kwargs) File "C:\Anaconda3\lib\site-packages\requests\adapters.py", line 440, in send timeout=timeout File "C:\Anaconda3\lib\site-packages\urllib3\connectionpool.py", line 595, in urlopen self._prepare_proxy(conn) File "C:\Anaconda3\lib\site-packages\urllib3\connectionpool.py", line 816, in _prepare_proxy conn.connect() File "C:\Anaconda3\lib\site-packages\urllib3\connection.py", line 284, in connect conn = self._new_conn() File "C:\Anaconda3\lib\site-packages\urllib3\connection.py", line 141, in _new_conn (self.host, self.port), self.timeout, **extra_kw) File "C:\Anaconda3\lib\site-packages\urllib3\util\connection.py", line 51, in create_connection if host.startswith('['): AttributeError: 'NoneType' object has no attribute 'startswith' ```
ESP32 windows开发环境的搭建(官方方法) 困惑?
![图片说明](https://img-ask.csdn.net/upload/201904/23/1556031500_4251.jpg) 官方教材第四步,Msys2 输入python 好像识别不了。 https://docs.espressif.com/projects/esp-idf/zh_CN/latest/get-started/index.html#get-started-get-packages
提问关于git bash闪退的问题
一打开就闪退,重新安装重启电脑也不行。网上搜到的rebase -b 0x76000000 msys-1.0.dll。会告诉我'rebase' 不是内部或外部命令,也不是可运行的程序或批处理文件这要怎么解决。
新手关于移动开发 windows下Objective-C环境 和 SailfishOS的一些问题
0.最近开始研究移动开发,最先是从IOS开始,因为本人是个应届生,所以用Mac是承受不起的 1.在谷歌搜索了下,于是在win7上安装了gnustep-msys-system和gnustep-core和gnustep-core,可以 在shell中进行Obj-C编程; 2.在搜索资料过程中,看到了SailfishOS,于是去研究了下,安装了SailfishOSSDK-Alpha-1312-Qt5-windows-offine.exe和VirtualBox,在虚拟机模拟器中成功运行了首个SailfishOS程序;这里我想问一下QtCreator和SailfishOS的关系,是不是Jolla把SailfishOS绑定到QtCreator上了,利用Qt作为IDE工具? 3.因为GNU的shell中用vim写代码不舒服,所以我用Notepad++写完代码在shell中编译,然后在doc中运行(因为得写个make,编译完了运行还得cd项目目录,然后运行,所以我直接把.exe拖放到doc中运行),于是我找资料发现了个IDE---Codeblocks,在Codeblocks中集成了Objective-C开发环境([CSDN移动问答][1])。在Qt的可绑定语言中我没有看到Objective-C,请问QtCreator能不能集成Objective-C的开发环境(因为我感觉QtCreator比Codeblocks的UI让我舒服很多,就像VS2010比VS6.0的UI,不要吐槽 0.0) 4.请大神提出一些移动开发学习的指导意见,谢谢。 [1]: http://blog.csdn.net/hjj1006340261/article/details/11488327
官网下载的gdb压缩包解压编译后找不到gdb.exe文件
用的msys解压并编译,但是找不到gdb.exe,下的是7.12版本
相见恨晚的超实用网站
相见恨晚的超实用网站 持续更新中。。。
字节跳动视频编解码面经
三四月份投了字节跳动的实习(图形图像岗位),然后hr打电话过来问了一下会不会opengl,c++,shador,当时只会一点c++,其他两个都不会,也就直接被拒了。 七月初内推了字节跳动的提前批,因为内推没有具体的岗位,hr又打电话问要不要考虑一下图形图像岗,我说实习投过这个岗位不合适,不会opengl和shador,然后hr就说秋招更看重基础。我当时想着能进去就不错了,管他哪个岗呢,就同意了面试...
Java学习的正确打开方式
在博主认为,对于入门级学习java的最佳学习方法莫过于视频+博客+书籍+总结,前三者博主将淋漓尽致地挥毫于这篇博客文章中,至于总结在于个人,实际上越到后面你会发现学习的最好方式就是阅读参考官方文档其次就是国内的书籍,博客次之,这又是一个层次了,这里暂时不提后面再谈。博主将为各位入门java保驾护航,各位只管冲鸭!!!上天是公平的,只要不辜负时间,时间自然不会辜负你。 何谓学习?博主所理解的学习,它是一个过程,是一个不断累积、不断沉淀、不断总结、善于传达自己的个人见解以及乐于分享的过程。
程序员必须掌握的核心算法有哪些?
由于我之前一直强调数据结构以及算法学习的重要性,所以就有一些读者经常问我,数据结构与算法应该要学习到哪个程度呢?,说实话,这个问题我不知道要怎么回答你,主要取决于你想学习到哪些程度,不过针对这个问题,我稍微总结一下我学过的算法知识点,以及我觉得值得学习的算法。这些算法与数据结构的学习大多数是零散的,并没有一本把他们全部覆盖的书籍。下面是我觉得值得学习的一些算法以及数据结构,当然,我也会整理一些看过...
大学四年自学走来,这些私藏的实用工具/学习网站我贡献出来了
大学四年,看课本是不可能一直看课本的了,对于学习,特别是自学,善于搜索网上的一些资源来辅助,还是非常有必要的,下面我就把这几年私藏的各种资源,网站贡献出来给你们。主要有:电子书搜索、实用工具、在线视频学习网站、非视频学习网站、软件下载、面试/求职必备网站。 注意:文中提到的所有资源,文末我都给你整理好了,你们只管拿去,如果觉得不错,转发、分享就是最大的支持了。 一、电子书搜索 对于大部分程序员...
linux系列之常用运维命令整理笔录
本博客记录工作中需要的linux运维命令,大学时候开始接触linux,会一些基本操作,可是都没有整理起来,加上是做开发,不做运维,有些命令忘记了,所以现在整理成博客,当然vi,文件操作等就不介绍了,慢慢积累一些其它拓展的命令,博客不定时更新 free -m 其中:m表示兆,也可以用g,注意都要小写 Men:表示物理内存统计 total:表示物理内存总数(total=used+free) use...
比特币原理详解
一、什么是比特币 比特币是一种电子货币,是一种基于密码学的货币,在2008年11月1日由中本聪发表比特币白皮书,文中提出了一种去中心化的电子记账系统,我们平时的电子现金是银行来记账,因为银行的背后是国家信用。去中心化电子记账系统是参与者共同记账。比特币可以防止主权危机、信用风险。其好处不多做赘述,这一层面介绍的文章很多,本文主要从更深层的技术原理角度进行介绍。 二、问题引入 假设现有4个人...
python学习方法总结(内附python全套学习资料)
不要再问我python好不好学了 我之前做过半年少儿编程老师,一个小学四年级的小孩子都能在我的教学下独立完成python游戏,植物大战僵尸简单版,如果要肯花时间,接下来的网络开发也不是问题,人工智能也可以学个调包也没啥问题。。。。。所以python真的是想学就一定能学会的!!!! --------------------华丽的分割线-------------------------------- ...
python 简易微信实现(注册登录+数据库存储+聊天+GUI+文件传输)
socket+tkinter详解+简易微信实现 历经多天的努力,查阅了许多大佬的博客后终于实现了一个简易的微信O(∩_∩)O~~ 简易数据库的实现 使用pands+CSV实现数据库框架搭建 import socket import threading from pandas import * import pymysql import csv # 创建DataFrame对象 # 存储用户数据的表(...
程序员接私活怎样防止做完了不给钱?
首先跟大家说明一点,我们做 IT 类的外包开发,是非标品开发,所以很有可能在开发过程中会有这样那样的需求修改,而这种需求修改很容易造成扯皮,进而影响到费用支付,甚至出现做完了项目收不到钱的情况。 那么,怎么保证自己的薪酬安全呢? 我们在开工前,一定要做好一些证据方面的准备(也就是“讨薪”的理论依据),这其中最重要的就是需求文档和验收标准。一定要让需求方提供这两个文档资料作为开发的基础。之后开发...
网页实现一个简单的音乐播放器(大佬别看。(⊙﹏⊙))
今天闲着无事,就想写点东西。然后听了下歌,就打算写个播放器。 于是乎用h5 audio的加上js简单的播放器完工了。 演示地点演示 html代码如下` music 这个年纪 七月的风 音乐 ` 然后就是css`*{ margin: 0; padding: 0; text-decoration: none; list-...
Python十大装B语法
Python 是一种代表简单思想的语言,其语法相对简单,很容易上手。不过,如果就此小视 Python 语法的精妙和深邃,那就大错特错了。本文精心筛选了最能展现 Python 语法之精妙的十个知识点,并附上详细的实例代码。如能在实战中融会贯通、灵活使用,必将使代码更为精炼、高效,同时也会极大提升代码B格,使之看上去更老练,读起来更优雅。
数据库优化 - SQL优化
以实际SQL入手,带你一步一步走上SQL优化之路!
2019年11月中国大陆编程语言排行榜
2019年11月2日,我统计了某招聘网站,获得有效程序员招聘数据9万条。针对招聘信息,提取编程语言关键字,并统计如下: 编程语言比例 rank pl_ percentage 1 java 33.62% 2 cpp 16.42% 3 c_sharp 12.82% 4 javascript 12.31% 5 python 7.93% 6 go 7.25% 7 p...
通俗易懂地给女朋友讲:线程池的内部原理
餐盘在灯光的照耀下格外晶莹洁白,女朋友拿起红酒杯轻轻地抿了一小口,对我说:“经常听你说线程池,到底线程池到底是个什么原理?”
《奇巧淫技》系列-python!!每天早上八点自动发送天气预报邮件到QQ邮箱
将代码部署服务器,每日早上定时获取到天气数据,并发送到邮箱。 也可以说是一个小型人工智障。 知识可以运用在不同地方,不一定非是天气预报。
经典算法(5)杨辉三角
杨辉三角 是经典算法,这篇博客对它的算法思想进行了讲解,并有完整的代码实现。
Python实例大全(基于Python3.7.4)
博客说明: 这是自己写的有关python语言的一篇综合博客。 只作为知识广度和编程技巧学习,不过于追究学习深度,点到即止、会用即可。 主要是基础语句,如三大控制语句(顺序、分支、循环),随机数的生成,数据类型的区分和使用; 也会涉及常用的算法和数据结构,以及面试题相关经验; 主体部分是针对python的数据挖掘和数据分析,主要先攻爬虫方向:正则表达式匹配,常用数据清洗办法,scrapy及其他爬虫框架,数据存储方式及其实现; 最后还会粗略涉及人工智能领域,玩转大数据与云计算、进行相关的预测和分析。
腾讯算法面试题:64匹马8个跑道需要多少轮才能选出最快的四匹?
昨天,有网友私信我,说去阿里面试,彻底的被打击到了。问了为什么网上大量使用ThreadLocal的源码都会加上private static?他被难住了,因为他从来都没有考虑过这个问题。无独有偶,今天笔者又发现有网友吐槽了一道腾讯的面试题,我们一起来看看。 腾讯算法面试题:64匹马8个跑道需要多少轮才能选出最快的四匹? 在互联网职场论坛,一名程序员发帖求助到。二面腾讯,其中一个算法题:64匹...
面试官:你连RESTful都不知道我怎么敢要你?
干货,2019 RESTful最贱实践
刷了几千道算法题,这些我私藏的刷题网站都在这里了!
遥想当年,机缘巧合入了 ACM 的坑,周边巨擘林立,从此过上了"天天被虐似死狗"的生活… 然而我是谁,我可是死狗中的战斗鸡,智力不够那刷题来凑,开始了夜以继日哼哧哼哧刷题的日子,从此"读题与提交齐飞, AC 与 WA 一色 ",我惊喜的发现被题虐既刺激又有快感,那一刻我泪流满面。这么好的事儿作为一个正直的人绝不能自己独享,经过激烈的颅内斗争,我决定把我私藏的十几个 T 的,阿不,十几个刷题网...
为啥国人偏爱Mybatis,而老外喜欢Hibernate/JPA呢?
关于SQL和ORM的争论,永远都不会终止,我也一直在思考这个问题。昨天又跟群里的小伙伴进行了一番讨论,感触还是有一些,于是就有了今天这篇文。 声明:本文不会下关于Mybatis和JPA两个持久层框架哪个更好这样的结论。只是摆事实,讲道理,所以,请各位看官勿喷。 一、事件起因 关于Mybatis和JPA孰优孰劣的问题,争论已经很多年了。一直也没有结论,毕竟每个人的喜好和习惯是大不相同的。我也看...
SQL-小白最佳入门sql查询一
不要偷偷的查询我的个人资料,即使你再喜欢我,也不要这样,真的不好;
JavaScript 为什么能活到现在?
作者 | 司徒正美 责编 |郭芮 出品 | CSDN(ID:CSDNnews) JavaScript能发展到现在的程度已经经历不少的坎坷,早产带来的某些缺陷是永久性的,因此浏览器才有禁用JavaScript的选项。甚至在jQuery时代有人问出这样的问题,jQuery与JavaScript哪个快?在Babel.js出来之前,发明一门全新的语言代码代替JavaScript...
项目中的if else太多了,该怎么重构?
介绍 最近跟着公司的大佬开发了一款IM系统,类似QQ和微信哈,就是聊天软件。我们有一部分业务逻辑是这样的 if (msgType = "文本") { // dosomething } else if(msgType = "图片") { // doshomething } else if(msgType = "视频") { // doshomething } else { // doshom...
Nginx 原理和架构
Nginx 是一个免费的,开源的,高性能的 HTTP 服务器和反向代理,以及 IMAP / POP3 代理服务器。Nginx 以其高性能,稳定性,丰富的功能,简单的配置和低资源消耗而闻名。 Nginx 的整体架构 Nginx 里有一个 master 进程和多个 worker 进程。master 进程并不处理网络请求,主要负责调度工作进程:加载配置、启动工作进程及非停升级。worker 进程负责处...
致 Python 初学者
欢迎来到“Python进阶”专栏!来到这里的每一位同学,应该大致上学习了很多 Python 的基础知识,正在努力成长的过程中。在此期间,一定遇到了很多的困惑,对未来的学习方向感到迷茫。我非常理解你们所面临的处境。我从2007年开始接触 python 这门编程语言,从2009年开始单一使用 python 应对所有的开发工作,直至今天。回顾自己的学习过程,也曾经遇到过无数的困难,也曾经迷茫过、困惑过。开办这个专栏,正是为了帮助像我当年一样困惑的 Python 初学者走出困境、快速成长。希望我的经验能真正帮到你
Python 编程开发 实用经验和技巧
Python是一门很灵活的语言,也有很多实用的方法,有时候实现一个功能可以用多种方法实现,我这里总结了一些常用的方法和技巧,包括小数保留指定位小数、判断变量的数据类型、类方法@classmethod、制表符中文对齐、遍历字典、datetime.timedelta的使用等,会持续更新......
吐血推荐珍藏的Visual Studio Code插件
作为一名Java工程师,由于工作需要,最近一个月一直在写NodeJS,这种经历可以说是一部辛酸史了。好在有神器Visual Studio Code陪伴,让我的这段经历没有更加困难。眼看这段经历要告一段落了,今天就来给大家分享一下我常用的一些VSC的插件。 VSC的插件安装方法很简单,只需要点击左侧最下方的插件栏选项,然后就可以搜索你想要的插件了。 下面我们进入正题 Material Theme ...
“狗屁不通文章生成器”登顶GitHub热榜,分分钟写出万字形式主义大作
一、垃圾文字生成器介绍 最近在浏览GitHub的时候,发现了这样一个骨骼清奇的雷人项目,而且热度还特别高。 项目中文名:狗屁不通文章生成器 项目英文名:BullshitGenerator 根据作者的介绍,他是偶尔需要一些中文文字用于GUI开发时测试文本渲染,因此开发了这个废话生成器。但由于生成的废话实在是太过富于哲理,所以最近已经被小伙伴们给玩坏了。 他的文风可能是这样的: 你发现,...
相关热词 c#委托 逆变与协变 c#新建一个项目 c#获取dll文件路径 c#子窗体调用主窗体事件 c# 拷贝目录 c# 调用cef 网页填表c#源代码 c#部署端口监听项目、 c#接口中的属性使用方法 c# 昨天
立即提问