打包由web项目改成的maven项目报错:程序包不存在,符号找不到

报错是这样的

16个回答

换个logger试试

sky_blue_flying
sky_flying對滴 今天刚找出,其实只是别人引包引错了,然后我是把现有的web项目改成maven,然后打包,之前一直没问题,然后打包报错我就一直以为是我pom文件有问题。。。找了我个把星期。百度所有情况都试了一遍,真的是,
接近 2 年之前 回复

图片说明

图片说明

图片说明

上面分别上传了打包时报的错,项目配置的jdk版本和我的pom文件里面配置的jdk.
我把百度里面情况都试过,还是报错。
百度里面普遍都是说jdk版本有问题,可是我项目里面确实是1.7,然后我还用1.8也试了下,发现还是报错。
然后还有的说是maven-compiler-plugin下面的包版本有影响,然后我把plexus-compiler-eclipse的引入删掉,还是报错。
还有加Jdk安装路径的,还有把版本改成2.3.2的,还有clean项目,run maven项目的。。。都试过。一直都报错

真的是把我能百度到的可能都试了一遍,还是有问题,不知道有没有知道的大神帮忙再说几个别的可能。

Logger找不到,有配置对应的依赖吗?

sky_blue_flying
sky_flying對滴 它相应的依赖就是maven-compiler-plugin吧
接近 2 年之前 回复
sky_blue_flying
sky_flying對滴 什么logger
接近 2 年之前 回复

而且我还有一个差不多的项目,只是他的java compiler那里是1.6,其它都配置的一样,他打包没问题。

图片说明
就是这个依赖包不存在,肯定是少了这个依赖

sky_blue_flying
sky_flying對滴 那这个包到底是哪个jar包呢。。。
接近 2 年之前 回复

jar 不是应该去配置么,查看配置,然后看看是否有下载下来

共16条数据 1 尾页
Csdn user default icon
上传中...
上传图片
插入图片
抄袭、复制答案,以达到刷声望分或其他目的的行为,在CSDN问答是严格禁止的,一经发现立刻封号。是时候展现真正的技术了!
其他相关推荐
maven项目:用了ICE的框架,然后maven install的时候报错:程序包ice不存在

springboot+mybaits+ice 报错信息:![图片说明](https://img-ask.csdn.net/upload/201611/05/1478316668_421809.png)![图片说明](https://img-ask.csdn.net/upload/201611/05/1478316605_436954.png)

maven编译时报程序包不存在

最近换了家公司,在把环境搭好之后发现了点问题。 公司项目是基于dubbo的分布式项目,我在把项目导入idea之后也是正常的自动下载依赖。 下载完后,启动,也正常,可以跑起来。 但是当我Maven,clean之后重新install时,却报错:程序包不存在和找不到符号,但是我根据它报的错里提到的那些类是能在下面的lib库里找到的。 然后发现,compile编译时也是如此。 项目可以启动,却无法用maven编译,迷惘 ![图片说明](https://img-ask.csdn.net/upload/201912/31/1577773072_689562.png) ![图片说明](https://img-ask.csdn.net/upload/201912/31/1577773229_605742.png)![图片说明](https://img-ask.csdn.net/upload/201912/31/1577773237_874959.png)

IDEA使用maven时已经导入mybayis的jar包还是报错Error:(4, 28) java: 程序包org.apache.ibatis.io不存在

IDEA使用maven时已经导入mybayis的jar包还是报错 Error:(4, 28) java: 程序包org.apache.ibatis.io不存在 Error:(5, 33) java: 程序包org.apache.ibatis.session不存在 Error:(6, 33) java: 程序包org.apache.ibatis.session不存在 Error:(7, 33) java: 程序包org.apache.ibatis.session不存在 麻烦大佬解答下。谢谢 ![图片说明](https://img-ask.csdn.net/upload/202006/02/1591029713_511215.png)

Jenkins构建maven项目失败报错:

ERROR: Failed to parse POMs hudson.util.IOException2: Failed to access https://cds.sun.com/is-bin/INTERSHOP.enfinity/WFS/CDS-CDS_Developer-Site/en_US/-/USD/ViewProductDetail-Start?ProductRef=C:\Jdk1.7 at hudson.tools.JDKInstaller.locateStage1(JDKInstaller.java:352) at hudson.tools.JDKInstaller.locate(JDKInstaller.java:298) at hudson.tools.JDKInstaller.performInstallation(JDKInstaller.java:121) at hudson.tools.InstallerTranslator.getToolHome(InstallerTranslator.java:61) at hudson.tools.ToolLocationNodeProperty.getToolHome(ToolLocationNodeProperty.java:106) at hudson.tools.ToolInstallation.translateFor(ToolInstallation.java:149) at hudson.model.JDK.forNode(JDK.java:111) at hudson.model.AbstractBuild.getEnvironment(AbstractBuild.java:745) at hudson.maven.MavenModuleSetBuild.getEnvironment(MavenModuleSetBuild.java:157) at hudson.maven.MavenModuleSetBuild$RunnerImpl.doRun(MavenModuleSetBuild.java:573) at hudson.model.AbstractBuild$AbstractRunner.run(AbstractBuild.java:423) at hudson.model.Run.run(Run.java:1362) at hudson.maven.MavenModuleSetBuild.run(MavenModuleSetBuild.java:467) at hudson.model.ResourceController.execute(ResourceController.java:88) at hudson.model.Executor.run(Executor.java:145) Caused by: java.net.UnknownHostException: cds.sun.com at sun.reflect.NativeConstructorAccessorImpl.newInstance0(Native Method) at sun.reflect.NativeConstructorAccessorImpl.newInstance(NativeConstructorAccessorImpl.java:57) at sun.reflect.DelegatingConstructorAccessorImpl.newInstance(DelegatingConstructorAccessorImpl.java:45) at java.lang.reflect.Constructor.newInstance(Constructor.java:526) at sun.net.www.protocol.http.HttpURLConnection$6.run(HttpURLConnection.java:1676) at sun.net.www.protocol.http.HttpURLConnection$6.run(HttpURLConnection.java:1674) at java.security.AccessController.doPrivileged(Native Method) at sun.net.www.protocol.http.HttpURLConnection.getChainedException(HttpURLConnection.java:1672) at sun.net.www.protocol.http.HttpURLConnection.getInputStream(HttpURLConnection.java:1245) at sun.net.www.protocol.https.HttpsURLConnectionImpl.getInputStream(HttpsURLConnectionImpl.java:254) at hudson.tools.JDKInstaller.locateStage1(JDKInstaller.java:340) ... 14 more Caused by: java.net.UnknownHostException: cds.sun.com at java.net.AbstractPlainSocketImpl.connect(AbstractPlainSocketImpl.java:178) at java.net.PlainSocketImpl.connect(PlainSocketImpl.java:172) at java.net.SocksSocketImpl.connect(SocksSocketImpl.java:392) at java.net.Socket.connect(Socket.java:579) at sun.security.ssl.SSLSocketImpl.connect(SSLSocketImpl.java:625) at sun.security.ssl.BaseSSLSocketImpl.connect(BaseSSLSocketImpl.java:160) at sun.net.NetworkClient.doConnect(NetworkClient.java:180) at sun.net.www.http.HttpClient.openServer(HttpClient.java:432) at sun.net.www.http.HttpClient.openServer(HttpClient.java:527) at sun.net.www.protocol.https.HttpsClient.<init>(HttpsClient.java:275) at sun.net.www.protocol.https.HttpsClient.New(HttpsClient.java:371) at sun.net.www.protocol.https.AbstractDelegateHttpsURLConnection.getNewHttpClient(AbstractDelegateHttpsURLConnection.java:191) at sun.net.www.protocol.http.HttpURLConnection.plainConnect(HttpURLConnection.java:933) at sun.net.www.protocol.https.AbstractDelegateHttpsURLConnection.connect(AbstractDelegateHttpsURLConnection.java:177) at sun.net.www.protocol.http.HttpURLConnection.getInputStream(HttpURLConnection.java:1301) at sun.net.www.protocol.http.HttpURLConnection.getHeaderField(HttpURLConnection.java:2691) at sun.net.www.protocol.https.HttpsURLConnectionImpl.getHeaderField(HttpsURLConnectionImpl.java:291) at hudson.tools.JDKInstaller.locateStage1(JDKInstaller.java:334) ... 14 more Finished: FAILURE 好像是连不上cds.sun.com的原因, 不理解怎么改

web项目转换为maven项目,项目各种报错的问题

有一个比较大的web项目,原本是不支持maven的。jar包什么的 都是手动打,现在需要改成 maven来管理的。我通过右键项目configure里面的convert to Maven project之后,项目报错。 难道是我漏掉了什么地方?还是说不能直接点击convert to Maven project?请大神![图片说明](https://img-ask.csdn.net/upload/201603/09/1457492124_39872.png) 错误类似于这种。提示全都是 XXX cannot be resolved to a type

maven配置私服打包报错Failed to execute goal org.apache.maven.plugins:maven-compiler-plugin:3.5:compile

直接使用阿里云镜像仓库打包没问题,替换为私服镜像仓库后报错: 就是pom.xml中的plugin报错 ``` <plugin> <groupId>org.apache.maven.plugins</groupId> <artifactId>maven-compiler-plugin</artifactId> <version>3.5</version> <configuration> <source>1.8</source> <target>1.8</target> <encoding>UTF-8</encoding> </configuration> </plugin> ``` 网上找了半天说这个指定的jdk版本的问题,查了一下版本没问题都是1.8 报错内容: [ERROR] Failed to execute goal org.apache.maven.plugins:maven-compiler-plugin:3.5:compile (default-compile) on project mytest-web: Execution default-compile of goal org.apache.maven.plugins:maven-compiler-plugin:3.5:compile failed: Plugin org.apache.maven.plugins:maven-compiler-plugin:3.5 or one of its dependencies could not be resolved: Failed to collect dependencies at org.apache.maven.plugins:maven-compiler-plugin:jar:3.5 -> org.apache.maven:maven-toolchain:jar:2.2.1 -> org.apache.maven:maven-core:jar:2.2.1 -> commons-cli:commons-cli:jar:1.2: Failed to read artifact descriptor for commons-cli:commons-cli:jar:1.2: Failure to find org.apache:apache:pom:4 in http://localhost:8081/nexus/content/groups/public/ was cached in the local repository, resolution will not be reattempted until the update interval of public has elapsed or updates are forced -> [Help 1] org.apache.maven.lifecycle.LifecycleExecutionException: Failed to execute goal org.apache.maven.plugins:maven-compiler-plugin:3.5:compile (default-compile) on project mytest-web: Execution default-compile of goal org.apache.maven.plugins:maven-compiler-plugin:3.5:compile failed: Plugin org.apache.maven.plugins:maven-compiler-plugin:3.5 or one of its dependencies could not be resolved: Failed to collect dependencies at org.apache.maven.plugins:maven-compiler-plugin:jar:3.5 -> org.apache.maven:maven-toolchain:jar:2.2.1 -> org.apache.maven:maven-core:jar:2.2.1 -> commons-cli:commons-cli:jar:1.2 at org.apache.maven.lifecycle.internal.MojoExecutor.execute(MojoExecutor.java:213) at org.apache.maven.lifecycle.internal.MojoExecutor.execute(MojoExecutor.java:154) at org.apache.maven.lifecycle.internal.MojoExecutor.execute(MojoExecutor.java:146) at org.apache.maven.lifecycle.internal.LifecycleModuleBuilder.buildProject(LifecycleModuleBuilder.java:117) at org.apache.maven.lifecycle.internal.LifecycleModuleBuilder.buildProject(LifecycleModuleBuilder.java:81) at org.apache.maven.lifecycle.internal.builder.singlethreaded.SingleThreadedBuilder.build(SingleThreadedBuilder.java:51) at org.apache.maven.lifecycle.internal.LifecycleStarter.execute(LifecycleStarter.java:128) at org.apache.maven.DefaultMaven.doExecute(DefaultMaven.java:309) at org.apache.maven.DefaultMaven.doExecute(DefaultMaven.java:194) at org.apache.maven.DefaultMaven.execute(DefaultMaven.java:107) at org.apache.maven.cli.MavenCli.execute(MavenCli.java:993) at org.apache.maven.cli.MavenCli.doMain(MavenCli.java:345) at org.apache.maven.cli.MavenCli.main(MavenCli.java:191) at sun.reflect.NativeMethodAccessorImpl.invoke0(Native Method) at sun.reflect.NativeMethodAccessorImpl.invoke(NativeMethodAccessorImpl.java:62) at sun.reflect.DelegatingMethodAccessorImpl.invoke(DelegatingMethodAccessorImpl.java:43) at java.lang.reflect.Method.invoke(Method.java:498) at org.codehaus.plexus.classworlds.launcher.Launcher.launchEnhanced(Launcher.java:289) at org.codehaus.plexus.classworlds.launcher.Launcher.launch(Launcher.java:229) at org.codehaus.plexus.classworlds.launcher.Launcher.mainWithExitCode(Launcher.java:415) at org.codehaus.plexus.classworlds.launcher.Launcher.main(Launcher.java:356) Caused by: org.apache.maven.plugin.PluginExecutionException: Execution default-compile of goal org.apache.maven.plugins:maven-compiler-plugin:3.5:compile failed: Plugin org.apache.maven.plugins:maven-compiler-plugin:3.5 or one of its dependencies could not be resolved: Failed to collect dependencies at org.apache.maven.plugins:maven-compiler-plugin:jar:3.5 -> org.apache.maven:maven-toolchain:jar:2.2.1 -> org.apache.maven:maven-core:jar:2.2.1 -> commons-cli:commons-cli:jar:1.2 at org.apache.maven.plugin.DefaultBuildPluginManager.executeMojo(DefaultBuildPluginManager.java:106) at org.apache.maven.lifecycle.internal.MojoExecutor.execute(MojoExecutor.java:208) ... 20 more Caused by: org.apache.maven.plugin.PluginResolutionException: Plugin org.apache.maven.plugins:maven-compiler-plugin:3.5 or one of its dependencies could not be resolved: Failed to collect dependencies at org.apache.maven.plugins:maven-compiler-plugin:jar:3.5 -> org.apache.maven:maven-toolchain:jar:2.2.1 -> org.apache.maven:maven-core:jar:2.2.1 -> commons-cli:commons-cli:jar:1.2 at org.apache.maven.plugin.internal.DefaultPluginDependenciesResolver.resolveInternal(DefaultPluginDependenciesResolver.java:214) at org.apache.maven.plugin.internal.DefaultPluginDependenciesResolver.resolve(DefaultPluginDependenciesResolver.java:149) at org.apache.maven.plugin.internal.DefaultMavenPluginManager.createPluginRealm(DefaultMavenPluginManager.java:402) at org.apache.maven.plugin.internal.DefaultMavenPluginManager.setupPluginRealm(DefaultMavenPluginManager.java:374) at org.apache.maven.plugin.DefaultBuildPluginManager.getPluginRealm(DefaultBuildPluginManager.java:231) at org.apache.maven.plugin.DefaultBuildPluginManager.executeMojo(DefaultBuildPluginManager.java:102) ... 21 more Caused by: org.eclipse.aether.collection.DependencyCollectionException: Failed to collect dependencies at org.apache.maven.plugins:maven-compiler-plugin:jar:3.5 -> org.apache.maven:maven-toolchain:jar:2.2.1 -> org.apache.maven:maven-core:jar:2.2.1 -> commons-cli:commons-cli:jar:1.2 at org.eclipse.aether.internal.impl.DefaultDependencyCollector.collectDependencies(DefaultDependencyCollector.java:300) at org.eclipse.aether.internal.impl.DefaultRepositorySystem.collectDependencies(DefaultRepositorySystem.java:325) at org.apache.maven.plugin.internal.DefaultPluginDependenciesResolver.resolveInternal(DefaultPluginDependenciesResolver.java:202) ... 26 more Caused by: org.eclipse.aether.resolution.ArtifactDescriptorException: Failed to read artifact descriptor for commons-cli:commons-cli:jar:1.2 at org.apache.maven.repository.internal.DefaultArtifactDescriptorReader.loadPom(DefaultArtifactDescriptorReader.java:330) at org.apache.maven.repository.internal.DefaultArtifactDescriptorReader.readArtifactDescriptor(DefaultArtifactDescriptorReader.java:199) at org.eclipse.aether.internal.impl.DefaultDependencyCollector.resolveCachedArtifactDescriptor(DefaultDependencyCollector.java:544) at org.eclipse.aether.internal.impl.DefaultDependencyCollector.getArtifactDescriptorResult(DefaultDependencyCollector.java:528) at org.eclipse.aether.internal.impl.DefaultDependencyCollector.processDependency(DefaultDependencyCollector.java:418) at org.eclipse.aether.internal.impl.DefaultDependencyCollector.processDependency(DefaultDependencyCollector.java:372) at org.eclipse.aether.internal.impl.DefaultDependencyCollector.process(DefaultDependencyCollector.java:360) at org.eclipse.aether.internal.impl.DefaultDependencyCollector.doRecurse(DefaultDependencyCollector.java:513) at org.eclipse.aether.internal.impl.DefaultDependencyCollector.processDependency(DefaultDependencyCollector.java:467) at org.eclipse.aether.internal.impl.DefaultDependencyCollector.processDependency(DefaultDependencyCollector.java:372) at org.eclipse.aether.internal.impl.DefaultDependencyCollector.process(DefaultDependencyCollector.java:360) at org.eclipse.aether.internal.impl.DefaultDependencyCollector.doRecurse(DefaultDependencyCollector.java:513) at org.eclipse.aether.internal.impl.DefaultDependencyCollector.processDependency(DefaultDependencyCollector.java:467) at org.eclipse.aether.internal.impl.DefaultDependencyCollector.processDependency(DefaultDependencyCollector.java:372) at org.eclipse.aether.internal.impl.DefaultDependencyCollector.process(DefaultDependencyCollector.java:360) at org.eclipse.aether.internal.impl.DefaultDependencyCollector.collectDependencies(DefaultDependencyCollector.java:263) ... 28 more Caused by: org.apache.maven.model.resolution.UnresolvableModelException: Failure to find org.apache:apache:pom:4 in http://localhost:8081/nexus/content/groups/public/ was cached in the local repository, resolution will not be reattempted until the update interval of public has elapsed or updates are forced at org.apache.maven.repository.internal.DefaultModelResolver.resolveModel(DefaultModelResolver.java:178) at org.apache.maven.repository.internal.DefaultModelResolver.resolveModel(DefaultModelResolver.java:224) at org.apache.maven.model.building.DefaultModelBuilder.readParentExternally(DefaultModelBuilder.java:1051) at org.apache.maven.model.building.DefaultModelBuilder.readParent(DefaultModelBuilder.java:829) at org.apache.maven.model.building.DefaultModelBuilder.build(DefaultModelBuilder.java:331) at org.apache.maven.repository.internal.DefaultArtifactDescriptorReader.loadPom(DefaultArtifactDescriptorReader.java:321) ... 43 more Caused by: org.eclipse.aether.resolution.ArtifactResolutionException: Failure to find org.apache:apache:pom:4 in http://localhost:8081/nexus/content/groups/public/ was cached in the local repository, resolution will not be reattempted until the update interval of public has elapsed or updates are forced at org.eclipse.aether.internal.impl.DefaultArtifactResolver.resolve(DefaultArtifactResolver.java:453) at org.eclipse.aether.internal.impl.DefaultArtifactResolver.resolveArtifacts(DefaultArtifactResolver.java:255) at org.eclipse.aether.internal.impl.DefaultArtifactResolver.resolveArtifact(DefaultArtifactResolver.java:232) at org.apache.maven.repository.internal.DefaultModelResolver.resolveModel(DefaultModelResolver.java:174) ... 48 more Caused by: org.eclipse.aether.transfer.ArtifactNotFoundException: Failure to find org.apache:apache:pom:4 in http://localhost:8081/nexus/content/groups/public/ was cached in the local repository, resolution will not be reattempted until the update interval of public has elapsed or updates are forced at org.eclipse.aether.internal.impl.DefaultUpdateCheckManager.newException(DefaultUpdateCheckManager.java:240) at org.eclipse.aether.internal.impl.DefaultUpdateCheckManager.checkArtifact(DefaultUpdateCheckManager.java:215) at org.eclipse.aether.internal.impl.DefaultArtifactResolver.gatherDownloads(DefaultArtifactResolver.java:594) at org.eclipse.aether.internal.impl.DefaultArtifactResolver.performDownloads(DefaultArtifactResolver.java:512) at org.eclipse.aether.internal.impl.DefaultArtifactResolver.resolve(DefaultArtifactResolver.java:430) ... 51 more [ERROR] [ERROR] Re-run Maven using the -X switch to enable full debug logging. [ERROR] [ERROR] For more information about the errors and possible solutions, please read the following articles: [ERROR] [Help 1] http://cwiki.apache.org/confluence/display/MAVEN/PluginResolutionException

刚从svn检出的项目 ,转换成maven项目后报错

Failure to transfer org.apache.maven.plugins:maven-resources-plugin:pom:2.6 from https://repo.maven.apache.org/maven2 was cached in the local repository, resolution will not be reattempted until the update interval of central has elapsed or updates are forced. Original error: Could not transfer artifact org.apache.maven.plugins:maven-resources-plugin:pom:2.6 from/to central (https://repo.maven.apache.org/maven2): The operation was cancelled.

Maven项目出现报错:the type is not generic

Maven项目重写了pom文件编译之后出现一个问题:The type SqlMapClientCallback is not generic; it cannot be parameterized with arguments <Boolean> 请问大神有遇到这种情况怎么解决?![图片说明](https://img-ask.csdn.net/upload/201711/07/1510020581_124179.png) ![图片说明](https://img-ask.csdn.net/upload/201711/07/1510020659_776193.png) ![图片说明](https://img-ask.csdn.net/upload/201711/07/1510020675_409000.png)

maven项目报错:找不到applicationContext.xml

myeclipse2016 maven创建的ssm项目,老是报找不到applicationContext.xml。可是我根本没有这个配置文件啊,我用其他的命名的!关键是还影响使用! 严重: Exception sending context initialized event to listener instance of class org.springframework.web.context.ContextLoaderListener org.springframework.beans.factory.BeanDefinitionStoreException: IOException parsing XML document from ServletContext resource [/classpth:applicationContext.xml]; nested exception is java.io.FileNotFoundException: Could not open ServletContext resource [/classpth:applicationContext.xml] at org.springframework.beans.factory.xml.XmlBeanDefinitionReader.loadBeanDefinitions(XmlBeanDefinitionReader.java:341) at org.springframework.beans.factory.xml.XmlBeanDefinitionReader.loadBeanDefinitions(XmlBeanDefinitionReader.java:302) at org.springframework.beans.factory.support.AbstractBeanDefinitionReader.loadBeanDefinitions(AbstractBeanDefinitionReader.java:174) at org.springframework.beans.factory.support.AbstractBeanDefinitionReader.loadBeanDefinitions(AbstractBeanDefinitionReader.java:209) at org.springframework.beans.factory.support.AbstractBeanDefinitionReader.loadBeanDefinitions(AbstractBeanDefinitionReader.java:180) at org.springframework.web.context.support.XmlWebApplicationContext.loadBeanDefinitions(XmlWebApplicationContext.java:125) at org.springframework.web.context.support.XmlWebApplicationContext.loadBeanDefinitions(XmlWebApplicationContext.java:94) at org.springframework.context.support.AbstractRefreshableApplicationContext.refreshBeanFactory(AbstractRefreshableApplicationContext.java:130) at org.springframework.context.support.AbstractApplicationContext.obtainFreshBeanFactory(AbstractApplicationContext.java:537) at org.springframework.context.support.AbstractApplicationContext.refresh(AbstractApplicationContext.java:451) at org.springframework.web.context.ContextLoader.configureAndRefreshWebApplicationContext(ContextLoader.java:410) at org.springframework.web.context.ContextLoader.initWebApplicationContext(ContextLoader.java:306) at org.springframework.web.context.ContextLoaderListener.contextInitialized(ContextLoaderListener.java:112) at org.apache.catalina.core.StandardContext.listenerStart(StandardContext.java:4994) at org.apache.catalina.core.StandardContext.startInternal(StandardContext.java:5492) at org.apache.catalina.util.LifecycleBase.start(LifecycleBase.java:150) at org.apache.catalina.core.ContainerBase.addChildInternal(ContainerBase.java:901) at org.apache.catalina.core.ContainerBase.addChild(ContainerBase.java:877) at org.apache.catalina.core.StandardHost.addChild(StandardHost.java:649) at org.apache.catalina.startup.HostConfig.deployDirectory(HostConfig.java:1245) at org.apache.catalina.startup.HostConfig$DeployDirectory.run(HostConfig.java:1895) at java.util.concurrent.Executors$RunnableAdapter.call(Executors.java:511) at java.util.concurrent.FutureTask.run(FutureTask.java:266) at java.util.concurrent.ThreadPoolExecutor.runWorker(ThreadPoolExecutor.java:1149) at java.util.concurrent.ThreadPoolExecutor$Worker.run(ThreadPoolExecutor.java:624) at java.lang.Thread.run(Thread.java:748) Caused by: java.io.FileNotFoundException: Could not open ServletContext resource [/classpth:applicationContext.xml] at org.springframework.web.context.support.ServletContextResource.getInputStream(ServletContextResource.java:140) at org.springframework.beans.factory.xml.XmlBeanDefinitionReader.loadBeanDefinitions(XmlBeanDefinitionReader.java:328) ... 25 more 八月 18, 2017 11:43:45 下午 org.apache.catalina.core.StandardContext startInternal 严重: Error listenerStart 八月 18, 2017 11:43:45 下午 org.apache.catalina.core.StandardContext startInternal 严重: Context [/ssm] startup failed due to previous errors 八月 18, 2017 11:43:45 下午 org.apache.catalina.core.ApplicationContext log 信息: Closing Spring root WebApplicationContext 八月 18, 2017 11:43:45 下午 org.apache.catalina.core.StandardContext listenerStop 严重: Exception sending context destroyed event to listener instance of class org.springframework.web.context.ContextLoaderListener java.lang.IllegalStateException: BeanFactory not initialized or already closed - call 'refresh' before accessing beans via the ApplicationContext at org.springframework.context.support.AbstractRefreshableApplicationContext.getBeanFactory(AbstractRefreshableApplicationContext.java:171) at org.springframework.context.support.AbstractApplicationContext.destroyBeans(AbstractApplicationContext.java:1090) at org.springframework.context.support.AbstractApplicationContext.doClose(AbstractApplicationContext.java:1064) at org.springframework.context.support.AbstractApplicationContext.close(AbstractApplicationContext.java:1010) at org.springframework.web.context.ContextLoader.closeWebApplicationContext(ContextLoader.java:586) at org.springframework.web.context.ContextLoaderListener.contextDestroyed(ContextLoaderListener.java:143) at org.apache.catalina.core.StandardContext.listenerStop(StandardContext.java:5035) at org.apache.catalina.core.StandardContext.stopInternal(StandardContext.java:5687) at org.apache.catalina.util.LifecycleBase.stop(LifecycleBase.java:232) at org.apache.catalina.util.LifecycleBase.start(LifecycleBase.java:160) at org.apache.catalina.core.ContainerBase.addChildInternal(ContainerBase.java:901) at org.apache.catalina.core.ContainerBase.addChild(ContainerBase.java:877) at org.apache.catalina.core.StandardHost.addChild(StandardHost.java:649) at org.apache.catalina.startup.HostConfig.deployDirectory(HostConfig.java:1245) at org.apache.catalina.startup.HostConfig$DeployDirectory.run(HostConfig.java:1895) at java.util.concurrent.Executors$RunnableAdapter.call(Executors.java:511) at java.util.concurrent.FutureTask.run(FutureTask.java:266) at java.util.concurrent.ThreadPoolExecutor.runWorker(ThreadPoolExecutor.java:1149) at java.util.concurrent.ThreadPoolExecutor$Worker.run(ThreadPoolExecutor.java:624) at java.lang.Thread.run(Thread.java:748)

maven报错:PKIX path building failed: sun.security.provider.certpath.SunCertPathBuilderException

<h3>救救孩子吧!</h3> IDEA使用maven下载jar包的时候,出现以下错误: > Could not transfer artifact org.springframework:spring-context:pom:5.1.5.RELEASE from/to alimaven (http://maven.aliyun.com/nexus/content/groups/public/): sun.security.validator.ValidatorException: PKIX path building failed: sun.security.provider.certpath.SunCertPathBuilderException: unable to find valid certification path to requested target 我试了网上的方法,把证书添加到jre的security文件夹里,之后还是报错。 然后试了加上运行参数,忽略证书,还是报错。 然后换了maven的源,也还是报错。 clean install reimport能试的都试了。总是报这个错误。(报完错之后,对应的jar包在本地仓库里面下载的是一个*.lastupdate文件,没法使用) 有没有大佬救救孩子,昨晚到今天上午一直在弄,快哭出来了....

myeclipse建立maven项目总是报错!急急急!

已经配置好了maven 加入到了环境变量中,用命令行 输入 mvn -v也显示安装成功 在myeclipse 8.6 中也配置好了maven 都是按网上一步步来的,可是总是出错

Maven创建项目报错,archetype:create创建报错

使用mvn archetype:create创建maven的web项目报错。 ``` mvn archetype:create -DgroupId=com.mycompany.app -DartifactId=myWebApp -DarchetypeArtifactId=maven-archetype-webapp -DinteractiveMode=false ``` 各位大神们看看什么问题呀! 然而使用mvn archetype:generate创建maven的web项目就可以顺利创建。但是所费时间较长大概40秒左右吧 错误: ![图片说明](https://img-ask.csdn.net/upload/201602/03/1454489967_604743.png)

maven module 打包报错问题

maven结构如下: ![图片说明](https://img-ask.csdn.net/upload/201707/10/1499654181_120999.png) 当加入web时打包报提示: **Failed to execute goal org.apache.maven.plugins:maven-war-plugin:2.2:war (default-war)** 后增加 **<plugins> <plugin> <groupId>org.apache.maven.plugins</groupId> <artifactId>maven-war-plugin</artifactId> <version>2.4</version> <configuration> <webResources> <resource> <directory>src\main\webapp</directory> </resource> </webResources> </configuration> </plugin> </plugins>** 却又提示 **[INFO] Processing war project [INFO] Copying webapp webResources [E:\workspace\itm.root\itm.client\src\main\webapp] to [E:\workspace\itm.root\itm.client\target\itm.client] [INFO] Copying webapp resources [E:\workspace\itm.root\itm.client\src\main\webapp] java.lang.Error: Cleaner terminated abnormally at sun.misc.Cleaner$1.run(Cleaner.java:148) at sun.misc.Cleaner$1.run(Cleaner.java:145) at java.security.AccessController.doPrivileged(Native Method) at sun.misc.Cleaner.clean(Cleaner.java:145) at sun.nio.ch.FileChannelImpl.unmap(FileChannelImpl.java:849) at sun.nio.ch.FileChannelImpl.transferFromFileChannel(FileChannelImpl.java:647) at sun.nio.ch.FileChannelImpl.transferFrom(FileChannelImpl.java:708) at org.codehaus.plexus.util.FileUtils.doCopyFile(FileUtils.java:1077) at org.codehaus.plexus.util.FileUtils.copyFile(FileUtils.java:1049) at org.apache.maven.plugin.war.packaging.AbstractWarPackagingTask.copyFile(AbstractWarPackagingTask.java:334) at org.apache.maven.plugin.war.packaging.AbstractWarPackagingTask$1.registered(AbstractWarPackagingTask.java:154) at org.apache.maven.plugin.war.util.WebappStructure.registerFile(WebappStructure.java:207) at org.apache.maven.plugin.war.packaging.AbstractWarPackagingTask.copyFile(AbstractWarPackagingTask.java:149) at org.apache.maven.plugin.war.packaging.ArtifactsPackagingTask.performPackaging(ArtifactsPackagingTask.java:110) at org.apache.maven.plugin.war.packaging.WarProjectPackagingTask.handleArtifacts(WarProjectPackagingTask.java:194) at org.apache.maven.plugin.war.packaging.WarProjectPackagingTask.performPackaging(WarProjectPackagingTask.java:106) at org.apache.maven.plugin.war.AbstractWarMojo.buildWebapp(AbstractWarMojo.java:505) at org.apache.maven.plugin.war.AbstractWarMojo.buildExplodedWebapp(AbstractWarMojo.java:433) at org.apache.maven.plugin.war.WarMojo.performPackaging(WarMojo.java:213) at org.apache.maven.plugin.war.WarMojo.execute(WarMojo.java:175) at org.apache.maven.plugin.DefaultBuildPluginManager.executeMojo(DefaultBuildPluginManager.java:134) at org.apache.maven.lifecycle.internal.MojoExecutor.execute(MojoExecutor.java:207) at org.apache.maven.lifecycle.internal.MojoExecutor.execute(MojoExecutor.java:153) at org.apache.maven.lifecycle.internal.MojoExecutor.execute(MojoExecutor.java:145) at org.apache.maven.lifecycle.internal.LifecycleModuleBuilder.buildProject(LifecycleModuleBuilder.java:116) at org.apache.maven.lifecycle.internal.LifecycleModuleBuilder.buildProject(LifecycleModuleBuilder.java:80) at org.apache.maven.lifecycle.internal.builder.singlethreaded.SingleThreadedBuilder.build(SingleThreadedBuilder.java:51) at org.apache.maven.lifecycle.internal.LifecycleStarter.execute(LifecycleStarter.java:128) at org.apache.maven.DefaultMaven.doExecute(DefaultMaven.java:307) at org.apache.maven.DefaultMaven.doExecute(DefaultMaven.java:193) at org.apache.maven.DefaultMaven.execute(DefaultMaven.java:106) at org.apache.maven.cli.MavenCli.execute(MavenCli.java:863) at org.apache.maven.cli.MavenCli.doMain(MavenCli.java:288) at org.apache.maven.cli.MavenCli.main(MavenCli.java:199) at sun.reflect.NativeMethodAccessorImpl.invoke0(Native Method) at sun.reflect.NativeMethodAccessorImpl.invoke(NativeMethodAccessorImpl.java:62) at sun.reflect.DelegatingMethodAccessorImpl.invoke(DelegatingMethodAccessorImpl.java:43) at java.lang.reflect.Method.invoke(Method.java:498) at org.codehaus.plexus.classworlds.launcher.Launcher.launchEnhanced(Launcher.java:289) at org.codehaus.plexus.classworlds.launcher.Launcher.launch(Launcher.java:229) at org.codehaus.plexus.classworlds.launcher.Launcher.mainWithExitCode(Launcher.java:415) at org.codehaus.plexus.classworlds.launcher.Launcher.main(Launcher.java:356) Caused by: java.io.IOException: 试图访问无效的地址。 at sun.nio.ch.FileChannelImpl.unmap0(Native Method) at sun.nio.ch.FileChannelImpl.access$000(FileChannelImpl.java:50) at sun.nio.ch.FileChannelImpl$Unmapper.run(FileChannelImpl.java:826) at sun.misc.Cleaner.clean(Cleaner.java:143) ... 38 more **

创建mavenweb项目报错

Could not resolve archetype org.apache.maven.archetypes:maven-archetype-webapp:1.0 from any of the configured repositories. Could not resolve artifact org.apache.maven.archetypes:maven-archetype-webapp:pom:1.0 Failure to transfer org.apache.maven.archetypes:maven-archetype-webapp:pom:1.0 from http://repo.maven.apache.org/maven2 was cached in the local repository, resolution will not be reattempted until the update interval of central has elapsed or updates are forced. Original error: Could not transfer artifact org.apache.maven.archetypes:maven-archetype-webapp:pom:1.0 from/to central (http://repo.maven.apache.org/maven2): connection timed out to http://repo.maven.apache.org/maven2/org/apache/maven/archetypes/maven-archetype-webapp/1.0/maven-archetype-webapp-1.0.pom Failure to transfer org.apache.maven.archetypes:maven-archetype-webapp:pom:1.0 from http://repo.maven.apache.org/maven2 was cached in the local repository, resolution will not be reattempted until the update interval of central has elapsed or updates are forced. Original error: Could not transfer artifact org.apache.maven.archetypes:maven-archetype-webapp:pom:1.0 from/to central (http://repo.maven.apache.org/maven2):

intellij idea导入eclipse创建的maven web项目 jar包导入总是报错

** 软件环境**: spring+springMVC+mybatis+ mysql; tomcat服务器; maven项目 eclipse工具运行正常; **问题描述:** maven的jar包依赖没有导入成功,maven配置正常 沿用了阿里云的中心库eclipse可用; 报错截图1: ![图片说明](https://img-ask.csdn.net/upload/201811/12/1542032523_181718.png) ``` nformation:java: Errors occurred while compiling module 'miaolanghzong' Information:Eclipse compiler 4.7.2 was used to compile java sources Information:2018/11/12 21:56 - Compilation completed with 133 errors and 418 warnings in 29 s 620 ms D:\career\workspaceTest2\erzhentang\src\main\java\com\app\totalController\MemberBusinessController.java Error:Error:line (1)java: Syntax error on token "Invalid Character", delete this token Error:Error:line (13)java: The import javax.servlet.http.HttpServletRequest cannot be resolved Error:Error:line (14)java: The import javax.servlet.http.HttpServletResponse cannot be resolved Error:Error:line (47)java: The import com.google.gson cannot be resolved Error:Error:line (659)java: HttpServletRequest cannot be resolved to a type Error:Error:line (659)java: HttpServletResponse cannot be resolved to a type Error:Error:line (623)java: HttpServletRequest cannot be resolved to a type Error:Error:line (623)java: HttpServletResponse cannot be resolved to a type Error:Error:line (894)java: HttpServletRequest cannot be resolved to a type Error:Error:line (894)java: HttpServletResponse cannot be resolved to a type Error:Error:line (806)java: HttpServletRequest cannot be resolved to a type Error:Error:line (806)java: HttpServletResponse cannot be resolved to a type Error:Error:line (198)java: HttpServletRequest cannot be resolved to a type Error:Error:line (198)java: HttpServletResponse cannot be resolved to a type Error:Error:line (277)java: HttpServletRequest cannot be resolved to a type Error:Error:line (277)java: HttpServletResponse cannot be resolved to a type Error:Error:line (134)java: HttpServletRequest cannot be resolved to a type Error:Error:line (134)java: HttpServletResponse cannot be resolved to a type Error:Error:line (460)java: HttpServletRequest cannot be resolved to a type Error:Error:line (460)java: HttpServletResponse cannot be resolved to a type Error:Error:line (540)java: HttpServletRequest cannot be resolved to a type Error:Error:line (540)java: HttpServletResponse cannot be resolved to a type Error:Error:line (109)java: HttpServletRequest cannot be resolved to a type Error:Error:line (109)java: HttpServletResponse cannot be resolved to a type Error:Error:line (411)java: HttpServletRequest cannot be resolved to a type Error:Error:line (411)java: HttpServletResponse cannot be resolved to a type Warning:Warning:line (114)java: The static method sendCode(java.lang.String) from the type com.app.util.Alidayu should be accessed in a static way Warning:Warning:line (154)java: The static method md5Encode(java.lang.String) from the type com.app.util.MD5Util should be accessed in a static way Warning:Warning:line (207)java: The static method md5Encode(java.lang.String) from the type com.app.util.MD5Util should be accessed in a static way Warning:Warning:line (286)java: The static method md5Encode(java.lang.String) from the type com.app.util.MD5Util should be accessed in a static way Warning:Warning:line (421)java: The static method md5Encode(java.lang.String) from the type com.app.util.MD5Util should be accessed in a static way Warning:Warning:line (469)java: The static method md5Encode(java.lang.String) from the type com.app.util.MD5Util should be accessed in a static way Warning:Warning:line (549)java: The static method md5Encode(java.lang.String) from the type com.app.util.MD5Util should be accessed in a static way D:\career\workspaceTest2\erzhentang\src\main\java\com\app\common\LoginFilter.java Error:Error:line (23)java: Filter cannot be resolved to a type Error:Error:line (37)java: ServletException cannot be resolved to a type Error:Error:line (36)java: ServletRequest cannot be resolved to a type Error:Error:line (36)java: ServletResponse cannot be resolved to a type Error:Error:line (37)java: FilterChain cannot be resolved to a type Error:Error:line (106)java: ServletException cannot be resolved to a type Error:Error:line (106)java: FilterConfig cannot be resolved to a type Error:Error:line (7)java: The import javax.servlet.Filter cannot be resolved Error:Error:line (8)java: The import javax.servlet.FilterChain cannot be resolved Error:Error:line (9)java: The import javax.servlet.FilterConfig cannot be resolved Error:Error:line (10)java: The import javax.servlet.ServletException cannot be resolved Error:Error:line (11)java: The import javax.servlet.ServletRequest cannot be resolved Error:Error:line (12)java: The import javax.servlet.ServletResponse cannot be resolved Error:Error:line (13)java: The import javax.servlet.http.HttpServletRequest cannot be resolved Error:Error:line (14)java: The import javax.servlet.http.HttpServletResponse cannot be resolved Error:Error:line (15)java: The import javax.servlet.http.HttpSession cannot be resolved Error:Error:line (24)java: FilterConfig cannot be resolved to a type Warning:Warning:line (26)java: java.util.List is a raw type. References to generic type java.util.List<E> should be parameterized Warning:Warning:line (28)java: java.util.List is a raw type. References to generic type java.util.List<E> should be parameterized Error:Error:line (33)java: FilterConfig cannot be resolved to a type Error:Error:line (39)java: HttpServletRequest cannot be resolved to a type Error:Error:line (39)java: HttpServletRequest cannot be resolved to a type Error:Error:line (40)java: HttpServletResponse cannot be resolved to a type Error:Error:line (40)java: HttpServletResponse cannot be resolved to a type Error:Error:line (41)java: HttpSession cannot be resolved to a type Error:Error:line (107)java: FilterConfig cannot be resolved to a type Error:Error:line (108)java: FilterConfig cannot be resolved to a type Error:Error:line (113)java: FilterConfig cannot be resolved to a type D:\career\workspaceTest2\erzhentang\src\main\java\com\app\dao\impl\MemberDaoImpl.java Warning:Warning:line (42)java: java.util.Map is a raw type. References to generic type java.util.Map<K,V> should be parameterized Warning:Warning:line (63)java: java.util.Map is a raw type. References to generic type java.util.Map<K,V> should be parameterized Warning:Warning:line (110)java: java.util.Map is a raw type. References to generic type java.util.Map<K,V> should be parameterized Warning:Warning:line (9)java: The import com.app.bean.Menu is never used D:\career\workspaceTest2\erzhentang\src\main\java\com\app\dao\impl\EarProblemDaoImpl.java Warning:Warning:line (18)java: java.util.Map is a raw type. References to generic type java.util.Map<K,V> should be parameterized Warning:Warning:line (48)java: java.util.Map is a raw type. References to generic type java.util.Map<K,V> should be parameterized D:\career\workspaceTest2\erzhentang\src\main\java\com\app\dao\impl\BodyConclusionDaoImpl.java Warning:Warning:line (25)java: java.util.Map is a raw type. References to generic type java.util.Map<K,V> should be parameterized Warning:Warning:line (11)java: The import com.app.bean.BodyConclusionWuxing is never used D:\career\workspaceTest2\erzhentang\src\main\java\com\app\dao\mapper\EarDisease100Mapper.java Warning:Warning:line (14)java: java.util.Map is a raw type. References to generic type java.util.Map<K,V> should be parameterized D:\career\workspaceTest2\erzhentang\src\main\java\com\app\dao\BlueToochMacDao.java Warning:Warning:line (12)java: java.util.Map is a raw type. References to generic type java.util.Map<K,V> should be parameterized Warning:Warning:line (14)java: java.util.Map is a raw type. References to generic type java.util.Map<K,V> should be parameterized D:\career\workspaceTest2\erzhentang\src\main\java\com\app\dao\EarScanC ``` ![图片说明](https://img-ask.csdn.net/upload/201811/12/1542031436_513761.png) ![图片说明](https://img-ask.csdn.net/upload/201811/12/1542031687_784746.png) ![图片说明](https://img-ask.csdn.net/upload/201811/12/1542031723_457809.png) ![图片说明](https://img-ask.csdn.net/upload/201811/12/1542031745_434340.png) ![图片说明](https://img-ask.csdn.net/upload/201811/12/1542031762_172605.png) ![图片说明](https://img-ask.csdn.net/upload/201811/12/1542031776_649119.png)

maven项目构建报错 难受

18-10-31 上午09时30分50秒: Generating sources /HDTW1/pom.xml 18-10-31 上午09时30分50秒: Build error for /HDTW1/pom.xml; org.apache.maven.lifecycle.LifecycleExecutionException: Failed to execute goal org.apache.maven.plugins:maven-resources-plugin:3.0.2:resources (default-resources) on project HDTW1: Execution default-resources of goal org.apache.maven.plugins:maven-resources-plugin:3.0.2:resources failed: Unable to load the mojo 'resources' (or one of its required components) from the plugin 'org.apache.maven.plugins:maven-resources-plugin:3.0.2' 18-10-31 上午09时30分50秒: Adding source folder /HDTW1/src/main/java 18-10-31 上午09时30分50秒: Adding source folder /HDTW1/src/test/java 18-10-31 上午09时30分50秒: Update completed: 0 sec 18-10-31 上午09时30分50秒: Maven Builder: AUTO_BUILD 这是什么情况啊? 这个JAR包 存在的啊 我都能找到 有没大神告诉我一下咋个处理

新导入的maven项目pom报错

``` <dependency> <groupId>oracle.jdbc</groupId> <artifactId>ojdbc</artifactId> <version>6</version> </dependency> <dependency> ``` 提示missing 还有头部报错: Failure to transfer org.codehaus.plexus:plexus-archiver:pom:1.0 from http://repo1.maven.org/maven2 was cached in the local repository, resolution will not be reattempted until the update interval of central has elapsed or updates are forced. Original error: Could not transfer artifact org.codehaus.plexus:plexus-archiver:pom:1.0 from/to central (http:// repo1.maven.org/maven2): No response received after 60000 ``` <?xml version="1.0" encoding="UTF-8"?> <web-app xmlns="http://xmlns.jcp.org/xml/ns/javaee" xmlns:xsi="http://www.w3.org/2001/XMLSchema-instance" xsi:schemaLocation="http://xmlns.jcp.org/xml/ns/javaee http://xmlns.jcp.org/xml/ns/javaee/web-app_3_1.xsd" version="3.1"> ``` 还有就是web.xml中welcom-file-list报错 Multiple annotations found at this line: - cvc-complex-type.2.3: Element 'welcome-file-list' cannot have character [children], because the type's content type is element-only. - cvc-complex-type.2.4.b: The content of element 'welcome-file-list' is not complete. One of '{"http:// xmlns.jcp.org/xml/ns/javaee":welcome-file}' is expected. ``` <welcome-file-list> index.jsp </welcome-file-list> ```

maven打包报错,用命令打包的mvn package 接着报这个错,急等

![图片说明](https://img-ask.csdn.net/upload/201802/02/1517553010_852643.png) ![图片说明](https://img-ask.csdn.net/upload/201802/02/1517553902_211162.png) jdk用的1.8 pom.xml配置maven之后 ``` <build> <plugins> <plugin> <groupId>org.apache.maven.plugins</groupId> <artifactId>maven-compiler-plugin</artifactId> <version>3.3</version> <configuration> <source>1.8</source> <target>1.8</target> </configuration> </plugin> </plugins> </build> ``` 又报错 ![图片说明](https://img-ask.csdn.net/upload/201802/02/1517557255_958482.png) 通过 ``` <build> <plugins> <plugin> <groupId>org.apache.maven.plugins</groupId> <artifactId>maven-compiler-plugin</artifactId> <version>3.3</version> <configuration> <source>1.8</source> <target>1.8</target> <encoding>UTF-8</encoding> <compilerArguments> <verbose /> <bootclasspath>${java.home}\lib\rt.jar;${java.home}\lib\jce.jar</bootclasspath> </compilerArguments> </configuration> </plugin> </plugins> </build> ``` 解决 现在发布又出现了新问题 ![图片说明](https://img-ask.csdn.net/upload/201802/02/1517560036_768869.png)

maven项目install报错,是什么原因?

[INFO] Scanning for projects... [INFO] [INFO] ------------------------------------------------------------------------ [INFO] Building taotao-parent 0.0.1-SNAPSHOT [INFO] ------------------------------------------------------------------------ [INFO] Downloading: https://repo.maven.apache.org/maven2/org/apache/maven/plugins/maven-install-plugin/2.4/maven-install-plugin-2.4.pom [INFO] ------------------------------------------------------------------------ [INFO] BUILD FAILURE [INFO] ------------------------------------------------------------------------ [INFO] Total time: 2.921 s [INFO] Finished at: 2018-11-19T21:35:56+08:00 [INFO] Final Memory: 5M/15M [INFO] ------------------------------------------------------------------------ [ERROR] Plugin org.apache.maven.plugins:maven-install-plugin:2.4 or one of its dependencies could not be resolved: Failed to read artifact descriptor for org.apache.maven.plugins:maven-install-plugin:jar:2.4: Could not transfer artifact org.apache.maven.plugins:maven-install-plugin:pom:2.4 from/to central (https://repo.maven.apache.org/maven2): Received fatal alert: protocol_version -> [Help 1] [ERROR] [ERROR] To see the full stack trace of the errors, re-run Maven with the -e switch. [ERROR] Re-run Maven using the -X switch to enable full debug logging. [ERROR] [ERROR] For more information about the errors and possible solutions, please read the following articles: [ERROR] [Help 1] http://cwiki.apache.org/confluence/display/MAVEN/PluginResolutionException

软件测试入门、SQL、性能测试、测试管理工具

软件测试2小时入门,让您快速了解软件测试基本知识,有系统的了解; SQL一小时,让您快速理解和掌握SQL基本语法 jmeter性能测试 ,让您快速了解主流来源性能测试工具jmeter 测试管理工具-禅道,让您快速学会禅道的使用,学会测试项目、用例、缺陷的管理、

计算机组成原理实验教程

西北工业大学计算机组成原理实验课唐都仪器实验帮助,同实验指导书。分为运算器,存储器,控制器,模型计算机,输入输出系统5个章节

Java 最常见的 200+ 面试题:面试必备

这份面试清单是从我 2015 年做了 TeamLeader 之后开始收集的,一方面是给公司招聘用,另一方面是想用它来挖掘在 Java 技术栈中,还有那些知识点是我不知道的,我想找到这些技术盲点,然后修复它,以此来提高自己的技术水平。虽然我是从 2009 年就开始参加编程工作了,但我依旧觉得自己现在要学的东西很多,并且学习这些知识,让我很有成就感和满足感,那所以何乐而不为呢? 说回面试的事,这份面试...

winfrom中嵌套html,跟html的交互

winfrom中嵌套html,跟html的交互,源码就在里面一看就懂,很简单

玩转Python-Python3基础入门

总课时80+,提供源码和相关资料 本课程从Python零基础到纯Python项目实战。内容详细,案例丰富,覆盖了Python知识的方方面面,学完后不仅对Python知识有个系统化的了解,让你从Python小白变编程大牛! 课程包含: 1.python安装 2.变量、数据类型和运算符 3.选择结构 4.循环结构 5.函数和模块 6.文件读写 7.了解面向对象 8.异常处理

程序员的兼职技能课

获取讲师答疑方式: 在付费视频第一节(触摸命令_ALL)片头有二维码及加群流程介绍 限时福利 原价99元,今日仅需39元!购课添加小助手(微信号:itxy41)按提示还可领取价值800元的编程大礼包! 讲师介绍: 苏奕嘉&nbsp;前阿里UC项目工程师 脚本开发平台官方认证满级(六级)开发者。 我将如何教会你通过【定制脚本】赚到你人生的第一桶金? 零基础程序定制脚本开发课程,是完全针对零脚本开发经验的小白而设计,课程内容共分为3大阶段: ①前期将带你掌握Q开发语言和界面交互开发能力; ②中期通过实战来制作有具体需求的定制脚本; ③后期将解锁脚本的更高阶玩法,打通任督二脉; ④应用定制脚本合法赚取额外收入的完整经验分享,带你通过程序定制脚本开发这项副业,赚取到你的第一桶金!

HoloLens2开发入门教程

本课程为HoloLens2开发入门教程,讲解部署开发环境,安装VS2019,Unity版本,Windows SDK,创建Unity项目,讲解如何使用MRTK,编辑器模拟手势交互,打包VS工程并编译部署应用到HoloLens上等。

基于VHDL的16位ALU简易设计

基于VHDL的16位ALU简易设计,可完成基本的加减、带进位加减、或、与等运算。

MFC一站式终极全套课程包

该套餐共包含从C小白到C++到MFC的全部课程,整套学下来绝对成为一名C++大牛!!!

利用Verilog实现数字秒表(基本逻辑设计分频器练习)

设置复位开关。当按下复位开关时,秒表清零并做好计时准备。在任何情况下只要按下复位开关,秒表都要无条件地进行复位操作,即使是在计时过程中也要无条件地进行清零操作。 设置启/停开关。当按下启/停开关后,将

董付国老师Python全栈学习优惠套餐

购买套餐的朋友可以关注微信公众号“Python小屋”,上传付款截图,然后领取董老师任意图书1本。

Python可以这样学(第一季:Python内功修炼)

董付国系列教材《Python程序设计基础》、《Python程序设计(第2版)》、《Python可以这样学》配套视频,讲解Python 3.5.x和3.6.x语法、内置对象用法、选择与循环以及函数设计与使用、lambda表达式用法、字符串与正则表达式应用、面向对象编程、文本文件与二进制文件操作、目录操作与系统运维、异常处理结构。

计算机操作系统 第三版.pdf

计算机操作系统 第三版 本书全面介绍了计算机系统中的一个重要软件——操作系统(OS),本书是第三版,对2001年出版的修订版的各章内容均作了较多的修改,基本上能反映当前操作系统发展的现状,但章节名称基

技术大佬:我去,你写的 switch 语句也太老土了吧

昨天早上通过远程的方式 review 了两名新来同事的代码,大部分代码都写得很漂亮,严谨的同时注释也很到位,这令我非常满意。但当我看到他们当中有一个人写的 switch 语句时,还是忍不住破口大骂:“我擦,小王,你丫写的 switch 语句也太老土了吧!” 来看看小王写的代码吧,看完不要骂我装逼啊。 private static String createPlayer(PlayerTypes p...

Vue.js 2.0之全家桶系列视频课程

基于新的Vue.js 2.3版本, 目前新全的Vue.js教学视频,让你少走弯路,直达技术前沿! 1. 包含Vue.js全家桶(vue.js、vue-router、axios、vuex、vue-cli、webpack、ElementUI等) 2. 采用笔记+代码案例的形式讲解,通俗易懂

微信公众平台开发入门

本套课程的设计完全是为初学者量身打造,课程内容由浅入深,课程讲解通俗易懂,代码实现简洁清晰。通过本课程的学习,学员能够入门微信公众平台开发,能够胜任企业级的订阅号、服务号、企业号的应用开发工作。 通过本课程的学习,学员能够对微信公众平台有一个清晰的、系统性的认识。例如,公众号是什么,它有什么特点,它能做什么,怎么开发公众号。 其次,通过本课程的学习,学员能够掌握微信公众平台开发的方法、技术和应用实现。例如,开发者文档怎么看,开发环境怎么搭建,基本的消息交互如何实现,常用的方法技巧有哪些,真实应用怎么开发。

150讲轻松搞定Python网络爬虫

【为什么学爬虫?】 &nbsp; &nbsp; &nbsp; &nbsp;1、爬虫入手容易,但是深入较难,如何写出高效率的爬虫,如何写出灵活性高可扩展的爬虫都是一项技术活。另外在爬虫过程中,经常容易遇到被反爬虫,比如字体反爬、IP识别、验证码等,如何层层攻克难点拿到想要的数据,这门课程,你都能学到! &nbsp; &nbsp; &nbsp; &nbsp;2、如果是作为一个其他行业的开发者,比如app开发,web开发,学习爬虫能让你加强对技术的认知,能够开发出更加安全的软件和网站 【课程设计】 一个完整的爬虫程序,无论大小,总体来说可以分成三个步骤,分别是: 网络请求:模拟浏览器的行为从网上抓取数据。 数据解析:将请求下来的数据进行过滤,提取我们想要的数据。 数据存储:将提取到的数据存储到硬盘或者内存中。比如用mysql数据库或者redis等。 那么本课程也是按照这几个步骤循序渐进的进行讲解,带领学生完整的掌握每个步骤的技术。另外,因为爬虫的多样性,在爬取的过程中可能会发生被反爬、效率低下等。因此我们又增加了两个章节用来提高爬虫程序的灵活性,分别是: 爬虫进阶:包括IP代理,多线程爬虫,图形验证码识别、JS加密解密、动态网页爬虫、字体反爬识别等。 Scrapy和分布式爬虫:Scrapy框架、Scrapy-redis组件、分布式爬虫等。 通过爬虫进阶的知识点我们能应付大量的反爬网站,而Scrapy框架作为一个专业的爬虫框架,使用他可以快速提高我们编写爬虫程序的效率和速度。另外如果一台机器不能满足你的需求,我们可以用分布式爬虫让多台机器帮助你快速爬取数据。 &nbsp; 从基础爬虫到商业化应用爬虫,本套课程满足您的所有需求! 【课程服务】 专属付费社群+每周三讨论会+1v1答疑

SEIR课程设计源码与相关城市数据.rar

SEIR结合学报与之前博客结合所做的一些改进,选择其中三个城市进行拟合仿真SEIR结合学报与之前博客结合所做的一些改进,选择其中三个城市进行拟合仿真SEIR结合学报与之前博客结合所做的一些改进,选择其

Python数据挖掘简易入门

&nbsp; &nbsp; &nbsp; &nbsp; 本课程为Python数据挖掘方向的入门课程,课程主要以真实数据为基础,详细介绍数据挖掘入门的流程和使用Python实现pandas与numpy在数据挖掘方向的运用,并深入学习如何运用scikit-learn调用常用的数据挖掘算法解决数据挖掘问题,为进一步深入学习数据挖掘打下扎实的基础。

2019 AI开发者大会

2019 AI开发者大会(AI ProCon 2019)是由中国IT社区CSDN主办的AI技术与产业年度盛会。多年经验淬炼,如今蓄势待发:2019年9月6-7日,大会将有近百位中美顶尖AI专家、知名企业代表以及千余名AI开发者齐聚北京,进行技术解读和产业论证。我们不空谈口号,只谈技术,诚挚邀请AI业内人士一起共铸人工智能新篇章!

Java面试题大全(2020版)

发现网上很多Java面试题都没有答案,所以花了很长时间搜集整理出来了这套Java面试题大全,希望对大家有帮助哈~ 本套Java面试题大全,全的不能再全,哈哈~ 一、Java 基础 1. JDK 和 JRE 有什么区别? JDK:Java Development Kit 的简称,java 开发工具包,提供了 java 的开发环境和运行环境。 JRE:Java Runtime Environ...

定量遥感中文版 梁顺林著 范闻捷译

这是梁顺林的定量遥感的中文版,由范闻捷等翻译的,是电子版PDF,解决了大家看英文费时费事的问题,希望大家下载看看,一定会有帮助的

GIS程序设计教程 基于ArcGIS Engine的C#开发实例

张丰,杜震洪,刘仁义编著.GIS程序设计教程 基于ArcGIS Engine的C#开发实例.浙江大学出版社,2012.05

人工智能-计算机视觉实战之路(必备算法+深度学习+项目实战)

系列课程主要分为3大阶段:(1)首先掌握计算机视觉必备算法原理,结合Opencv进行学习与练手,通过实际视项目进行案例应用展示。(2)进军当下最火的深度学习进行视觉任务实战,掌握深度学习中必备算法原理与网络模型架构。(3)结合经典深度学习框架与实战项目进行实战,基于真实数据集展开业务分析与建模实战。整体风格通俗易懂,项目驱动学习与就业面试。 建议同学们按照下列顺序来进行学习:1.Python入门视频课程 2.Opencv计算机视觉实战(Python版) 3.深度学习框架-PyTorch实战/人工智能框架实战精讲:Keras项目 4.Python-深度学习-物体检测实战 5.后续实战课程按照自己喜好选择就可以

三个项目玩转深度学习(附1G源码)

从事大数据与人工智能开发与实践约十年,钱老师亲自见证了大数据行业的发展与人工智能的从冷到热。事实证明,计算机技术的发展,算力突破,海量数据,机器人技术等,开启了第四次工业革命的序章。深度学习图像分类一直是人工智能的经典任务,是智慧零售、安防、无人驾驶等机器视觉应用领域的核心技术之一,掌握图像分类技术是机器视觉学习的重中之重。针对现有线上学习的特点与实际需求,我们开发了人工智能案例实战系列课程。打造:以项目案例实践为驱动的课程学习方式,覆盖了智能零售,智慧交通等常见领域,通过基础学习、项目案例实践、社群答疑,三维立体的方式,打造最好的学习效果。

微信小程序开发实战之番茄时钟开发

微信小程序番茄时钟视频教程,本课程将带着各位学员开发一个小程序初级实战类项目,针对只看过官方文档而又无从下手的开发者来说,可以作为一个较好的练手项目,对于有小程序开发经验的开发者而言,可以更好加深对小程序各类组件和API 的理解,为更深层次高难度的项目做铺垫。

面试了一个 31 岁程序员,让我有所触动,30岁以上的程序员该何去何从?

最近面试了一个31岁8年经验的程序猿,让我有点感慨,大龄程序猿该何去何从。

去除异常值matlab程序

数据预处理中去除异常值的程序,matlab写成

用verilog HDL语言编写的秒表

在秒表设计中,分模块书写。用在七段数码管上显示。输入频率是1KHZ.可以显示百分秒,秒,分。如要显示小时,只需修改leds里的代码和主模块代码。改程序以通过硬件电路验证。完全正确。

[透视java——反编译、修补和逆向工程技术]源代码

源代码。

相关热词 c# 开发接口 c# 中方法上面的限制 c# java 时间戳 c#单元测试入门 c# 数组转化成文本 c#实体类主外键关系设置 c# 子函数 局部 c#窗口位置设置 c# list 查询 c# 事件 执行顺序
立即提问
相关内容推荐