make编译报错:fatal error: gnu/stubs-64.h: 5C

CentOS7安装编译unixbench工具,执行make编译时候报错:
In file included from /usr/include/features.h:399:0,
from /usr/include/string.h:27,
from ./src/arith.c:32:
/usr/include/gnu/stubs.h:10:27: fatal error: gnu/stubs-64.h:

麻烦各路大神帮忙解决下,谢谢!

1个回答

查看对方提供的sdk编译说明, 才知道他们编译之前需要source一个文件:
source /home/ballack/1.8.1/environment-setup-cortexa8hf-vfp-neon-poky-linux-gnueabi
查看文件内容, 发现 CC 是需要指定一系列参数的:
export SDKTARGETSYSROOT=/home/ballack/1.8.1/sysroots/cortexa8hf-vfp-neon-poky-linux-gnueabi
export CC="arm-poky-linux-gnueabi-gcc -march=armv7-a -mfloat-abi=hard -mfpu=neon -mtune=cortex-a8 --sysroot=$SDKTARGETSYSROOT"
所以直接使用arm-poky-linux-gnueabi-gcc -o test test.c 是不行的。
解决方法一:
source ./1.8.1/environment-setup-cortexa8hf-vfp-neon-poky-linux-gnueabi
注释掉
#CC = $(CROSS_COMPILE)gcc
然后make即可。

解决方法二:
source ./1.8.1/environment-setup-cortexa8hf-vfp-neon-poky-linux-gnueabi
修改test工具目录下的Makefile中的CC为:
CC=arm-poky-linux-gnueabi-gcc -march=armv7-a -mfloat-abi=hard -mfpu=neon -mtune=cortex-a8 --sysroot=/home/ballack/1.8.1/sysroots/cortexa8hf-vfp-neon-poky-linux-gnueabi
然后make即可。

这样直接make就可以通过了

bay05201
bay05201 不存在这个路径啊./1.8.1/environment-setup-cortexa8hf-vfp-neon-poky-linux-gnueabi
接近 2 年之前 回复
bay05201
bay05201 ./1.8.1/environment-setup-cortexa8hf-vfp-neon-poky-linux-gnueabi
接近 2 年之前 回复
Csdn user default icon
上传中...
上传图片
插入图片
抄袭、复制答案,以达到刷声望分或其他目的的行为,在CSDN问答是严格禁止的,一经发现立刻封号。是时候展现真正的技术了!
其他相关推荐
Wordpress致命错误:未捕获错误:在/wp-includes/wp-db.php:1570中调用未定义函数mysql_connect()

<div class="post-text" itemprop="text"> <p>我有大麻烦了。我安装了一个运输插件的空版本,我发现它和我的需求不相关,就删除了插件区域插件。删除那个插件后,我的网站就瘫痪了。它不断地向我显示致命的错误:</p> <blockquote> <p>Fatal error: Uncaught Error: Call to undefined function mysql_connect() in /home/dev/public_html/new/wp-includes/wp-db.php:1570 Stack trace: #0 /home/dev/public_html/new/wp-includes/wp-db.php(658): wpdb-&gt;db_connect() #1 /home/dev/public_html/new/wp-includes/load.php(404): wpdb-&gt;__construct('dev_test', '3CrSPh8o766F', 'dev_test_ne...', 'localhost') #2 /home/dev/public_html/new/wp-settings.php(107): require_wp_db() #3 /home/dev/public_html/new/wp-config.php(82): require_once('/home/dev/p...') #4 /home/dev/public_html/new/wp-load.php(37): require_once('/home/dev/p...') #5 /home/dev/public_html/new/wp-blog-header.php(13): require_once('/home/dev/p...') #6 /home/dev/public_html/new/index.php(17): require('/home/dev/p...') #7 {main} thrown in /home/dev/public_html/new/wp-includes/wp-db.php on line 1570</p> </blockquote> <p>我尝试替换除 wp-config.php 和 wp-content 文件夹之外的所有核心文件,但仍然出现同样的错误。此外,我尝试重新命名插件文件夹,但还是有错误。你们能告诉我怎样才能把我的网站要回来吗?</p> </div>

WordPress PHP警告:require(/home/cluster-sites/6/e/expertfaculty.org/public_html/wp-includes/class-wp-widget.php):无法打开流

<div class="post-text" itemprop="text"> <p>I have recently moved a domain from an old server to a new hosting package. </p> <p>I moved over all the previous files and backed up the MySQL databases.The website is not loading, with the following error:</p> <blockquote> <p>expertfaculty.org [Mon Oct 15 11:11:39 2018] [error] [client 77.89.128.187:0] PHP Warning: require(/home/cluster-sites/6/e/expertfaculty.org/public_html/wp-includes/class-wp-widget.php): failed to open stream: No such file or directory in /home/cluster-sites/6/e/expertfaculty.org/public_html/wp-settings.php on line 187</p> <p>expertfaculty.org [Mon Oct 15 11:11:39 2018] [error] [client 77.89.128.187:0] PHP Fatal error: require(): Failed opening required '/home/cluster-sites/6/e/expertfaculty.org/public_html/wp-includes/class-wp-widget.php' (include_path='.:/usr/share/pear72:/usr/share/php') in /home/cluster-sites/6/e/expertfaculty.org/public_html/wp-settings.php on line 187</p> </blockquote> <p>The class-wp-widget.php is there in the wp-includes file. One wp-settings.php on line 187 there isn't anything that's relevant. </p> <p>The website definitely worked under the old server. Not sure what is wrong. </p> <p>Anyone can help on that? Thanks!</p> </div>

open /var/lib/gitlab-runner/gitlab-runner-prebuilt.tar.xz: no such file or directory

Gitlab版本11.11.0 gitlab--runner版本10.5.0 ![图片说明](https://img-ask.csdn.net/upload/201906/05/1559719002_499676.jpeg) ![图片说明](https://img-ask.csdn.net/upload/201906/05/1559719019_463382.jpeg) 已经注册了gitlab-runner,但是每次提交都提示 open /var/lib/gitlab-runner/gitlab-runner-prebuilt.tar.xz: no such file or directory 求大神解答

linux2.6.32编译报错!

CHK include/linux/version.h CHK include/linux/utsrelease.h SYMLINK include/asm -> include/asm-x86 CALL scripts/checksyscalls.sh CHK include/linux/compile.h AS arch/x86/kernel/entry_64.o /tmp/ccIgBHIH.s: Assembler messages: /tmp/ccIgBHIH.s: Error: .size expression for do_hypervisor_callback does not evaluate to a constant make[2]: *** [arch/x86/kernel/entry_64.o] 错误 1 make[1]: *** [arch/x86/kernel] 错误 2 make: *** [arch/x86] 错误 2 joker@Ghost:~/local/linux-2.6.

cgo编译错误:iostream:38:28:致命错误:bits / c ++ config.h:没有此类文件或目录

<div class="post-text" itemprop="text"> <p>I tried to execute the saxpy exemple from the official cuda nvrtc guide in <a href="http://docs.nvidia.com/cuda/nvrtc/index.html#example-saxpy" rel="nofollow">this page</a></p> <p>It works fine with the g++ compiler on terminal and following the build instructions:</p> <pre><code>g++ saxpy.cpp -o saxpy -I $CUDA_PATH/include -L $CUDA_PATH/lib64 -lnvrtc -lcuda -Wl,-rpath,$CUDA_PATH/lib64 </code></pre> <p>Now I'm trying to execute it in go language with the cgo tool. I named main function in "my_function" and I'm trying to call it with C.my_function.</p> <p>this is my cgo directives:</p> <pre><code>//PATH #cgo LDFLAGS: -L/usr/local/cuda-7.0/lib64 -L/usr/local/cuda-7.0/lib -lcuda -lnvrtc #cgo CPPFLAGS: -I/usr/local/cuda-7.0/include/ -I/usr/include/c++/4.8 //FILE #include "saxpy_header.h" #include &lt;nvrtc.h&gt; #include "iostream" #include &lt;cuda.h&gt; </code></pre> <p>But I get this error message:</p> <pre><code>/usr/include/c++/4.8/iostream:38:28: fatal error: bits/c++config.h: No such file or directory #include &lt;bits/c++config.h&gt; </code></pre> <p>So I tried this:</p> <pre><code>#include "/usr/include/x86_64-linux-gnu/c++/4.9/bits/c++config.h" </code></pre> <p>And now I get this new error message:</p> <pre><code>/usr/include/x86_64-linux-gnu/c++/4.9/bits/c++config.h:430:29: fatal error: bits/os_defines.h: No such file or directory #include &lt;bits/os_defines.h&gt; </code></pre> <p>After adding <code>#include "/usr/include/x86_64-linux-gnu/c++/4.9/bits/os_defines.h"</code> I get the same error...</p> <p>How can i solve this problem?</p> </div>

编译ndk-build.cmd生成.so文件中出现这样的问题,不知道哪的原因。

E:\project\CHENWEN\proj.android\jni>ndk-build [armeabi] Compile++ thumb: cocos2dcpp_shared <= main.cpp In file included from D:/android-ndk-r10/sources/cxx-stl/gnu-libstdc++/4.6/inclu de/thread:35:0, from E:/project/CHENWEN/proj.android//jni/../../cocos2d/cocos/3 d/../base/CCConsole.h:42, from E:/project/CHENWEN/proj.android//jni/../../cocos2d/cocos/3 d/../base/ccMacros.h:35, from E:/project/CHENWEN/proj.android//jni/../../cocos2d/cocos/3 d/../base/CCRefPtr.h:30, from E:/project/CHENWEN/proj.android//jni/../../cocos2d/cocos/3 d/../cocos2d.h:42, from E:/project/CHENWEN/proj.android//jni/../../Classes/AppDele gate.h:4, from E:/project/CHENWEN/proj.android//jni/hellocpp/main.cpp:1: D:/android-ndk-r10/sources/cxx-stl/gnu-libstdc++/4.6/include/bits/c++0x_warning. h:32:2: error: #error This file requires compiler and library support for the IS O C++ 2011 standard. This support is currently experimental, and must be enabled with the -std=c++11 or -std=gnu++11 compiler options. In file included from E:/project/CHENWEN/proj.android//jni/../../cocos2d/cocos/3 d/../platform/CCGL.h:36:0, from E:/project/CHENWEN/proj.android//jni/../../cocos2d/cocos/3 d/../base/ccTypes.h:36, from E:/project/CHENWEN/proj.android//jni/../../cocos2d/cocos/3 d/../cocos2d.h:51, from E:/project/CHENWEN/proj.android//jni/../../Classes/AppDele gate.h:4, from E:/project/CHENWEN/proj.android//jni/hellocpp/main.cpp:1: E:/project/CHENWEN/proj.android//jni/../../cocos2d/cocos/3d/../platform/android/ CCGL-android.h:44:31: fatal error: GLES2/gl2platform.h: No such file or director y compilation terminated. make.exe: *** [E:/project/CHENWEN/proj.android//obj/local/armeabi/objs/cocos2dcp p_shared/hellocpp/main.o] Error 1

在“https://s3-us-west-2.amazonaws.com/上执行”ListBuckets“时出错:出现此错误的原因是什么?

<div class="post-text" itemprop="text"> <p>While I am trying to list <code>buckets</code> I get the following php error:</p> <pre><code>( ! ) Fatal error: Uncaught exception 'Aws\S3\Exception\S3Exception' with message 'Error executing "ListBuckets" on "https://s3-us-west-2.amazonaws.com/"; AWS HTTP error: cURL error 60: SSL certificate problem: unable to get local issuer certificate (see http://curl.haxx.se/libcurl/c/libcurl-errors.html)' in C:\wamp\www\Web_Projects\aws\Aws\WrappedHttpHandler.php on line 159 ( ! ) Aws\S3\Exception\S3Exception: Error executing "ListBuckets" on "https://s3-us-west-2.amazonaws.com/"; AWS HTTP error: cURL error 60: SSL certificate problem: unable to get local issuer certificate (see http://curl.haxx.se/libcurl/c/libcurl-errors.html) in C:\wamp\www\Web_Projects\aws\Aws\WrappedHttpHandler.php on line 159 Call Stack </code></pre> <p>Code with which I am trying:</p> <pre><code>&lt;?php error_reporting(1); require 'aws-autoloader.php'; use Aws\S3\S3Client; $options = [ 'region' =&gt; 'us-west-2', 'version' =&gt; 'latest', 'credentials' =&gt; [ 'key' =&gt; 'AKXXXXXXLPPHXXXXXXXXXPA', 'secret' =&gt; 'a/b/c+d', ] ]; $s3Client = new S3Client($options); $s3Client-&gt;listBuckets(); ?&gt; </code></pre> <p>What could be the reason I am getting the above error?</p> </div>

内核编译出错的问题,我刚入门,希望大神们解答谢谢!

linux-2.6.27/include/linux/posix_types.h:47:29: asm/posix_types.h: No such file or directory linux-2.6.27/include/linux/types.h:12:23: asm/types.h: No such file or directory linux-2.6.27/include/linux/types.h:16: error: syntax error before "__kernel_dev_t" /linux-2.6.27/include/linux/types.h:16: warning: type defaults to `int' in declaration of `__kernel_dev_t' make[4]: *** [kernel/bounds.s] Error 1 make[3]: *** [prepare0] Error 2 make[2]: *** [sub-make] Error 2

配置Linux编译环境时出现arm-linux-gnueabihf-gcc: fatal error: no input files问题

按照步骤 下载好arm-linux-gnueabihf-gcc相关文件,改好环境变量 打开控制台输入 arm按tab也会弹出来了 ![图片说明](https://img-ask.csdn.net/upload/201905/25/1558773677_170541.jpg) 但是打开eclipse写一段代码编译时候又弹出错误 ![图片说明](https://img-ask.csdn.net/upload/201905/25/1558773773_740787.jpg) 然后我到控制台试一下 也是同样的问题 ![图片说明](https://img-ask.csdn.net/upload/201905/25/1558773922_399462.jpg)

C++编译不通过,求帮助

代码中用到了开源解析工具rapidxml.hpp,里面有用到assert断言,编译的时候报错: In file included from /usr/include/features.h:361:0, from /usr/local/gcc-4.8.2/include/c++/4.8.2/x86_64-unknown-linux-gnu/bits/os_defines.h:39, from /usr/local/gcc-4.8.2/include/c++/4.8.2/x86_64-unknown-linux-gnu/bits/c++config.h:426, from /usr/local/gcc-4.8.2/include/c++/4.8.2/bits/stl_algobase.h:59, from /usr/local/gcc-4.8.2/include/c++/4.8.2/list:60, from ./src/include/service-rule/DCRule.h:28, from ./src/include/service-rule/DCOweChargeRule.h:24, from ./src/source/service-rule/DCOweChargeRule.cpp:21: /usr/include/assert.h:66:1: error: expected constructor, destructor, or type conversion before 'extern' __BEGIN_DECLS 检查了/usr/include/assert.h文件,里面用到__BEGIN_DECLS的这个宏,在/usr/include/sys/cdefs.h 中有定义,可是编译就是不通过,毫无头绪 跪求帮忙,

Mac flutter项目运行失败报错:fatal error: 'image_gallery_saver/image_gallery_saver-Swift.h' file not found

网上没有任何相关报错问题,小弟在此求助各位大神 ![图片说明](https://img-ask.csdn.net/upload/202002/23/1582453194_909830.png)

在进行ln连接apt_pkg.cpython-37m-x86_64-linux-gnu.so时报错该文件已存在但是无法使用,有没有什么办法可以将这个文件删除重新ln操作?

在进行![图片说明](https://img-ask.csdn.net/upload/202006/01/1590983477_583018.png) 操作时出现以下报错![图片说明](https://img-ask.csdn.net/upload/202006/01/1590983499_145987.png) 之后参考网上对于符号连接层数过多的解决办法用ln命令进行了链接 ![图片说明](https://img-ask.csdn.net/upload/202006/01/1590983601_316192.png)但是由于之前进行过类似操作但没有成功,产生的apt_pkg.cpython-37m-x86_64-linux-gnu.so文件显示![图片说明](https://img-ask.csdn.net/upload/202006/01/1590983688_196897.png) 该文件不存在 想询问一下各位大佬有没有方法可以将这个文件删除重新进行ln操作呢

/react-native/React/Base/RCTBridgeModule.h:10:9: 'React/RCTDefines.h' file not found

![图片说明](https://img-ask.csdn.net/upload/201908/02/1564680644_501122.png)

pecl在mac上安装mongodb,致命错误:找不到'Security / Security.h'文件

<div class="post-text" itemprop="text"> <p>I used <code>pecl</code> to install MongoDB extension on mac, but it fails</p> <p>I get the following error:</p> <blockquote> <p>ERROR: 'make' failed</p> <p>/private/tmp/pear/install/mongodb/src/libmongoc/src/libmongoc/src/mongoc/mongoc-rand-common-crypto.c:25:10: fatal error: 'Security/Security.h' file not found</p> <p>1 error generated.</p> <p>make: *** [src/libmongoc/src/libmongoc/src/mongoc/mongoc-rand-common-crypto.lo] Error 1</p> <p>ERROR: `make' failed</p> </blockquote> <p>What is wrong?</p> </div>

VS2015下stlport编译时error:无法打开包括文件"../include/ctype.h"?

按照http://www.cnblogs.com/emyueguang/p/3881544.html 提供的方法进行了stlport的编译。 我的VS2015安装路径E:\Program Files (x86)\Microsoft Visual Studio 14.0 stlport解压后的路径D:\STLport 之后进行编译时,编译停止 报错 D:\STLport\stlport\ctype.h(39): fatal error C1083: 无法打开包括文件: “../include/ctype.h”: No such file or directory NMAKE : fatal error U1077: “"E:\Program Files (x86)\Microsoft Visual Studio 14.0\VC\BIN\cl.EXE"”: 返回代码“0x2” Stop. ![图片说明](https://img-ask.csdn.net/upload/201903/15/1552580548_118998.png)

nginx1.17.4中编译openssl报错

nginx1.17.4中编译openssl报错 file included from /usr/include/openssl/ssl.h:149:0, from src/event/ngx_event_openssl.h:15, from src/core/ngx_core.h:83, from src/core/nginx.c:9: /usr/include/openssl/comp.h:36:5: 错误:未知的类型名‘COMP_METHOD’ COMP_METHOD *meth; ^ /usr/include/openssl/comp.h:44:24: 错误:未知的类型名‘COMP_METHOD’ COMP_CTX *COMP_CTX_new(COMP_METHOD *meth); ^ /usr/include/openssl/comp.h:50:1: 错误:未知的类型名‘COMP_METHOD’ COMP_METHOD *COMP_rle(void); ^ /usr/include/openssl/comp.h:51:1: 错误:未知的类型名‘COMP_METHOD’ COMP_METHOD *COMP_zlib(void); ^ In file included from src/event/ngx_event_openssl.h:15:0, from src/core/ngx_core.h:83, from src/core/nginx.c:9: /usr/include/openssl/ssl.h:879:5: 错误:未知的类型名‘COMP_METHOD’ COMP_METHOD *method; ^ In file included from /usr/include/openssl/ssl.h:1655:0, from src/event/ngx_event_openssl.h:15, from src/core/ngx_core.h:83, from src/core/nginx.c:9: /usr/include/openssl/dtls1.h:257:35: 错误:字段‘recordinfo’的类型不完全 struct bio_dgram_sctp_rcvinfo recordinfo; ^ In file included from src/event/ngx_event_openssl.h:15:0, from src/core/ngx_core.h:83, from src/core/nginx.c:9: /usr/include/openssl/ssl.h:2468:1: 错误:未知的类型名‘COMP_METHOD’ const COMP_METHOD *SSL_get_current_compression(SSL *s); ^ /usr/include/openssl/ssl.h:2469:1: 错误:未知的类型名‘COMP_METHOD’ const COMP_METHOD *SSL_get_current_expansion(SSL *s); ^ /usr/include/openssl/ssl.h:2470:1: 错误:未知的类型名‘COMP_METHOD’ const char *SSL_COMP_get_name(const COMP_METHOD *comp); ^ /usr/include/openssl/ssl.h:2475:45: 错误:未知的类型名‘COMP_METHOD’ int SSL_COMP_add_compression_method(int id, COMP_METHOD *cm);

如何从github获取go-socket.io以在Go中使用

<div class="post-text" itemprop="text"> <p>My Go version is:</p> <blockquote> <p>go version go1.12.9 windows/amd64</p> </blockquote> <p>From this link:</p> <p><a href="https://github.com/googollee/go-socket.io/tree/v1.0" rel="nofollow noreferrer">https://github.com/googollee/go-socket.io/tree/v1.0</a></p> <p>I run this code in cmd:</p> <blockquote> <p>go get github.com/googollee/go-socket.io</p> </blockquote> <p>But i cant run this code :</p> <pre><code>package main import ( "log" "net/http" "github.com/googollee/go-socket.io" ) func main() { server, err := socketio.NewServer(nil) if err != nil { log.Fatal(err) } server.On("connection", func(so socketio.Socket) { log.Println("on connection") so.Join("chat") so.On("chat message", func(msg string) { log.Println("emit:", so.Emit("chat message", msg)) server.BroadcastTo("chat", "chat message", msg) }) so.On("disconnection", func() { log.Println("on disconnect") }) }) server.On("error", func(so socketio.Socket, err error) { log.Println("error:", err) }) http.Handle("/socket.io/", server) http.Handle("/", http.FileServer(http.Dir("./asset"))) log.Println("Serving at localhost:5000...") log.Fatal(http.ListenAndServe(":5000", nil)) } </code></pre> <p>I cant run it , why?</p> <p>I think my problem is in getting V1.4 and v1.0 </p> <blockquote> <p>go get github.com/googollee/go-socket.io</p> </blockquote> <p>how can i get v1.0 for Golang from github?</p> <p>But this code work well</p> <pre><code>package main import ( "fmt" "log" "net/http" "github.com/googollee/go-socket.io" ) func main() { server, err := socketio.NewServer(nil) if err != nil { log.Fatal(err) } server.OnConnect("/", func(s socketio.Conn) error { s.SetContext("") fmt.Println("connected:", s.ID()) return nil }) http.Handle("/socket.io/", server) http.Handle("/", http.FileServer(http.Dir("./asset"))) log.Println("Serving at localhost:8000...") log.Fatal(http.ListenAndServe(":8000", nil)) } </code></pre> </div>

海思平台编译SDL问题?

![图片说明](https://img-ask.csdn.net/upload/202001/16/1579163209_685367.png) root@avst-linux-server:/home/font/SDL-1.2.15# ./configure CC=/opt/hisi-linux/x86-arm/aarch64-himix100-linux/bin/aarch64-himix100-linux-gcc --host=aarch64-himix100-linux --prefix=/home/font/test/SDL --enable-shared=no --enable-static=yes configure: WARNING: If you wanted to set the --build type, don't use --host. If a cross compiler is detected then cross compile mode will be used. checking build system type... x86_64-unknown-linux-gnu checking host system type... Invalid configuration `aarch64-himix100-linux': machine `aarch64-himix100' not recognized configure: error: /bin/sh ./build-scripts/config.sub aarch64-himix100-linux failed root@avst-linux-server:/home/yushuo/font/SDL-1.2.15# 该如何解决呢?

在ubuntu下配置opencv,cmake成功了,而make时候报错

1 [ 6%] Generating precomp.hpp.gch/opencv_core_Release.gch 2 In file included from /usr/include/c++/6/bits/stl_algo.h:59:0, 3 from /usr/include/c++/6/algorithm:62, 4 from /opt/opencv/opencv-3.1.0/modules/core/include/opencv2/core/base.hpp:53, 5 from /opt/opencv/opencv-3.1.0/modules/core/include/opencv2/core.hpp:54, 6 from /opt/opencv/opencv-3.1.0/modules/core/include/opencv2/core/utility.hpp:52, 7 from /opt/opencv/build/modules/core/precomp.hpp:49: 8 /usr/include/c++/6/cstdlib:75:25: fatal error: stdlib.h: 没有那个文件或目录 9 #include_next <stdlib.h> 10 ^ 11 compilation terminated. 12 modules/core/CMakeFiles/pch_Generate_opencv_core.dir/build.make:62: recipe for target 'modules/core/precomp.hpp.gch/opencv_core_Release.gch' failed 13 make[2]: *** [modules/core/precomp.hpp.gch/opencv_core_Release.gch] Error 1 14 CMakeFiles/Makefile2:1178: recipe for target 'modules/core/CMakeFiles/pch_Generate_opencv_core.dir/all' failed 15 make[1]: *** [modules/core/CMakeFiles/pch_Generate_opencv_core.dir/all] Error 2 16 Makefile:160: recipe for target 'all' failed 17 make: *** [all] Error 2 ![图片说明](https://img-ask.csdn.net/upload/201703/03/1488542516_717767.png)

技术大佬:我去,你写的 switch 语句也太老土了吧

昨天早上通过远程的方式 review 了两名新来同事的代码,大部分代码都写得很漂亮,严谨的同时注释也很到位,这令我非常满意。但当我看到他们当中有一个人写的 switch 语句时,还是忍不住破口大骂:“我擦,小王,你丫写的 switch 语句也太老土了吧!” 来看看小王写的代码吧,看完不要骂我装逼啊。 private static String createPlayer(PlayerTypes p...

副业收入是我做程序媛的3倍,工作外的B面人生是怎样的?

提到“程序员”,多数人脑海里首先想到的大约是:为人木讷、薪水超高、工作枯燥…… 然而,当离开工作岗位,撕去层层标签,脱下“程序员”这身外套,有的人生动又有趣,马上展现出了完全不同的A/B面人生! 不论是简单的爱好,还是正经的副业,他们都干得同样出色。偶尔,还能和程序员的特质结合,产生奇妙的“化学反应”。 @Charlotte:平日素颜示人,周末美妆博主 大家都以为程序媛也个个不修边幅,但我们也许...

我说我不会算法,阿里把我挂了。

不说了,字节跳动也反手把我挂了。

抖音上很火的时钟效果

反正,我的抖音没人看,别人都有几十万个赞什么的。 发到CSDN上来,大家交流下~ 主要用到原生态的 JS+CSS3。 具体不解释了,看注释: &lt;!DOCTYPE html&gt; &lt;html lang="en"&gt; &lt;head&gt; &lt;meta charset="UTF-8"&gt; &lt;title&gt;Title&lt;/tit...

记录下入职中软一个月(外包华为)

我在年前从上一家公司离职,没想到过年期间疫情爆发,我也被困在家里,在家呆着的日子让人很焦躁,于是我疯狂的投简历,看面试题,希望可以进大公司去看看。 我也有幸面试了我觉得还挺大的公司的(虽然不是bat之类的大厂,但是作为一名二本计算机专业刚毕业的大学生bat那些大厂我连投简历的勇气都没有),最后选择了中软,我知道这是一家外包公司,待遇各方面甚至不如我的上一家公司,但是对我而言这可是外包华为,能...

培训班出来的人后来都怎么样了?(二)

接着上回说,培训班学习生涯结束了。后面每天就是无休止的背面试题,不是没有头脑的背,培训公司还是有方法的,现在回想当时背的面试题好像都用上了,也被问到了。回头找找面试题,当时都是打印下来天天看,天天背。 不理解呢也要背,面试造飞机,上班拧螺丝。班里的同学开始四处投简历面试了,很快就有面试成功的,刚开始一个,然后越来越多。不知道是什么原因,尝到胜利果实的童鞋,不满足于自己通过的公司,嫌薪水要少了,选择...

面试了一个 31 岁程序员,让我有所触动,30岁以上的程序员该何去何从?

最近面试了一个31岁8年经验的程序猿,让我有点感慨,大龄程序猿该何去何从。

大三实习生,字节跳动面经分享,已拿Offer

说实话,自己的算法,我一个不会,太难了吧

程序员垃圾简历长什么样?

已经连续五年参加大厂校招、社招的技术面试工作,简历看的不下于万份 这篇文章会用实例告诉你,什么是差的程序员简历! 疫情快要结束了,各个公司也都开始春招了,作为即将红遍大江南北的新晋UP主,那当然要为小伙伴们做点事(手动狗头)。 就在公众号里公开征简历,义务帮大家看,并一一点评。《启舰:春招在即,义务帮大家看看简历吧》 一石激起千层浪,三天收到两百多封简历。 花光了两个星期的所有空闲时...

推荐9个能让你看一天的网站

分享的这9个保证另你意外的网站,每个都非常实用!非常干货!毫不客气的说,这些网站最少值10万块钱。 利用好这些网站,会让你各方面的技能都得到成长,不说让你走上人生巅峰,但对比现在的你,在眼界、学识、技能方面都有质的飞跃。 一、AIRPANO 传送门:https://www.airpano.com/360photo_list.php 这是一个可以躺在家里,就能环游世界的神奇网站。 世界那么大,绝大多...

大牛都会用的IDEA调试技巧!!!

导读 前天面试了一个985高校的实习生,问了他平时用什么开发工具,他想也没想的说IDEA,于是我抛砖引玉的问了一下IDEA的调试用过吧,你说说怎么设置断点...

都前后端分离了,咱就别做页面跳转了!统统 JSON 交互

文章目录1. 无状态登录1.1 什么是有状态1.2 什么是无状态1.3 如何实现无状态1.4 各自优缺点2. 登录交互2.1 前后端分离的数据交互2.2 登录成功2.3 登录失败3. 未认证处理方案4. 注销登录 这是本系列的第四篇,有小伙伴找不到之前文章,松哥给大家列一个索引出来: 挖一个大坑,Spring Security 开搞! 松哥手把手带你入门 Spring Security,别再问密...

97年世界黑客编程大赛冠军作品(大小仅为16KB),惊艳世界的编程巨作

这是世界编程大赛第一名作品(97年Mekka ’97 4K Intro比赛)汇编语言所写。 整个文件只有4095个字节, 大小仅仅为16KB! 不仅实现了3D动画的效果!还有一段震撼人心的背景音乐!!! 内容无法以言语形容,实在太强大! 下面是代码,具体操作看最后! @echo off more +1 %~s0|debug e100 33 f6 bf 0 20 b5 10 f3 a5...

不要再到处使用 === 了

我们知道现在的开发人员都使用 === 来代替 ==,为什么呢?我在网上看到的大多数教程都认为,要预测 JavaScript 强制转换是如何工作这太复杂了,因此建议总是使用===。这些都...

什么是a站、b站、c站、d站、e站、f站、g站、h站、i站、j站、k站、l站、m站、n站?00后的世界我不懂!

A站 AcFun弹幕视频网,简称“A站”,成立于2007年6月,取意于Anime Comic Fun,是中国大陆第一家弹幕视频网站。A站以视频为载体,逐步发展出基于原生内容二次创作的完整生态,拥有高质量互动弹幕,是中国弹幕文化的发源地;拥有大量超粘性的用户群体,产生输出了金坷垃、鬼畜全明星、我的滑板鞋、小苹果等大量网络流行文化,也是中国二次元文化的发源地。 B站 全称“哔哩哔哩(bilibili...

十个摸鱼,哦,不对,是炫酷(可以玩一整天)的网站!!!

文章目录前言正文**1、Kaspersky Cyberthreat real-time map****2、Finding Home****3、Silk – Interactive Generative Art****4、Liquid Particles 3D****5、WINDOWS93****6、Staggering Beauty****7、Ostagram图片生成器网址****8、全历史网址*...

终于,月薪过5万了!

来看几个问题想不想月薪超过5万?想不想进入公司架构组?想不想成为项目组的负责人?想不想成为spring的高手,超越99%的对手?那么本文内容是你必须要掌握的。本文主要详解bean的生命...

大厂的 404 页面都长啥样?最后一个笑了...

每天浏览各大网站,难免会碰到404页面啊。你注意过404页面么?猿妹搜罗来了下面这些知名网站的404页面,以供大家欣赏,看看哪个网站更有创意: 正在上传…重新上传取消 腾讯 正在上传…重新上传取消 网易 淘宝 百度 新浪微博 正在上传…重新上传取消 新浪 京东 优酷 腾讯视频 搜...

自从喜欢上了B站这12个UP主,我越来越觉得自己是个废柴了!

不怕告诉你,我自从喜欢上了这12个UP主,哔哩哔哩成为了我手机上最耗电的软件,几乎每天都会看,可是吧,看的越多,我就越觉得自己是个废柴,唉,老天不公啊,不信你看看…… 间接性踌躇满志,持续性混吃等死,都是因为你们……但是,自己的学习力在慢慢变强,这是不容忽视的,推荐给你们! 都说B站是个宝,可是有人不会挖啊,没事,今天咱挖好的送你一箩筐,首先啊,我在B站上最喜欢看这个家伙的视频了,为啥 ,咱撇...

代码注释如此沙雕,会玩还是你们程序员!

某站后端代码被“开源”,同时刷遍全网的,还有代码里的那些神注释。 我们这才知道,原来程序员个个都是段子手;这么多年来,我们也走过了他们的无数套路… 首先,产品经理,是永远永远吐槽不完的!网友的评论也非常扎心,说看这些代码就像在阅读程序员的日记,每一页都写满了对产品经理的恨。 然后,也要发出直击灵魂的质问:你是尊贵的付费大会员吗? 这不禁让人想起之前某音乐app的穷逼Vip,果然,穷逼在哪里都是...

一场疫情,炸出了退休的COBOL程序员

COBOL编程语言,估计大多数程序员从没听说过,我这样的编程老司机,也是只闻其名,从未一睹芳容。出门问了问度娘,答案如下:COBOL语言,是一种面向过程的高级程序设计语言,主要用于数据...

爬虫(101)爬点重口味的

小弟最近在学校无聊的很哪,浏览网页突然看到一张图片,都快流鼻血。。。然后小弟冥思苦想,得干一点有趣的事情python 爬虫库安装https://s.taobao.com/api?_ks...

讲真,这两款idea插件,能治愈你英语不好的病

时不时就有小伙伴问我,“二哥,能推荐一款 IDE 吗?”你看这话问的,现在搞 Java 的不都在用 Intellij IDEA 吗,还用得着推荐(我已经和 Eclipse 分手了)。然后小伙伴又说,“二哥,IDEA 支持中文吗?我英语不太好。”你看这话问的,搞编程的,英语不好是硬伤啊! 不过,随着 IDEA 最新版(版本号是 2020.1)的发布,英语不好的病可以彻底治愈了。为什么这么说呢?因为 ...

在拼多多上班,是一种什么样的体验?我心态崩了呀!

之前有很多读者咨询我:武哥,在拼多多上班是一种什么样的体验?由于一直很忙,没抽出时间来和大家分享。上周末特地花点时间来写了一篇文章,跟大家分享一下拼多多的日常。 1. 倒时差的作息 可能很多小伙伴都听说了,拼多多加班很严重。这怎么说呢?作息上确实和其他公司有点区别,大家知道 996,那么自然也就能理解拼多多的“11 11 6”了。 所以当很多小伙伴早上出门时,他们是这样的: 我们是这样的: 当...

又一起程序员被抓事件

就在昨天互联网又发生一起让人心酸的程序员犯罪事件,著名的百度不限速下载软件 Pandownload PC 版作者被警方抓获。案件大致是这样的:软件的作者不仅非法盗取用户数据,还在QQ群进...

瑞德西韦重症用药结果再曝光,上百名重症一周内好转,股价大涨19%

郭一璞 发自 凹非寺量子位 报道 | 公众号 QbitAI期盼已久的瑞德西韦临床数据,现在“偷跑”了。在芝加哥大学医学院的临床试验中,125名病人参与,大部分人都已经出院,其中只有2名病...

应聘3万的职位,有必要这么刁难我么。。。沙雕。。。

又一次被面试官带到坑里面了。面试官:springmvc用过么?我:用过啊,经常用呢面试官:springmvc中为什么需要用父子容器?我:嗯。。。没听明白你说的什么。面试官:就是contr...

Vue商城——详情页功能

详情页实现思路 点击商品进去详情页,根据点击请求更加详细的信息,要传过来goodsItem的iid,根据id去服务器请求更加详细的信息;配置路由映射关系,点击进行跳转,带参数传递跳转 itemClick(){ this.$router.push('/detail/'+this.goodsItem.iid) /* this.$router.push({ ...

太狠了,疫情期间面试,一个问题砍了我5000!

疫情期间找工作确实有点难度,想拿到满意的薪资,确实要点实力啊!面试官:Spring中的@Value用过么,介绍一下我:@Value可以标注在字段上面,可以将外部配置文件中的数据,比如可以...

自学编程的 6 个致命误区

嗨,小伙伴们大家好,我是沉默王二。本篇文章来和大家聊聊自学编程中的一些误区——这是我在 B 站上看了羊哥的一期视频后有感而发的文章。因为确实有很多读者也曾私信问过我这些方面的问题,很有代表性,所以我就结合自己的亲身体会来谈一谈,希望对小伙伴们有所启发。 01、追求时髦 所谓基础不牢,地动山摇啊。可很多小伙伴压根就没注意过这个问题,市面上出什么新鲜的技术就想去尝试,结果把自己学的乱七八糟,心灰意冷...

相关热词 c# 局部 截图 页面 c#实现简单的文件管理器 c# where c# 取文件夹路径 c# 对比 当天 c# fir 滤波器 c# 和站 队列 c# txt 去空格 c#移除其他类事件 c# 自动截屏
立即提问