求先知达人来填这个cython的坑? 20C

状况: 网上一段代码关于信号和槽的,其py文件是可以正常工作的,只要转换成pyd后,
再调用就会弹出 python.exe已经停止运行 ,关闭之,然后就没了,不知如何下断点。
无法查看。
运行环境,win7 32 ,python2.7 pyqt4 eric6

现象: 被cython 转换前是正常的,转化为pyd后,就执行不下去了,
问题出现在这里:self.myButton.clicked.connect(self.myPrint) ,屏蔽掉就可以通过,

# -*- coding: utf-8 -*-

"""
Module implementing MyWindow.
"""

from PyQt4.QtCore import pyqtSignature
from PyQt4.QtGui import QDialog

from Ui_cs_emit import Ui_Dialog
from PyQt4 import QtGui, QtCore

class MyWindow(QDialog, Ui_Dialog):

    _signal=QtCore.pyqtSignal(str) 
    def __init__(self, parent=None):
        """
        Constructor

        @param parent reference to the parent widget (QWidget)
        """
        QDialog.__init__(self, parent)
        self.setupUi(self)

        self.myButton.clicked.connect(self.myPrint)  #执行到这里就会出现问题。
        self._signal.connect(self.mySignal) 

    def myPrint(self):  
        self.tb.setText("")  
        self.tb.append(u"正在打印,请稍候")  
        self._signal.emit(u"你妹,打印结束了吗,快回答!")  

    def mySignal(self,string):  
        print "%s"%string  
        self.tb.append(u"打印结束")


    @pyqtSignature("")
    def on_myButton_clicked(self):
        pass
if __name__=="__main__":    
    import sys    
    app = QtGui.QApplication(sys.argv)
    myshow=MyWindow()  
    myshow.show()    
    sys.exit(app.exec_()) 

建立一个对话框:窗体名称:MyWindow

一个 textEidt 控件: 名称:tb

一个 button 控件: 名称:myButton

代码是:在网上看到的,试着用Cython 转为 pyd, 结果发现了状况。查不到相关资料,只能求教

2个回答

楼上的,请问这个案例你测试过吗,寻求直接有效的解决方案,谢谢

Csdn user default icon
上传中...
上传图片
插入图片
抄袭、复制答案,以达到刷声望分或其他目的的行为,在CSDN问答是严格禁止的,一经发现立刻封号。是时候展现真正的技术了!
其他相关推荐
Cython里void对应的python类型是什么?
比如有一个c函数 ` int test(void){ ... } ` 如果不传参数到test里,Cython会报错 `Call with wrong number of arguments (expected 1, got 0)` 前提是我没有源代码,但是又想调用这个函数该怎么办?
python安装pyffmpeg,cython报错
问题是这样的,最近在装python版的ffmpeg模块pyffmpeg,执行python setup.py install后,报错如下: from Cython.Distutils import build_ext ,ImportError: No module named Cython.Distutils ,发现可能缺少Cython模块的安装,于是又执行了下面的命令: pip install cython 结果报错: building 'Cython.Plex.Scanners' extension error: Unable to find vcvarsall.bat 于是我按照网上别人的解决方式: 1 在执行pip install cython之前先执行 SET VS90COMNTOOLS=%VS110COMNTOOLS% 因为我的vs是2012的,结果还是报错 这种方式行不通,我又参照另一个人的方法 2在“..python安装路径...\Lib\distutils目录下有个msvc9compiler.py找到243行 toolskey = "VS%0.f0COMNTOOLS" % version 直接改为 toolskey = "VS110COMNTOOLS" 结果还是报上面的错误。 各位朋友有什么好的解决cython安装方法或者能解决pyffmpeg的安装方法吗,十分感谢。
ModuleNotFoundError: No module named 'cython'
在使用Fast-RCNN代码时https://github.com/smallcorgi/Faster-RCNN_TF ,按照步骤,第二步make后出现了这个问题,但是我的cython已经装了,可能是什么问题呢? ![图片说明](https://img-ask.csdn.net/upload/201801/26/1516968516_512053.png)
最简单cython编译出现问题,大神求帮忙
在使用cython编译最简单的helloworld程序时出现如下问题: 本人使用的是anaconda3+vs2015 ``` Compiling helloworld.pyx because it changed. [1/1] Cythonizing helloworld.pyx running build_ext Traceback (most recent call last): File "setup.py", line 5, in <module> ext_modules = cythonize("helloworld.pyx") File "D:\anaconda\lib\distutils\core.py", line 148, in setup dist.run_commands() File "D:\anaconda\lib\distutils\dist.py", line 955, in run_commands self.run_command(cmd) File "D:\anaconda\lib\distutils\dist.py", line 974, in run_command cmd_obj.run() File "D:\anaconda\lib\distutils\command\build_ext.py", line 308, in run force=self.force) File "D:\anaconda\lib\distutils\ccompiler.py", line 1031, in new_compiler return klass(None, dry_run, force) File "D:\anaconda\lib\distutils\cygwinccompiler.py", line 285, in __init__ CygwinCCompiler.__init__ (self, verbose, dry_run, force) File "D:\anaconda\lib\distutils\cygwinccompiler.py", line 129, in __init__ if self.ld_version >= "2.10.90": TypeError: '>=' not supported between instances of 'NoneType' and 'str' ``` helloworld.pyx文件中的代码 ``` print('hello world') ``` setup.py中代码 ``` from distutils.core import setup from Cython.Build import cythonize setup( ext_modules = cythonize("helloworld.pyx") ) ```
安装pylearn2,一直报“failed with exit status 2”这个错,咋回事呢……
``` C:\Users\Administrator>cd/d G:\Documents\GitHub\pylearn2 G:\Documents\GitHub\pylearn2>python setup.py install C:\ProgramData\Anaconda3\lib\site-packages\setuptools\dist.py:475: UserWarning: Normalizing '0.1dev' to '0.1.dev0' normalized_version, running install Because Pylearn2 is under heavy development, we generally do not advice using the `setup.py install` command. Please consider using the `setup.py develop` command instead for the following reasons: 1. Using `setup.py install` creates a copy of the Pylearn2 source code in your Python installation path. In order to update Pylearn2 afterwards you will need to rerun `setup.py install` (!). Simply using `git pull` to update your local copy of Pylearn2 code will not suffice. 2. When using `sudo` to install Pylearn2, all files, including the tutorials, will be copied to a directory owned by root. Not only is running tutorials as root unsafe, it also means that all Pylearn2-related environment variables which were defined for the user will be unavailable. Pressing enter will continue the installation of Pylearn2 in `develop` mode instead. Note that this means that you need to keep this folder with the Pylearn2 code in its current location. If you know what you are doing, and are very sure that you want to install Pylearn2 using the `install` command instead, please type `install`. Installation mode: [develop]/install/cancel: running develop running egg_info writing pylearn2.egg-info\PKG-INFO writing dependency_links to pylearn2.egg-info\dependency_links.txt writing requirements to pylearn2.egg-info\requires.txt writing top-level names to pylearn2.egg-info\top_level.txt reading manifest file 'pylearn2.egg-info\SOURCES.txt' reading manifest template 'MANIFEST.in' writing manifest file 'pylearn2.egg-info\SOURCES.txt' running build_ext skipping 'pylearn2/utils\_window_flip.c' Cython extension (up-to-date) building 'pylearn2.utils._window_flip' extension G:\software\Microsoft Visual Studio\2019\Community\VC\Tools\MSVC\14.23.28105\bin\HostX86\x64\cl.exe /c /nologo /Ox /W3 /GL /DNDEBUG /MT -IC:\ProgramData\Anaconda3\lib\site-packages\numpy\core\include -IC:\ProgramData\Anaconda3\include -IC:\ProgramData\Anaconda3\include "-IG:\software\Microsoft Visual Studio\2019\Community\VC\Tools\MSVC\14.23.28105\ATLMFC\include" "-IG:\software\Microsoft Visual Studio\2019\Community\VC\Tools\MSVC\14.23.28105\include" /Tcpylearn2/utils\_window_flip.c /Fobuild\temp.win-amd64-3.7\Release\pylearn2/utils\_window_flip.obj _window_flip.c C:\ProgramData\Anaconda3\include\pyconfig.h(59): fatal error C1083: 无法打开包括文件: “io.h”: **No such file or directory error: command 'G:\\software\\Microsoft Visual Studio\\2019\\Community\\VC\\Tools\\MSVC\\14.23.28105\\bin\\HostX86\\x64\\cl.exe' failed with exit status 2 ```**
为什么在使用catalyst 时候一直有提示错误ImportError: cannot import name 'run_algorithm'?
如题: 以下为我的环境: py 3.6 aiodns==1.1.1 aiohttp==3.5.4 alabaster==0.7.12 alembic==0.9.7 appnope==0.1.0 asn1crypto==0.24.0 astroid==2.2.5 async-timeout==3.0.1 attrdict==2.0.1 attrs==19.1.0 Babel==2.6.0 backcall==0.1.0 bcolz==1.2.1 bleach==3.1.0 boto3==1.5.27 botocore==1.8.50 Bottleneck==1.2.1 cchardet==2.1.1 ccxt==1.17.94 certifi==2019.3.9 cffi==1.12.3 chardet==3.0.4 click==6.7 cloudpickle==1.0.0 contextlib2==0.5.5 cryptography==2.6.1 cycler==0.10.0 cyordereddict==1.0.0 Cython==0.27.3 cytoolz==0.9.0.1 decorator==4.4.0 defusedxml==0.6.0 docutils==0.14 empyrical==0.2.2 enigma-catalyst==0.5.21 entrypoints==0.3 eth-abi==1.3.0 eth-account==0.2.3 eth-hash==0.2.0 eth-keyfile==0.5.1 eth-keys==0.2.2 eth-rlp==0.1.2 eth-typing==2.1.0 eth-utils==1.6.0 hexbytes==0.1.0 idna==2.8 idna-ssl==1.1.0 imagesize==1.1.0 inflection==0.3.1 intervaltree==2.1.0 ipykernel==5.1.0 ipython==7.5.0 ipython-genutils==0.2.0 isort==4.3.19 jedi==0.13.3 Jinja2==2.10.1 jmespath==0.9.4 jsonschema==3.0.1 jupyter-client==5.2.4 jupyter-core==4.4.0 keyring==18.0.0 kiwisolver==1.1.0 lazy-object-proxy==1.4.1 Logbook==0.12.5 lru-dict==1.1.6 lxml==4.3.3 Mako==1.0.7 MarkupSafe==1.1.1 matplotlib==3.1.0 mccabe==0.6.1 mistune==0.8.4 mkl-fft==1.0.12 mkl-random==1.0.2 more-itertools==7.0.0 multidict==4.5.2 multipledispatch==0.4.9 nbconvert==5.5.0 nbformat==4.4.0 networkx==2.1 numexpr==2.6.4 numpy==1.16.0 numpydoc==0.9.1 packaging==19.0 pandas==0.24.2 pandas-datareader==0.6.0 pandocfilters==1.4.2 parsimonious==0.8.1 parso==0.4.0 patsy==0.5.1 pexpect==4.7.0 pickleshare==0.7.5 prompt-toolkit==2.0.9 psutil==5.6.2 ptyprocess==0.6.0 pycares==3.0.0 pycodestyle==2.5.0 pycparser==2.19 pycryptodome==3.8.2 pyflakes==2.1.1 Pygments==2.4.0 pylint==2.3.1 pyOpenSSL==19.0.0 pyparsing==2.4.0 pyrsistent==0.14.11 PySocks==1.7.0 python-dateutil==2.8.0 python-editor==1.0.4 pytz==2019.1 pyzmq==18.0.0 QtAwesome==0.5.7 qtconsole==4.5.1 QtPy==1.7.1 Quandl==3.4.5 redo==2.0.1 requests==2.21.0 requests-file==1.4.3 requests-ftp==0.3.1 requests-toolbelt==0.8.0 rlp==1.1.0 rope==0.14.0 s3transfer==0.1.13 scipy==1.2.1 six==1.12.0 snowballstemmer==1.2.1 sortedcontainers==1.5.9 Sphinx==2.0.1 sphinxcontrib-applehelp==1.0.1 sphinxcontrib-devhelp==1.0.1 sphinxcontrib-htmlhelp==1.0.2 sphinxcontrib-jsmath==1.0.1 sphinxcontrib-qthelp==1.0.2 sphinxcontrib-serializinghtml==1.1.3 spyder==3.3.4 spyder-kernels==0.4.4 SQLAlchemy==1.2.2 statsmodels==0.9.0 tables==3.4.2 testpath==0.4.2 toolz==0.9.0 tornado==6.0.2 traitlets==4.3.2 typed-ast==1.3.4 typing-extensions==3.7.2 urllib3==1.24.3 wcwidth==0.1.7 web3==4.4.1 webencodings==0.5.1 websockets==5.0.1 wrapt==1.11.1 wurlitzer==1.0.2 yarl==1.1.0 在运行catalyst 的时候会提示: runfile('/Users/mac/Desktop/UPF/Master Thesis/py/crypocurrency/trading.py', wdir='/Users/mac/Desktop/UPF/Master Thesis/py/crypocurrency') Traceback (most recent call last): File "<ipython-input-10-5dde7acc5e52>", line 1, in <module> runfile('/Users/mac/Desktop/UPF/Master Thesis/py/crypocurrency/trading.py', wdir='/Users/mac/Desktop/UPF/Master Thesis/py/crypocurrency') File "/Users/mac/miniconda3/envs/catalyst/lib/python3.6/site-packages/spyder_kernels/customize/spydercustomize.py", line 827, in runfile execfile(filename, namespace) File "/Users/mac/miniconda3/envs/catalyst/lib/python3.6/site-packages/spyder_kernels/customize/spydercustomize.py", line 110, in execfile exec(compile(f.read(), filename, 'exec'), namespace) File "/Users/mac/Desktop/UPF/Master Thesis/py/crypocurrency/trading.py", line 6, in <module> from catalyst import run_algorithm File "/Users/mac/Desktop/UPF/Master Thesis/py/crypocurrency/catalyst.py", line 1, in <module> from catalyst import run_algorithm ImportError: cannot import name 'run_algorithm' 我在网上找了很久的解决方案但是都没有一个能解决到的。 会不会是因为在安装catalyst的时候就已经出了这个问题所导致的? 以下为我在安装的时候发生的错误。 请各位大神帮帮忙! ERROR: Cannot uninstall 'certifi'. It is a distutils installed project and thus we cannot accurately determine which files belong to it which would lead to only a partial uninstall. Note: you may need to restart the kernel to use updated packages.
如何把Python的.py文件转为DLL文件用于调用呢?
我是一枚Python新手,现在手上有一个python的Test.py文件,一个利用cython生成C的setup.py文件,通过命令行生成Test.c文件。 然后应该就可以使用.def文件生成dll文件了,但运行后,会有关于def文件中我方法名的报错:外部无法解析的外部符号。但方法名和我原py文件的方法名是一致的,为什么会报错呢? 或者有其他转dll的好办法吗?详细一些的,谢谢了。
关于编译器的问题困扰我好长时间求大神解答
1.比如说执行c程序需要c编译器(vs或者mingw),当我把vs安装在D盘后不设置path环境变量,然后执行c程序是不是会找不到编译器而出错呢?如果出错应该怎样配置编译器的环境变量呢? 2.我下载安装了mingw在c盘里,没有设置它的path环境变量,我在其他盘比如D盘打开命令行输入gcc -v 不是应该先在当前目录查找然后再到path中查找编译器吗应该找不到编译器啊怎么还能正确显示mingw的版本信息呢?,windows是怎样寻找到编译器的? 3.为了提高python效率我在python中安装了cython,导入后没有问题,我写了一个cython的测试文件并写了setup.py文件扩展python模块, 但在执行python setup.py build__ext --inplace 是出现 unable find vccarsall.bat 我都安装好了mingw 为什么还有这个提示(难道是找不到这个编译器吗,可是我已经配置好了mingw的path了),查了网上资料,说应该安装vs且大多数都是vs2010以上的版本为例,我电脑上有vc6.0 我想问用vc6.0行不行?,下载的vs2015是不是也要配置环境变量才能让windows找到这个编译器?
python进行C扩展的各种方法本质原理是什么?
我学习了利用C API,Ctypes,Cython等C扩展方式的使用方法,我想这些方法在底层应该有共通的实现原理,我想请教一下高手解释一下这个本质原理,对于C扩展模块能够引入Python与Python模块相互调用的本质原因是什么?
mac想跑一个python服务 但是依赖装不上
ERROR: Complete output from command /usr/local/opt/python/bin/python3.7 -u -c 'import setuptools, tokenize;__file__='"'"'/private/tmp/pip-install-d4w9h8m_/line-profiler/setup.py'"'"';f=getattr(tokenize, '"'"'open'"'"', open)(__file__);code=f.read().replace('"'"'\r\n'"'"', '"'"'\n'"'"');f.close();exec(compile(code, __file__, '"'"'exec'"'"'))' bdist_wheel -d /private/tmp/pip-wheel-omq2hxq_ --python-tag cp37: ERROR: running bdist_wheel running build running build_py creating build creating build/lib.macosx-10.14-x86_64-3.7 copying line_profiler.py -> build/lib.macosx-10.14-x86_64-3.7 copying kernprof.py -> build/lib.macosx-10.14-x86_64-3.7 copying line_profiler_py35.py -> build/lib.macosx-10.14-x86_64-3.7 running build_ext skipping '_line_profiler.c' Cython extension (up-to-date) building '_line_profiler' extension creating build/temp.macosx-10.14-x86_64-3.7 clang -Wno-unused-result -Wsign-compare -Wunreachable-code -fno-common -dynamic -DNDEBUG -g -fwrapv -O3 -Wall -isysroot /Applications/Xcode.app/Contents/Developer/Platforms/MacOSX.platform/Developer/SDKs/MacOSX10.14.sdk -I/Applications/Xcode.app/Contents/Developer/Platforms/MacOSX.platform/Developer/SDKs/MacOSX10.14.sdk/usr/include -I/Applications/Xcode.app/Contents/Developer/Platforms/MacOSX.platform/Developer/SDKs/MacOSX10.14.sdk/System/Library/Frameworks/Tk.framework/Versions/8.5/Headers -I/usr/local/include -I/usr/local/opt/openssl/include -I/usr/local/opt/sqlite/include -I/usr/local/Cellar/python/3.7.4/Frameworks/Python.framework/Versions/3.7/include/python3.7m -c _line_profiler.c -o build/temp.macosx-10.14-x86_64-3.7/_line_profiler.o
error LNK1104: cannot open word2vec_inner.pyd'
windons实现Yang Liu的Topical Word Embeddings时,运行错误 TWE\test.py: import gensim sentence_word = gensim.models.word2vec.LineSentence("tmp/word.file") TWE\gensim\models\word2vec.py: try: raise ImportError # ignore for now from gensim_addons.models.word2vec_inner import train_sentence_sg, train_sentence_cbow, FAST_VERSION, train_sentence_topic except ImportError: try: # try to compile and use the faster cython version import pyximport print 'import pyximport' models_dir = os.path.dirname(__file__) or os.getcwd() print 'models_dir' pyximport.install(setup_args={"include_dirs": [models_dir, get_include()]}) print 'pyximport' # is the follow code's problem from word2vec_inner import train_sentence_sg, train_sentence_cbow, FAST_VERSION, train_sentence_topic print 'from word2vec' except: print 'except2' # failed... fall back to plain numpy (20-80x slower training than the above) FAST_VERSION = -1 def train_sentence_sg(model, sentence, alpha, work=None): ... def train_sentence_cbow(model, sentence, alpha, work=None, neu1=None): ... class Word2Vec(utils.SaveLoad): def __init__(self, sentences=None, size=100, alpha=0.025, window=5, min_count=5,sample=0, seed=1, workers=1, min_alpha=0.0001, sg=1, hs=1, negative=0, cbow_mean=0): ... def train(self, sentences, total_words=None, word_count=0, chunksize=100): if FAST_VERSION < 0: import warnings warnings.warn("Cython compilation failed, training will be slow. Do you have Cython installed? `pip install cython`") logger.info("training model with %i workers on %i vocabulary and %i features, " "using 'skipgram'=%s 'hierarchical softmax'=%s 'subsample'=%s and 'negative sampling'=%s" % (self.workers, len(self.vocab), self.layer1_size, self.sg, self.hs, self.sample, self.negative)) ... def worker_train(): if self.sg: job_words = sum(train_sentence_topic(self, sentence, alpha, work) for sentence in job) else: job_words = sum(train_sentence_cbow(self, sentence, alpha, work, neu1) for sentence in job) ... 运行train.py,出现以下错误: E:\Python27\python.exe D:/pycharm/TWE/TWE1/train.py wordmap.txt model-final.tassign 100 import pyximport models_dir pyximport word2vec_inner.c e:\python27\lib\site-packages\numpy\core\include\numpy\npy_1_7_deprecated_api.h(12) : Warning Msg: Using deprecated NumPy API, disable it by #defining NPY_NO_DEPRECATED_API NPY_1_7_API_VERSION C:\Users\hp\.pyxbld\temp.win32-2.7\Release\pyrex\gensim\models\word2vec_inner.c(15079) : warning C4244: 'initializing' : conversion from 'double' to 'float', possible loss of data C:\Users\hp\.pyxbld\temp.win32-2.7\Release\pyrex\gensim\models\word2vec_inner.c(15085) : warning C4244: 'initializing' : conversion from 'double' to 'float', possible loss of data LINK : fatal error LNK1104: cannot open file 'C:\Users\hp\.pyxbld\lib.win32-2.7\gensim\models\word2vec_inner.pyd' except2 Training the word vector... D:\pycharm\TWE\TWE1\gensim\models\word2vec.py:410: UserWarning: Cython compilation failed, training will be slow. Do you have Cython installed? `pip install cython` warnings.warn("Cython compilation failed, training will be slow. Do you have Cython installed? `pip install cython`") PROGRESS: at 100.00% words, alpha 0.02500, 2556 words/s Training the topic vector... D:\pycharm\TWE\TWE1\gensim\models\word2vec.py:882: UserWarning: Cython compilation failed, training will be slow. Do you have Cython installed? `pip install cython` warnings.warn("Cython compilation failed, training will be slow. Do you have Cython installed? `pip install cython`") Exception in thread Thread-23: Traceback (most recent call last): File "E:\Python27\lib\threading.py", line 801, in __bootstrap_inner self.run() File "E:\Python27\lib\threading.py", line 754, in run self.__target(*self.__args, **self.__kwargs) File "D:\pycharm\TWE\TWE1\gensim\models\word2vec.py", line 909, in worker_train job_words = sum(train_sentence_topic(self, sentence, alpha, work) for sentence in job) File "D:\pycharm\TWE\TWE1\gensim\models\word2vec.py", line 909, in <genexpr> job_words = sum(train_sentence_topic(self, sentence, alpha, work) for sentence in job) NameError: global name 'train_sentence_topic' is not defined Saving the topic vectors... Saving the word vectors... Process finished with exit code 0 我已经安装了Microsoft Visual C++ Compiler for Python 2.7和cython,而且我也用一个小的程序测试了cython是正确编译和安装了的,但是还是出现问题。按照这个博客上的测试了cython,然后按照一个博客运行的TWE程序。看了好久,总结了应该是在word2vec.py最开始导入不了train_sentence_sg, train_sentence_cbow, FAST_VERSION, train_sentence_to。但是为什么导入不了,总觉得不应该,我成功编译了pyx文件的,cython也是正确安装了的。到底是什么问题,有大神遇到过这个问题的吗?求大神帮忙,谢谢!急急急,在线等
An error ocurred while starting the kernel
正常安装anaconda后打开spyder,右下角控制台出现错误警告; Github上说程序添加进防火墙和杀毒软件,试过了还是无法解决,不知道有没有遇到同样问题的大佬是怎么解决的,请告知我一声,万分感谢! Versions Spyder version: 3.3.3 Python version: 3.7.2 Qt version: 5.9.7 PyQt version: 5.9.2 Operating System name/version: windows 7 IPython >=4.0 : 7.3.0 (OK) cython >=0.21 : 0.29.6 (OK) jedi >=0.9.0 : 0.13.3 (OK) matplotlib >=2.0.0: 3.0.3 (OK) nbconvert >=4.0 : 5.4.1 (OK) numpy >=1.7 : 1.16.2 (OK) pandas >=0.13.1 : 0.24.2 (OK) pycodestyle >=2.3 : 2.5.0 (OK) pyflakes >=0.6.0 : 2.1.1 (OK) pygments >=2.0 : 2.3.1 (OK) pylint >=0.25 : 2.3.1 (OK) qtconsole >=4.2.0 : 4.4.3 (OK) rope >=0.9.4 : 0.12.0 (OK) sphinx >=0.6.6 : 1.8.5 (OK) sympy >=0.7.3 : 1.3 (OK) ``` An error ocurred while starting the kernel The error is: Traceback (most recent call last): File "C:\Anaconda3\lib\site‑packages\traitlets\traitlets.py", line 528, in get value = obj._trait_values[self.name] KeyError: 'context' During handling of the above exception, another exception occurred: Traceback (most recent call last): File "C:\Anaconda3\lib\site‑packages\spyder\plugins\ipythonconsole.py", line 1554, in create_kernel_manager_and_kernel_client kernel_manager.start_kernel(stderr=stderr_handle) File "C:\Anaconda3\lib\site‑packages\jupyter_client\manager.py", line 261, in start_kernel self._connect_control_socket() File "C:\Anaconda3\lib\site‑packages\jupyter_client\manager.py", line 210, in _connect_control_socket self._control_socket = self.connect_control() File "C:\Anaconda3\lib\site‑packages\jupyter_client\connect.py", line 571, in connect_control return self._create_connected_socket('control', identity=identity) File "C:\Anaconda3\lib\site‑packages\jupyter_client\connect.py", line 543, in _create_connected_socket sock = self.context.socket(socket_type) File "C:\Anaconda3\lib\site‑packages\traitlets\traitlets.py", line 556, in __get__ return self.get(obj, cls) File "C:\Anaconda3\lib\site‑packages\traitlets\traitlets.py", line 535, in get value = self._validate(obj, dynamic_default()) File "C:\Anaconda3\lib\site‑packages\jupyter_client\manager.py", line 42, in _context_default return zmq.Context.instance() File "C:\Anaconda3\lib\site‑packages\zmq\sugar\context.py", line 108, in instance cls._instance = cls(io_threads=io_threads) File "zmq/backend/cython/context.pyx", line 49, in zmq.backend.cython.context.Context.__cinit__ zmq.error.ZMQError: Bad address ```
C++调用Python加载第三方库速度很慢怎么解决?
我用Cython实现了C++调用Python函数,但运行时加载第三方库的时间好长,请问如何解决呢?
window faster rcnn error -sed=c99.
F:\Caffe-cp\faster_rcnn\py-faster-rcnn\lib>python setup.py install home = C:\Program Files\NVIDIA GPU Computing Toolkit\CUDA\v7.5 running install running bdist_egg running egg_info writing fast_rcnn.egg-info\PKG-INFO writing top-level names to fast_rcnn.egg-info\top_level.txt writing dependency_links to fast_rcnn.egg-info\dependency_links.txt reading manifest file 'fast_rcnn.egg-info\SOURCES.txt' writing manifest file 'fast_rcnn.egg-info\SOURCES.txt' installing library code to build\bdist.win-amd64\egg running install_lib running build_ext skipping 'utils\bbox.c' Cython extension (up-to-date) skipping 'nms\cpu_nms.c' Cython extension (up-to-date) skipping 'pycocotools\_mask.c' Cython extension (up-to-date) building 'pycocotools._mask' extension C:\Users\Joker\AppData\Local\Programs\Common\Microsoft\Visual C++ for Python\9.0\VC\Bin\amd64\cl.exe /c /nologo /Ox /MD /W3 /GS- /DNDEBUG -IE:\anaconda2\anaconda\lib\site-packages\numpy\core\include -Ipycocotools -IE:\anaconda2\anaconda\include -IE:\anaconda2\anaconda\PC /Tcpycocotools\maskApi.c /Fobuild\temp.win-amd64-2.7\Release\pycocotools\maskApi.obj -std=c99 cl : Command line warning D9002 : ignoring unknown option '-std=c99' maskApi.c f:\caffe-cp\faster_rcnn\py-faster-rcnn\lib\pycocotools\maskApi.h(8) : fatal error C1083: Cannot open include file: 'stdbool.h': No such file or directory error: command 'C:\\Users\\Joker\\AppData\\Local\\Programs\\Common\\Microsoft\\Visual C++ for Python\\9.0\\VC\\Bin\\amd64\\cl.exe' failed with exit status 2
在cmd中安装jupyter出错
在安装requests和beautifulsoup4时没有问题,安装jupyter也没有报错, 然后打开jupyter notebook时就报错 ``` Traceback (most recent call last): File "c:\pa_worm\lib\runpy.py", line 193, in _run_module_as_main "__main__", mod_spec) File "c:\pa_worm\lib\runpy.py", line 85, in _run_code exec(code, run_globals) File "c:\pa_worm\Scripts\jupyter-notebook.EXE\__main__.py", line 5, in <module> File "c:\pa_worm\lib\site-packages\notebook\notebookapp.py", line 47, in <module> from zmq.eventloop import ioloop File "c:\pa_worm\lib\site-packages\zmq\__init__.py", line 47, in <module> from zmq import backend File "c:\pa_worm\lib\site-packages\zmq\backend\__init__.py", line 40, in <module> reraise(*exc_info) File "c:\pa_worm\lib\site-packages\zmq\utils\sixcerpt.py", line 34, in reraise raise value File "c:\pa_worm\lib\site-packages\zmq\backend\__init__.py", line 27, in <module> _ns = select_backend(first) File "c:\pa_worm\lib\site-packages\zmq\backend\select.py", line 27, in select_backend mod = __import__(name, fromlist=public_api) File "c:\pa_worm\lib\site-packages\zmq\backend\cython\__init__.py", line 6, in <module> from . import (constants, error, message, context, ImportError: DLL load failed: 找不到指定的模块。 ``` 看不懂这是什么原因有人遇到过这种情况吗
急急急!!!!跪求大神帮助 faster-rcnn lib编译问题,win10系统下
本人电脑上安装了vs2015,cuda9.0+1060显卡,python3.6,系统win10,框架是mxnet以及pytorch0.4版本,近日在跑github上的faster-rcnn的程序时,发现在build cython模块时出现下面错误,网上似乎没有类似情况,希望有大神碰到类似情况的能帮帮我。 ``` Traceback (most recent call last): File "build.py", line 34, in <module> ffi.build() File "D:\anaconda\lib\site-packages\torch\utils\ffi\__init__.py", line 184, in build _build_extension(ffi, cffi_wrapper_name, target_dir, verbose) File "D:\anaconda\lib\site-packages\torch\utils\ffi\__init__.py", line 108, in _build_extension outfile = ffi.compile(tmpdir=tmpdir, verbose=verbose, target=libname) File "D:\anaconda\lib\site-packages\cffi\api.py", line 697, in compile compiler_verbose=verbose, debug=debug, **kwds) File "D:\anaconda\lib\site-packages\cffi\recompiler.py", line 1520, in recompile compiler_verbose, debug) File "D:\anaconda\lib\site-packages\cffi\ffiplatform.py", line 22, in compile outputfilename = _build(tmpdir, ext, compiler_verbose, debug) File "D:\anaconda\lib\site-packages\cffi\ffiplatform.py", line 51, in _build dist.run_command('build_ext') File "D:\anaconda\lib\distutils\dist.py", line 974, in run_command cmd_obj.run() File "D:\anaconda\lib\site-packages\setuptools\command\build_ext.py", line 78, in run _build_ext.run(self) File "D:\anaconda\lib\site-packages\Cython\Distutils\old_build_ext.py", line 186, in run _build_ext.build_ext.run(self) File "D:\anaconda\lib\distutils\command\build_ext.py", line 308, in run force=self.force) File "D:\anaconda\lib\distutils\ccompiler.py", line 1031, in new_compiler return klass(None, dry_run, force) File "D:\anaconda\lib\distutils\cygwinccompiler.py", line 285, in __init__ CygwinCCompiler.__init__ (self, verbose, dry_run, force) File "D:\anaconda\lib\distutils\cygwinccompiler.py", line 129, in __init__ if self.ld_version >= "2.10.90": TypeError: '>=' not supported between instances of 'NoneType' and 'str' ``` 后来我又试了试用gcc编译器,但是仍然存在一下问题(实在是没办法了。。。) ``` C:\MinGW\bin\g++.exe --shared -s build\temp.win-amd64-3.6\Release\gpu_nms.o build\temp.win-amd64-3.6\Release\gpu_nms.cp36-win_amd64.def -LD:\anaconda\libs -LD:\anaconda\PCbuild\amd64 -lcublas -lpython36 -lmsvcr140 -o build\lib.win-amd64-3.6\gpu_nms.cp36-win_amd64.pyd build\temp.win-amd64-3.6\Release\gpu_nms.o: file not recognized: File format not recognized collect2.exe: error: ld returned 1 exit status error: command 'C:\\MinGW\\bin\\g++.exe' failed with exit status 1 ```
kivy开发环境配置问题
我想在centos7上配置kivy的开发环境 我先pip install Cython-0.2.0 然后pip install kivy from kivy.app import App from kivy.uix.button import Button class TestApp(App): def build(self): return Button(text='Hello,kivy') if name == '__main__': TestApp().run() 在启动的时候报错,下面是启动日志: [INFO ] [Logger ] Record log in /root/.kivy/logs/kivy_18-12-05_9.txt [INFO ] [Kivy ] v1.10.1 [INFO ] [Python ] v2.7.5 (default, Oct 30 2018, 23:45:53) [GCC 4.8.5 20150623 (Red Hat 4.8.5-36)] [INFO ] [Factory ] 194 symbols loaded [INFO ] [Image ] Providers: img_tex, img_dds, img_gif (img_pygame, img_pil, img_ffpyplayer ignored) [CRITICAL] [Text ] Unable to find any valuable Text provider. pygame - ImportError: No module named pygame File "/opt/zrj/env/lib/python2.7/site-packages/kivy/core/__init__.py", line 59, in core_select_lib fromlist=[modulename], level=0) File "/opt/zrj/env/lib/python2.7/site-packages/kivy/core/text/text_pygame.py", line 12, in import pygame pil - ImportError: No module named PIL File "/opt/zrj/env/lib/python2.7/site-packages/kivy/core/__init__.py", line 59, in core_select_lib fromlist=[modulename], level=0) File "/opt/zrj/env/lib/python2.7/site-packages/kivy/core/text/text_pil.py", line 7, in from PIL import Image, ImageFont, ImageDraw [CRITICAL] [App ] Unable to get a Text provider, abort. 请各位大佬解惑
爬虫福利二 之 妹子图网MM批量下载
爬虫福利一:27报网MM批量下载 点击 看了本文,相信大家对爬虫一定会产生强烈的兴趣,激励自己去学习爬虫,在这里提前祝:大家学有所成! 目标网站:妹子图网 环境:Python3.x 相关第三方模块:requests、beautifulsoup4 Re:各位在测试时只需要将代码里的变量path 指定为你当前系统要保存的路径,使用 python xxx.py 或IDE运行即可。 ...
Java学习的正确打开方式
在博主认为,对于入门级学习java的最佳学习方法莫过于视频+博客+书籍+总结,前三者博主将淋漓尽致地挥毫于这篇博客文章中,至于总结在于个人,实际上越到后面你会发现学习的最好方式就是阅读参考官方文档其次就是国内的书籍,博客次之,这又是一个层次了,这里暂时不提后面再谈。博主将为各位入门java保驾护航,各位只管冲鸭!!!上天是公平的,只要不辜负时间,时间自然不会辜负你。 何谓学习?博主所理解的学习,它是一个过程,是一个不断累积、不断沉淀、不断总结、善于传达自己的个人见解以及乐于分享的过程。
大学四年自学走来,这些私藏的实用工具/学习网站我贡献出来了
大学四年,看课本是不可能一直看课本的了,对于学习,特别是自学,善于搜索网上的一些资源来辅助,还是非常有必要的,下面我就把这几年私藏的各种资源,网站贡献出来给你们。主要有:电子书搜索、实用工具、在线视频学习网站、非视频学习网站、软件下载、面试/求职必备网站。 注意:文中提到的所有资源,文末我都给你整理好了,你们只管拿去,如果觉得不错,转发、分享就是最大的支持了。 一、电子书搜索 对于大部分程序员...
linux系列之常用运维命令整理笔录
本博客记录工作中需要的linux运维命令,大学时候开始接触linux,会一些基本操作,可是都没有整理起来,加上是做开发,不做运维,有些命令忘记了,所以现在整理成博客,当然vi,文件操作等就不介绍了,慢慢积累一些其它拓展的命令,博客不定时更新 free -m 其中:m表示兆,也可以用g,注意都要小写 Men:表示物理内存统计 total:表示物理内存总数(total=used+free) use...
比特币原理详解
一、什么是比特币 比特币是一种电子货币,是一种基于密码学的货币,在2008年11月1日由中本聪发表比特币白皮书,文中提出了一种去中心化的电子记账系统,我们平时的电子现金是银行来记账,因为银行的背后是国家信用。去中心化电子记账系统是参与者共同记账。比特币可以防止主权危机、信用风险。其好处不多做赘述,这一层面介绍的文章很多,本文主要从更深层的技术原理角度进行介绍。 二、问题引入 假设现有4个人...
程序员接私活怎样防止做完了不给钱?
首先跟大家说明一点,我们做 IT 类的外包开发,是非标品开发,所以很有可能在开发过程中会有这样那样的需求修改,而这种需求修改很容易造成扯皮,进而影响到费用支付,甚至出现做完了项目收不到钱的情况。 那么,怎么保证自己的薪酬安全呢? 我们在开工前,一定要做好一些证据方面的准备(也就是“讨薪”的理论依据),这其中最重要的就是需求文档和验收标准。一定要让需求方提供这两个文档资料作为开发的基础。之后开发...
网页实现一个简单的音乐播放器(大佬别看。(⊙﹏⊙))
今天闲着无事,就想写点东西。然后听了下歌,就打算写个播放器。 于是乎用h5 audio的加上js简单的播放器完工了。 演示地点演示 html代码如下` music 这个年纪 七月的风 音乐 ` 然后就是css`*{ margin: 0; padding: 0; text-decoration: none; list-...
Python十大装B语法
Python 是一种代表简单思想的语言,其语法相对简单,很容易上手。不过,如果就此小视 Python 语法的精妙和深邃,那就大错特错了。本文精心筛选了最能展现 Python 语法之精妙的十个知识点,并附上详细的实例代码。如能在实战中融会贯通、灵活使用,必将使代码更为精炼、高效,同时也会极大提升代码B格,使之看上去更老练,读起来更优雅。
数据库优化 - SQL优化
以实际SQL入手,带你一步一步走上SQL优化之路!
2019年11月中国大陆编程语言排行榜
2019年11月2日,我统计了某招聘网站,获得有效程序员招聘数据9万条。针对招聘信息,提取编程语言关键字,并统计如下: 编程语言比例 rank pl_ percentage 1 java 33.62% 2 cpp 16.42% 3 c_sharp 12.82% 4 javascript 12.31% 5 python 7.93% 6 go 7.25% 7 p...
通俗易懂地给女朋友讲:线程池的内部原理
餐盘在灯光的照耀下格外晶莹洁白,女朋友拿起红酒杯轻轻地抿了一小口,对我说:“经常听你说线程池,到底线程池到底是个什么原理?”
经典算法(5)杨辉三角
杨辉三角 是经典算法,这篇博客对它的算法思想进行了讲解,并有完整的代码实现。
腾讯算法面试题:64匹马8个跑道需要多少轮才能选出最快的四匹?
昨天,有网友私信我,说去阿里面试,彻底的被打击到了。问了为什么网上大量使用ThreadLocal的源码都会加上private static?他被难住了,因为他从来都没有考虑过这个问题。无独有偶,今天笔者又发现有网友吐槽了一道腾讯的面试题,我们一起来看看。 腾讯算法面试题:64匹马8个跑道需要多少轮才能选出最快的四匹? 在互联网职场论坛,一名程序员发帖求助到。二面腾讯,其中一个算法题:64匹...
面试官:你连RESTful都不知道我怎么敢要你?
干货,2019 RESTful最贱实践
JDK12 Collectors.teeing 你真的需要了解一下
前言 在 Java 12 里面有个非常好用但在官方 JEP 没有公布的功能,因为它只是 Collector 中的一个小改动,它的作用是 merge 两个 collector 的结果,这句话显得很抽象,老规矩,我们先来看个图(这真是一个不和谐的图????): 管道改造经常会用这个小东西,通常我们叫它「三通」,它的主要作用就是将 downstream1 和 downstre...
为啥国人偏爱Mybatis,而老外喜欢Hibernate/JPA呢?
关于SQL和ORM的争论,永远都不会终止,我也一直在思考这个问题。昨天又跟群里的小伙伴进行了一番讨论,感触还是有一些,于是就有了今天这篇文。 声明:本文不会下关于Mybatis和JPA两个持久层框架哪个更好这样的结论。只是摆事实,讲道理,所以,请各位看官勿喷。 一、事件起因 关于Mybatis和JPA孰优孰劣的问题,争论已经很多年了。一直也没有结论,毕竟每个人的喜好和习惯是大不相同的。我也看...
SQL-小白最佳入门sql查询一
不要偷偷的查询我的个人资料,即使你再喜欢我,也不要这样,真的不好;
项目中的if else太多了,该怎么重构?
介绍 最近跟着公司的大佬开发了一款IM系统,类似QQ和微信哈,就是聊天软件。我们有一部分业务逻辑是这样的 if (msgType = "文本") { // dosomething } else if(msgType = "图片") { // doshomething } else if(msgType = "视频") { // doshomething } else { // doshom...
【图解经典算法题】如何用一行代码解决约瑟夫环问题
约瑟夫环问题算是很经典的题了,估计大家都听说过,然后我就在一次笔试中遇到了,下面我就用 3 种方法来详细讲解一下这道题,最后一种方法学了之后保证让你可以让你装逼。 问题描述:编号为 1-N 的 N 个士兵围坐在一起形成一个圆圈,从编号为 1 的士兵开始依次报数(1,2,3…这样依次报),数到 m 的 士兵会被杀死出列,之后的士兵再从 1 开始报数。直到最后剩下一士兵,求这个士兵的编号。 1、方...
致 Python 初学者
欢迎来到“Python进阶”专栏!来到这里的每一位同学,应该大致上学习了很多 Python 的基础知识,正在努力成长的过程中。在此期间,一定遇到了很多的困惑,对未来的学习方向感到迷茫。我非常理解你们所面临的处境。我从2007年开始接触 python 这门编程语言,从2009年开始单一使用 python 应对所有的开发工作,直至今天。回顾自己的学习过程,也曾经遇到过无数的困难,也曾经迷茫过、困惑过。开办这个专栏,正是为了帮助像我当年一样困惑的 Python 初学者走出困境、快速成长。希望我的经验能真正帮到你
“狗屁不通文章生成器”登顶GitHub热榜,分分钟写出万字形式主义大作
一、垃圾文字生成器介绍 最近在浏览GitHub的时候,发现了这样一个骨骼清奇的雷人项目,而且热度还特别高。 项目中文名:狗屁不通文章生成器 项目英文名:BullshitGenerator 根据作者的介绍,他是偶尔需要一些中文文字用于GUI开发时测试文本渲染,因此开发了这个废话生成器。但由于生成的废话实在是太过富于哲理,所以最近已经被小伙伴们给玩坏了。 他的文风可能是这样的: 你发现,...
程序员:我终于知道post和get的区别
是一个老生常谈的话题,然而随着不断的学习,对于以前的认识有很多误区,所以还是需要不断地总结的,学而时习之,不亦说乎
GitHub标星近1万:只需5秒音源,这个网络就能实时“克隆”你的声音
作者 | Google团队 译者 | 凯隐 编辑 | Jane 出品 | AI科技大本营(ID:rgznai100) 本文中,Google 团队提出了一种文本语音合成(text to speech)神经系统,能通过少量样本学习到多个不同说话者(speaker)的语音特征,并合成他们的讲话音频。此外,对于训练时网络没有接触过的说话者,也能在不重新训练的情况下,仅通过未知...
《程序人生》系列-这个程序员只用了20行代码就拿了冠军
你知道的越多,你不知道的越多 点赞再看,养成习惯GitHub上已经开源https://github.com/JavaFamily,有一线大厂面试点脑图,欢迎Star和完善 前言 这一期不算《吊打面试官》系列的,所有没前言我直接开始。 絮叨 本来应该是没有这期的,看过我上期的小伙伴应该是知道的嘛,双十一比较忙嘛,要值班又要去帮忙拍摄年会的视频素材,还得搞个程序员一天的Vlog,还要写BU...
加快推动区块链技术和产业创新发展,2019可信区块链峰会在京召开
11月8日,由中国信息通信研究院、中国通信标准化协会、中国互联网协会、可信区块链推进计划联合主办,科技行者协办的2019可信区块链峰会将在北京悠唐皇冠假日酒店开幕。   区块链技术被认为是继蒸汽机、电力、互联网之后,下一代颠覆性的核心技术。如果说蒸汽机释放了人类的生产力,电力解决了人类基本的生活需求,互联网彻底改变了信息传递的方式,区块链作为构造信任的技术有重要的价值。   1...
程序员把地府后台管理系统做出来了,还有3.0版本!12月7号最新消息:已在开发中有github地址
第一幕:缘起 听说阎王爷要做个生死簿后台管理系统,我们派去了一个程序员…… 996程序员做的梦: 第一场:团队招募 为了应对地府管理危机,阎王打算找“人”开发一套地府后台管理系统,于是就在地府总经办群中发了项目需求。 话说还是中国电信的信号好,地府都是满格,哈哈!!! 经常会有外行朋友问:看某网站做的不错,功能也简单,你帮忙做一下? 而这次,面对这样的需求,这个程序员...
网易云6亿用户音乐推荐算法
网易云音乐是音乐爱好者的集聚地,云音乐推荐系统致力于通过 AI 算法的落地,实现用户千人千面的个性化推荐,为用户带来不一样的听歌体验。 本次分享重点介绍 AI 算法在音乐推荐中的应用实践,以及在算法落地过程中遇到的挑战和解决方案。 将从如下两个部分展开: AI算法在音乐推荐中的应用 音乐场景下的 AI 思考 从 2013 年 4 月正式上线至今,网易云音乐平台持续提供着:乐屏社区、UGC...
【技巧总结】位运算装逼指南
位算法的效率有多快我就不说,不信你可以去用 10 亿个数据模拟一下,今天给大家讲一讲位运算的一些经典例子。不过,最重要的不是看懂了这些例子就好,而是要在以后多去运用位运算这些技巧,当然,采用位运算,也是可以装逼的,不信,你往下看。我会从最简单的讲起,一道比一道难度递增,不过居然是讲技巧,那么也不会太难,相信你分分钟看懂。 判断奇偶数 判断一个数是基于还是偶数,相信很多人都做过,一般的做法的代码如下...
【管理系统课程设计】美少女手把手教你后台管理
【文章后台管理系统】URL设计与建模分析+项目源码+运行界面 栏目管理、文章列表、用户管理、角色管理、权限管理模块(文章最后附有源码) 1. 这是一个什么系统? 1.1 学习后台管理系统的原因 随着时代的变迁,现如今各大云服务平台横空出世,市面上有许多如学生信息系统、图书阅读系统、停车场管理系统等的管理系统,而本人家里就有人在用烟草销售系统,直接在网上完成挑选、购买与提交收货点,方便又快捷。 试想,若没有烟草销售系统,本人家人想要购买烟草,还要独自前往药...
4G EPS 第四代移动通信系统
目录 文章目录目录4G 与 LTE/EPCLTE/EPC 的架构E-UTRANE-UTRAN 协议栈eNodeBEPCMMES-GWP-GWHSSLTE/EPC 协议栈概览 4G 与 LTE/EPC 4G,即第四代移动通信系统,提供了 3G 不能满足的无线网络宽带化,主要提供数据(上网)业务。而 LTE(Long Term Evolution,长期演进技术)是电信领域用于手机及数据终端的高速无线通...
日均350000亿接入量,腾讯TubeMQ性能超过Kafka
整理 | 夕颜出品 | AI科技大本营(ID:rgznai100)【导读】近日,腾讯开源动作不断,相继开源了分布式消息中间件TubeMQ,基于最主流的 OpenJDK8开发的Tencent Kona JDK,分布式HTAP数据库 TBase,企业级容器平台TKEStack,以及高性能图计算框架Plato。短短一周之内,腾讯开源了五大重点项目。其中,TubeMQ是腾讯大数据平台部门应用的核心组件,...
8年经验面试官详解 Java 面试秘诀
作者 |胡书敏 责编 | 刘静 出品 | CSDN(ID:CSDNnews) 本人目前在一家知名外企担任架构师,而且最近八年来,在多家外企和互联网公司担任Java技术面试官,前后累计面试了有两三百位候选人。在本文里,就将结合本人的面试经验,针对Java初学者、Java初级开发和Java开发,给出若干准备简历和准备面试的建议。 Java程序员准备和投递简历的实...
相关热词 c# 二进制截断字符串 c#实现窗体设计器 c#检测是否为微信 c# plc s1200 c#里氏转换原则 c# 主界面 c# do loop c#存为组套 模板 c# 停掉协程 c# rgb 读取图片
立即提问