在Ubuntu14.04安装skyeye,make的时候出现这个错误怎么解决,各位大佬帮帮忙:

在Ubuntu14.04安装skyeye,make的时候出现这个错误怎么解决,各位大佬帮帮忙:

compilation terminated.
make[2]: *** [translate_singlestep.lo] Error 1
make[2]: Leaving directory /home/jlink/arm/skyeye-1.3.5_rc1/common'
make[1]: *** [all-recursive] Error 1
make[1]: Leaving directory
/home/jlink/arm/skyeye-1.3.5_rc1'
make: *** [all] Error 2

而且安装后的skyeye后,打开opt/skyeye文件下只有 include info lib ,缺少了bin testsuite,这该怎么解决呀,
我是从skyeye官网上下载的skyeye-1.3.5_rc1.tar.bz2来的

1个回答

/home/jlink/arm/skyeye-1.3.5_rc1/common'
arm?你在pc上装,应该找x86 x64 i686 amd64之类的,而不是arm

caozhy
贵阳老马马善福专业维修游泳池堵漏防水工程 回复: 没有bin的话,那么需要先编译
接近 2 年之前 回复
m0_37683338
jlink.x 这个arm是我自己弄的一个文件夹而已,我把skyeye放在这里,这个也会影响的吗
接近 2 年之前 回复
Csdn user default icon
上传中...
上传图片
插入图片
抄袭、复制答案,以达到刷声望分或其他目的的行为,在CSDN问答是严格禁止的,一经发现立刻封号。是时候展现真正的技术了!
立即提问