在Vwmare Workstations14上安装CentOS7时出现问题,求解 5C

在Vwmare Workstations14上安装CentOS7时出现问题,求解
图片说明

1个回答

这个错误是的镜像出了无法解析的问题,仔细检查镜像是否支持该版本的虚拟机,或者重新下载一个新的镜像;若是在创建虚拟机是误选其他选项删除镜像文件重新创建即可,若以上问题都不是,那就是重装一下Vwmare Workstations,或提高Vwmare Workstations的版本试试。

Csdn user default icon
上传中...
上传图片
插入图片
抄袭、复制答案,以达到刷声望分或其他目的的行为,在CSDN问答是严格禁止的,一经发现立刻封号。是时候展现真正的技术了!
其他相关推荐
安装centos7出现问题
[img=https://img-bbs.csdn.net/upload/201610/01/1475320452_981782.jpg][/img],[img=https://img-bbs.csdn.net/upload/201610/01/1475320487_954567.jpg][/img],[img=https://img-bbs.csdn.net/upload/201610/01/1475320535_61956.jpg][/img]安装的时候出现这个怎么解决啊
CentOS7下安装mongoDB出现问题
今天在CentOS7下运行YUM安装的时候出现以下问题[root@iz2ze6u0apce8jpapxeubpz mongodb]# yum -y install mongodb-org Loaded plugins: fastestmirror File contains no section headers. file: file:///etc/yum.repos.d/mongodb-org-3
Centos7安装MPICH出现问题
求大佬们看看帮助解决谢谢啦! [root@localhost mpich-3.2.1]# bash ./configure --prefix=/home/gq/mpich-install --disable-fortran 2>&1 | tee c.txt Configuring MPICH version 3.2.1 with '--prefix=/home/gq/mpich-i...
Centos7安装MPICH3在配置安装目录时出现问题
麻烦各位大神看看这是什么原因,帮忙解决一下。谢谢啦!! [root@localhost mpich-3.2.1]# bash ./configure --prefix=/home/gq/mpich-install --disable-fortran 2>&1 | tee c.txt Configuring MPICH version 3.2.1 with '--prefix=/ho...
安装JavaSDK6出现问题,求解
我的电脑上已经安装有jdk1.5版本,我下载了jdk1.6的版本,安装的时候弹出错误:rn发送内部错误。rn请与管理员联系。rn下面是显示详细信息。rn有关其他信息,请参见日志文件。rn按“确定”退出。rnnullrnrn我的是win7系统~ 请问这是咋个回事哦?
eclipse安装出现问题,求解
![图片说明](https://img-ask.csdn.net/upload/201801/29/1517193737_121247.png)
db2 9 在xp 上安装时出现问题
请高手帮忙啊,我急!!!rn我在xp上安装db2 9 版本时,出现错误提示:“rn在此计算机上安装DB2时发生了重大错误。安装不能继续。安装日志位于c:\..........”rn日志信息如下:rn=== 记录开始: 2008-4-18 0:00:54 ===rn操作 0:00:54: INSTALL. rn操作开始 0:00:54: INSTALL。rn操作 0:00:54: AppSearch. 正在搜索已安装的应用程序rn操作开始 0:00:54: AppSearch。rnAppSearch: 属性: INSTALLDIR.64D68DB0_DBE9_457E_ABE5_38AA65A3E74E,签名: InstallPathInRegrnAppSearch: 属性: VERINREG.64D68DB0_DBE9_457E_ABE5_38AA65A3E74E,签名: VerInRegrnAppSearch: 属性: IE4FOUND,签名: sigShdocvwISUSrnAppSearch: 属性: XPFOUND,签名: sigKernel32rnAppSearch: 属性: MDAC28IE4SIG,签名: NewSignature11.E7D6BCFA_9BFA_49D4_A1EE_767B7FD61E38rnAppSearch: 属性: MDAC28INSTVER,签名: NewSignature1.E7D6BCFA_9BFA_49D4_A1EE_767B7FD61E38rnAppSearch: 属性: DB2_COPY_NAME,签名: DB2_COPY_NAMErnAppSearch: 属性: PROP_RSP_DB2_OLEDB_GUID,签名: PROP_RSP_DB2_OLEDB_GUIDrnAppSearch: 属性: PROP_RSP_DB2_OLEDB_ADVANCED_PAGE_GUID,签名: PROP_RSP_DB2_OLEDB_ADVANCED_PAGE_GUIDrnAppSearch: 属性: PROP_RSP_DB2_OLEDB_CONNECTION_PAGE_GUID,签名: PROP_RSP_DB2_OLEDB_CONNECTION_PAGE_GUIDrnAppSearch: 属性: PROP_RSP_DB2_OLEDB_ENUMERATOR_GUID,签名: PROP_RSP_DB2_OLEDB_ENUMERATOR_GUIDrnAppSearch: 属性: PROP_RSP_DB2_OLEDB_ERROR_LOOKUP_GUID,签名: PROP_RSP_DB2_OLEDB_ERROR_LOOKUP_GUIDrn。。。。。。。。。。。。rn。。。。。。。。。。。。rn。。。。。。。。。。。。rnProperty(C): text1 = 0rnProperty(C): DWUSLINK = CEECB798E9EBE7D83EACD08FAEDC978F2EBC978F49BC9708CEDB87EFC98BF738EEFC871FBEACrnProperty(C): PROGMSG_IIS_REMOVESITE = 正在删除端口 %d 的网站rnProperty(C): PROGMSG_IIS_CREATEVROOT = 正在创建 IIS 虚拟目录 %srnProperty(C): PROGMSG_IIS_CREATEVROOTS = 正在创建 IIS 虚拟目录...rnProperty(C): PROGMSG_IIS_EXTRACTDONE = 已检索 IIS 虚拟目录的信息...rnProperty(C): PROGMSG_IIS_REMOVEVROOT = 正在删除 IIS 虚拟目录 %srnProperty(C): PROGMSG_IIS_REMOVEVROOTS = 正在删除 IIS 虚拟目录...rnProperty(C): PROGMSG_IIS_ROLLBACKVROOTS = 正在回滚虚拟目录和网站更改...rnProperty(C): PROGMSG_IIS_EXTRACT = 正在检索 IIS 虚拟目录的信息...rnProperty(C): IS_COMPLUS_PROGRESSTEXT_COST = 正在计算 COM+ 应用程序成本: [1]rnProperty(C): IS_COMPLUS_PROGRESSTEXT_INSTALL = 正在安装 COM+ 应用程序: [1]rnProperty(C): IS_COMPLUS_PROGRESSTEXT_UNINSTALL = 正在卸载 COM+ 应用程序: [1]rnProperty(C): IS_SQLSERVER_AUTHENTICATION = 0rnProperty(C): IS_SQLSERVER_USERNAME = sarnProperty(C): IS_PROGMSG_XML_COSTING = 正在计算 XML 文件成本...rnProperty(C): IS_PROGMSG_XML_CREATE_FILE = 正在创建 XML 文件 %s...rnProperty(C): IS_PROGMSG_XML_FILES = 正在执行 XML 文件更改...rnProperty(C): IS_PROGMSG_XML_REMOVE_FILE = 正在删除 XML 文件 %s...rnProperty(C): IS_PROGMSG_XML_ROLLBACK_FILES = 正在回滚 XML 文件更改...rnProperty(C): IS_PROGMSG_XML_UPDATE_FILE = 正在更新 XML 文件 %s...rnProperty(C): PROGMSG_IIS_CREATEAPPPOOLS = 正在创建应用程序池...rnProperty(C): PROGMSG_IIS_CREATEAPPPOOL = 创建应用程序池 %srnProperty(C): PROGMSG_IIS_CREATEWEBSERVICEEXTENSION = 创建 Web 服务扩展rnProperty(C): PROGMSG_IIS_CREATEWEBSERVICEEXTENSIONS = 正在创建 Web 服务扩展...rnProperty(C): PROGMSG_IIS_REMOVEAPPPOOL = 删除应用程序池rnProperty(C): PROGMSG_IIS_REMOVEAPPPOOLS = 正在删除应用程序池...rnProperty(C): PROGMSG_IIS_REMOVEWEBSERVICEEXTENSION = 删除 Web 服务扩展rnProperty(C): PROGMSG_IIS_REMOVEWEBSERVICEEXTENSIONS = 正在删除 Web 服务扩展...rnProperty(C): PROGMSG_IIS_ROLLBACKAPPPOOLS = 正在回滚应用程序池...rnProperty(C): PROGMSG_IIS_ROLLBACKWEBSERVICEEXTENSIONS = 正在回滚 Web 服务扩展...rnProperty(C): p_groupType = LOCALrnProperty(C): db2InstallName_txt1 = 0rnProperty(C): db2InstallName_txt2 = 0rnProperty(C): db2InstallName_txt3 = 0rnProperty(C): db2InstallName_txt4 = 0rnProperty(C): p_newLocation = YrnProperty(C): p_setDefaultInstallName = YrnProperty(C): p_installDAS = NrnProperty(C): iaRspText = 0rnProperty(C): NewProperty3 = 0rnProperty(C): p_defaultInstallSelect = 1rnProperty(C): DB2_DEFAULT_STRING = ___NotSet___rnProperty(C): VersionString = 9.0rnProperty(C): PROP_RSP_DEFAULT_COPY = YESrnProperty(C): PROP_RSP_DB2_COPY_NAME = DB2_01rnProperty(C): p_maxNodeNum = 0rnProperty(C): iaValidRsp = YrnProperty(C): ISReleaseFlags = ESErnProperty(C): DWUSLOGO = DefaultrnProperty(C): DWUSLANG = 1033rnProperty(C): DWUSMANAGER = 1rnProperty(C): REINSTALLMODE = vomusrnProperty(C): DB2_LAUNCHER_RC_FILE = C:\DOCUME~1\ADMINI~1\LOCALS~1\Temp\DB232.tmprnProperty(C): ProductLanguage = 2052rnProperty(C): DB2_LOG_FILE_PATH = C:\Documents and Settings\Administrator\My Documents\DB2LOG\DB2-ESE-Fri Apr 18 00_00_45 2008.logrnProperty(C): VersionMsi = 3.01rnProperty(C): COMPANYNAME = 番茄花园rnProperty(C): USERNAME = 番茄花园rnProperty(C): MsiNTProductType = 1rnProperty(C): ACTION = INSTALLrnProperty(C): ServicePackLevelMinor = 0rnProperty(C): WindowsBuild = 2600rnProperty(C): VersionDatabase = 200rnProperty(C): INSTALL_MODE = NEWrnProperty(C): Preselected = 1rnProperty(C): ProductState = -1rnProperty(C): PackageCode = 1BD65D83-AEA2-4006-B520-E98EC0A348FBrnProperty(C): SETUPEXEDIR = F:\db2_v9_rc1_ese_win_32\ESE\image\db2\WindowsrnProperty(C): RemoteAdminTS = 1rnProperty(C): LAUNCHPAD_LOCATION = F:\db2_v9_rc1_ese_win_32\ESE\imagernProperty(C): CLIENTPROCESSID = 1136rnProperty(C): CLIENTUILEVEL = 0rnProperty(C): UILevel = 5rnProperty(C): ServicePackLevel = 2rnProperty(C): CURRENTDIRECTORY = F:\db2_v9_rc1_ese_win_32\ESE\image\db2\WindowsrnProperty(C): TRANSFORMS = F:\db2_v9_rc1_ese_win_32\ESE\image\db2\Windows\ESE\2052.MSTrnProperty(C): PackagecodeChanging = 1rnProperty(C): CurrentServiceLevel = NT32rnProperty(C): CurrentFixLevel = 257rnProperty(C): GPTSupport = 1rnProperty(C): OLEAdvtSupport = 1rnProperty(C): ShellAdvtSupport = 1rnProperty(C): Intel = 15rnProperty(C): PhysicalMemory = 511rnProperty(C): VirtualMemory = 898rnProperty(C): AdminUser = 1rnProperty(C): LogonUser = AdministratorrnProperty(C): UserSID = S-1-5-21-2000478354-507921405-725345543-500rnProperty(C): UserLanguageID = 2052rnProperty(C): ComputerName = F80777B0F0924EDrnProperty(C): SystemLanguageID = 2052rnProperty(C): ScreenX = 1024rnProperty(C): ScreenY = 768rnProperty(C): CaptionHeight = 36rnProperty(C): BorderTop = 1rnProperty(C): BorderSide = 1rnProperty(C): TextHeight = 16rnProperty(C): ColorBits = 32rnProperty(C): TTCSupport = 1rnProperty(C): Time = 0:07:35rnProperty(C): Date = 2008-4-18rnProperty(C): MsiNetAssemblySupport = 2.0.50727.1433rnProperty(C): MsiWin32AssemblySupport = 5.1.2600.3019rnProperty(C): RedirectedDllSupport = 2rnProperty(C): Privileged = 1rnProperty(C): DATABASE = C:\DOCUME~1\ADMINI~1\LOCALS~1\Temp\6908cb.msirnProperty(C): OriginalDatabase = F:\db2_v9_rc1_ese_win_32\ESE\image\db2\Windows\DB2 Enterprise Server Edition.msirnProperty(C): SOURCEDIR = F:\db2_v9_rc1_ese_win_32\ESE\image\db2\Windows\rnProperty(C): VersionHandler = 3.01rnProperty(C): TextHeightCorrection = 1.2307rnProperty(C): CostingComplete = 0rnProperty(C): SourcedirProduct = F23620AE-7E17-4863-898D-7F191B39022CrnProperty(C): DB2_INSTALL_LANG = CNrnProperty(C): LAP_SUPPORTED_LANG = YrnProperty(C): SUMMARY_SUPPORTED = YrnProperty(C): CURRENT_PROCESS_DIRECTORY = C:\DOCUME~1\ADMINI~1\LOCALS~1\Temp\_DB20000rnProperty(C): TEMP_HELP_DIRECTORY = C:\DOCUME~1\ADMINI~1\LOCALS~1\Temp\_DB20000rnProperty(C): INSTALL_RESULT = Setup Completed with Errorrn=== 记录停止: 2008-4-18 0:07:35 ===rnMSI (c) (70:1C) [00:07:35:500]: 产品: DB2 Enterprise Server Edition -- 安装操作失败。rnrn
Eclipse安装时出现问题
第一篇博客以后要多尝试写写。至于质量,,,以后会慢慢提高滴! 第一次装Eclipse时居然版本过低,需要下载新版本Eclipse 64位的,因为我的电脑是win10。运行报错如截图:再有win10 JDK环境配置: 一共三步: 1.此电脑—属性—高级系统设置—环境变量—系统变量 2.加入和修改三个部分 1.1: 加入新环境地址:JAVA_HOME 新建系统环境变量 变量名:JAVA
安装ie6.0时出现问题
在安装IE 6时,出现下面的错误提示:rn“以前的安装有尚未完成的操作,需要重新启动。建议在运行 Internet Explorer 安装程序之前重新启动计算机。现在安装程序将关闭。”rn重启计算机后,还是出现的问题。rnrn解决方法:rn运行ie6setup.exe /q rnrn这个运行ie6setup.exe /q的解决方法我看不懂啊 在哪里输入/q 它是什么意思 请帮忙一下 谢了
安装VS.NET时出现问题
在XP中安装VS.NET,按提示放入第五张盘进行系统更新,进度条走到30%时,出现蓝屏,显示NO-MORE-IRP-STACK-LOCATIONS,可能是什么原因?望赐教。
安装linux时出现问题
我进入了第一个安装介面,出现了:rn/dev/hda1rn/dev/hda5rn/dev/hda7rn/dev/hda8rn/dev/hda9rn上面这几个我应该选哪个?rn我的C盘装的是2K,D盘用魔术分区大师分成了ext2和swaprn,在2K下是看不到这个盘的,还有E,F,G,C为主分区,H为光驱,下载的ISO文件在F:/linux文件夹下,里面有解压后的文件和源文件,但是在DOS下进入时却发现linux文件夹在E盘上,还有在选择文件目录时我该填什么呢?rn我装的是红旗linux4.0,源文件的名字是rfdesktop4rn我急!rn
安装OpenSSL时出现问题...
我想在WIN32环境VC6.0下安装OpenSSL。rnrn 安装步骤如网帖所说如下:rnrn[color=#999999]环境: VC++, ActivePerl rnrn1. 下载openssl源代码: http://www.openssl.org/ rnrn2. 配置 rnrnD:\openssl-0.9.8a>perl Configure VC-WIN32 rnD:\openssl-0.9.8a>ms\do_ms.bat运行时会出现找不到%OSVERSION%环境变量的错误,不必理会。 rnrn3. 编译 rnrn(ntdll.mak编译成动态dll。如需要静态dll则使用nt.mak) rnrnD:\openssl-0.9.8a>"C:\Program Files\Microsoft Visual Studio\VC98\Bin\VCVARS32.BAT" rnSetting environment for using Microsoft Visual C++ tools. rnD:\openssl-0.9.8a>nmake -f ms\ntdll.makrnrn4. 测试 rnrnD:\openssl-0.9.8a>cd out32dll rnD:\openssl-0.9.8a\out32dll>..\ms\testrnrn5. 安装 rnrnD:\openssl-0.9.8a>md c:\lib\openssl rnD:\openssl-0.9.8a>md c:\lib\openssl\bin rnD:\openssl-0.9.8a>md c:\lib\openssl\lib rnD:\openssl-0.9.8a>md c:\lib\openssl\include rnD:\openssl-0.9.8a>md c:\lib\openssl\include\openssl rnD:\openssl-0.9.8a>copy /b inc32\openssl\* c:\lib\openssl\lib rnD:\openssl-0.9.8a>copy /b out32dll\ssleay32.lib c:\lib\openssl\lib rnD:\openssl-0.9.8a>copy /b out32dll\libeay32.lib c:\lib\openssl\lib rnD:\openssl-0.9.8a>copy /b out32dll\ssleay32.dll c:\lib\openssl\bin rnD:\openssl-0.9.8a>copy /b out32dll\libeay32.dll c:\lib\openssl\bin rnD:\openssl-0.9.8a>copy /b out32dll\openssl.exe c:\lib\openssl\bin rnD:\openssl-0.9.8a>copy README c:\lib\openssl rnD:\openssl-0.9.8a>copy LICENSE c:\lib\openssl[/color]rnrnrn可是在输入命令 D:\openssl-0.9.8a>nmake -f ms\ntdll.mak 后提示rn'ml'不是内部或外部命令,也不是可运行程序或批处理文件。rn导致安装不能成功...求神牛解释...
安装时出现问题了
运行后出现 selection does not contain a main type 是怎么回事啊??
安装VB时出现问题
我在安装VB时,出现如下错误框:0x004087f1指令引用的内存,该内存不能为read.要终止程序,请单击"确定".要调试程序,请单击"取消".
安装quickreport4.5时出现问题
选择菜单:component->Install packages,点击add按钮,在按件的文件夹的bin目录中选择QR4DesignD7.bpl文件,然后点击ok按钮。这样一来虽然在控件面板中出现了QReport控件,不过编译程序的时候老出现错误,提示信息是找不到QRPDFFilt.dcu文件,可是我在Quickreport4.5的文件夹里找不到这个文件件,连QRPDFFilt.pas也没有,我在网上下了好几个控件都是这种情况,是不是我的安装过程中出了问题呢?
安装第三方控件时出现问题!
我在安装TStretchHandle时出现以下错误!rn[Error]RLINK32:Unsupported 16bit resource in file "D:\...\Lib\HANDLES.dcr"
安装GAIM时出现问题!
[root@puny tmp]# rpm -ivh gaim-0.77-0rh9.i386.rpmrnwarning: gaim-0.77-0rh9.i386.rpm: V3 DSA signature: NOKEY, key ID 883c1c14rnerror: Failed dependencies:rn gtkspell is needed by gaim-0.77-0rh9rn libgtkspell.so.0 is needed by gaim-0.77-0rh9rn[root@puny tmp]# rpm -ivh gaim-0.71-1rh9.i386.rpmrnwarning: gaim-0.71-1rh9.i386.rpm: V3 DSA signature: NOKEY, key ID 883c1c14rnerror: Failed dependencies:rn libgtkspell.so.0 is needed by gaim-0.71-1rh9rn
在安装时出现问题,求救。
安装快结束时,他提示“安装程序配置服务器失败,”。
安装时出现问题
我安装的时候,选择好路径下一步的时候rn总说rn在安装程序交换区C:\.......什么的没有足够的磁盘空间rn请确保至少具有115K可用空间,然后重试rn这是什么原因?我硬盘有很大的空间啊~怎么会空间不足呢?rn有谁能给解答一下??rn
在安装AndroidSDK时出现问题
机器装的是8.5MyEclipse 安装sdk的时候出现这个.rnWARNING:Java not found in your path.rnChecking if it's installed in C:\Program Files\Java instead(64-bit)rnChecking if it's installed in C:\Program Files(x86)\Java instead.rnrn 我的MyEclipse装在了d盘..rnrn请高手来解决一下..
安装SQL2008时出现问题
第一次安装失败了,但是第二次安装时选默认的实例名时就提示已经有了,请问该在哪里删除?
安装xteamlinux时出现问题
安装时出现rnUnknow bridge resource 2:assuming transparentrnget res[10000000:10000fff] for resource 0 of PCI drvice 104c:0c1frn接着出现一些mount root....rn最后install exited abnormally --recieved signal 4rn提示rebootrnrn谁帮帮我啊!!!!!!!!!!!!!!!!! rnrnrnrnrn
安装ubuntu9.04时出现问题
我在家里的笔记本电脑已经装成功了,但在单位的笔记本电脑中安装时前面没问题,但装完后要求重启,重启后没有进入双系统选择菜单,直接进入xp了.请各位大侠帮忙
windriver 安装时出现问题
想用windriver生成并口驱动程序,rn但是安装时出现了如下问题,rnThere is currently connected device using windriver, disconnect or uninstall '''rn卸载重装都不行,不知道如何解决,不想重新装机啊
openldap安装时出现问题
在config时出现了rnconfigure: warning: Could not locate TLS/SSL packagernconfigure: warning: TLS privacy protection not supported!rn我已经安装了openssl,可还是提示未找到rn忽略继续往下时,在make test时出现了rnUsing ldapsearch to retrieve all the entries...rnWaiting 5 seconds for slapd to start...rnWaiting 5 seconds for slapd to start...rnWaiting 5 seconds for slapd to start...rnWaiting 5 seconds for slapd to start...rnWaiting 5 seconds for slapd to start...rnWaiting 5 seconds for slapd to start...rnldap_bind: Can't contact LDAP serverrnrn>>>>> Test failedrn>>>>> ./scripts/test000-rootdse failed (exit 1)rnmake[1]: *** [test-ldbm] $B%(%i!<(B 1rnmake[1]: $B=P$^$9(B $B%G%#%l%/%H%j(B `/usr/local/src/openldap-2.0.17/tests'rnmake: *** [test] $B%(%i!<(B 2rnrn请问是什么原因引起的啊?rn
安装IEWebControls时出现问题
我下载IEWebControls安装后,在运行build.bat时出现以下警告:rn“System.Xml.Xsl.XslTransform.Transform(System.Xml.XPath.XPathNavigator,rnSystem.Xml.Xsl.XsltArgumentList, System.IO.Stream)”已过时:“You shouldrnpass XmlResolver to Transform() method”rnrn请问这是怎么回事? 如何解决?
安装WebLogic时出现问题
我有一个名为server815_win32.exe的安装文件,但双击运行时出现错误提示:rnCould not obtain archive information since it is corrupted.Error code = 9rn请问这是什么问题,要怎么做?
Anaconda2安装时出现问题
问题一:UnicodeDecodeError: 'ascii' codec can't decode byte 0xc2 in position 9: ordinal not in range(128)解决方法:在Anaconda2\lib\ntpath.pyimport sys reload(sys) sys.setdefaultencoding('utf8或gb18030')问题二:windo...
安装weblogic8.2时出现问题
我在安装是在让设置与DOWNLOAD相关的地方出现了问题,建立了一个文件夹,然后点NEXT出现提示 rnthe installation archive information could not be obstained from BEArnsystems.please check your download setting.rn这是什么意思呀,怎么改才可以呀
安装apache2时出现问题
在安装apache时出现,出现如下的错误。我已经装上了gcc。如何解决?rnrnchecking for C compiler default output file name... configure : error : C compiler cannot create executables rnrnSee 'config.log' for more details. rn
mongoDB在centos7上的安装
centos7下安装mongoDB,并设置开机启动
在CentOS7上安装mysql
学习中!! 记下自己的笔记~~
rabbitMQ在centOS7上的安装
一、安装erlang安装依赖环境yum -y install make gcc gcc-c++ kernel-devel m4 ncurses-devel openssl-devel unixODBC-develwget http://erlang.org/download/otp_src_19.0.tar.gz解压: tar -xvzf otp_src_19.0.tar.gz配置./config
在Centos7 上安装Mysql数据库
详细描述了自己在linux系统上安装MySQL数据库的过程
CentOS7下安装ElasticSearch6.2.4(上)
n <span style="font-size:14px;">课程介绍:</span>nn<p style="font-size:14px;background-color:#FFFFFF;">n <br /></p>n<p style="font-size:14px;background-color:#FFFFFF;">n         本系列教程由浅入深讲解了在CentOS7系统下如何搭建ElasticSearch,如何使用Kibana实现各种方式的搜索,并详细分析了搜索的原理,最后讲解了在JAVA应用中如何集成ElasticSearch并实现搜索。n</p>
在centos7上安装nginx
安装nginx前需要准备的依赖软件: gcc gc++编译器:由于nginx不能自动编译代码,所以需要下载安装 编译器; 安装命令: yum -y install gcc gc++; pcre库:正则表达式库;nginx的http模块需要解析正表达式, pcre-devel:做二次开发需要的开发库; 安装命令:yum -y install pcre pcre-devel; zl
docker 在centOS7上的安装
文章目录docker 在centOS7上的安装1.安装前提2.安装 Docker使用存储仓库安装设置存储库安装DOCKER CE使用脚本安装使用下载的安装包安装3. 镜像加速4.结尾 docker 在centOS7上的安装 1.安装前提 ​ docker的安装以及使用需要连接网络,本文档默认已经在centos7上配置了网络连接。 Docker 运行在 CentOS 7 上,要求系统为64位、系统内...
在centos7上安装无线网卡
centos7无线网卡驱动安装,过程波折,结局还算可以把
vmware上安装Centos7
在vmware上安装centos以及注意事项,安装gcc编译环境等
hive在centos7上安装
hive分三种部署模式: 1.单用户模式 此模式连接到一个In-Memory 的数据库Derby,一般用于Unit Test。 2.多用户模式 通过网络连接到一个数据库(数据库通常是mysql数据库)中,是最经常使用到的模式。 3.  远程服务器模式 用于非Java客户端访问元数据库,在服务器端启动MetaStoreServer,客户端利用Thrift协议通过MetaStoreServe
相关热词 c#部署端口监听项目、 c#接口中的属性使用方法 c# 昨天 c#func链接匿名方法 c#怎么创建文件夹 c#从键盘接收空格 c#da/ad c#部门请假管理系统 c#服务器socket c# 默认的访问修饰符