在终端执行webpack调用webpack.config.js 时,报错

在终端执行webpack调用webpack.config.js 时,报错,求大佬解决

这是我 webpack.config.js 的代码

const path = require('path')

module.exports = {
    entry: './src/main.js',
    output: {
        path: path.join(__dirname, './dist'),
        filename: 'bundle.js'
    },
    mode: 'development'
}

这是我 package.json 的内容

{
  "name": "webpack-b",
  "version": "1.0.0",
  "description": "",
  "main": "index.js",
  "scripts": {
    "test": "echo \"Error: no test specified\" && exit 1"
  },
  "keywords": [],
  "author": "",
  "license": "ISC",
  "devDependencies": {
    "jquery": "^3.3.1",
    "webpack": "^4.20.2",
    "webpack-cli": "^3.1.2"
  }
}

这是目录结构

图片说明

这是我报错的信息

图片说明

但是如果我在package.json的 script 中加上

"scripts": {
    "test": "echo \"Error: no test specified\" && exit 1",
    "dev": "webpack --mode development ./src/main.js --output ./dist/bundle.js"
  },

然后在终端执行 npm run dev,却是成功的,求解

图片说明

2个回答

package.json 里面的main改为: "main": "main.js",

wang_kai_7
wang_kai_7 回复Insist_bin: 要不试一下把你的main.js改为index.js,entry中也改为index.js,默认的入口文件名是index.js,http://javascript.ruanyifeng.com/nodejs/packagejson.html#toc5
一年多之前 回复
Insist_bin
Insist_bin 老兄,package.json 里面的main改为: "main": "main.js",还是不行哦
一年多之前 回复

package.json 里面的main改为: "main": "main.js",还是不行哦

Csdn user default icon
上传中...
上传图片
插入图片
抄袭、复制答案,以达到刷声望分或其他目的的行为,在CSDN问答是严格禁止的,一经发现立刻封号。是时候展现真正的技术了!
其他相关推荐
webpack 生成XXX.bundle.js 报错
各位码神你们好,我学习webpack打包时遇到一个问题, 搞了很久都没解决。在此希望你们能动动手指帮我解决一下。 报错内容如下: ERROR in multi ./hello.js hello.bundle.js Module not found: Error: Can't resolve 'hello.bundle.js' in 'D:\GitHub\webpack-test' @ multi ./hello.js hello.bundle.js 报错截图: ![图片说明](https://img-ask.csdn.net/upload/201805/18/1526579903_371261.jpg)
【求助】webpack打包显示webpack: Compiled successfully.但是并没有在dist文件夹里找到bundle.js文件
问题叙述:使用webpack打包,打包成功但是在根目录的dist文件夹里找到bundle.js文件。 1.打包成功的说明: ![图片说明](https://img-ask.csdn.net/upload/201907/12/1562894918_455075.png) 2.dist文件夹并没有bundle.js文件生成 ![图片说明](https://img-ask.csdn.net/upload/201907/12/1562895128_495805.png) 3.附webpack.config.js文件代码: ``` var path = require('path'); var config = { entry: { main: './main.js' }, output: { path: path.join(__dirname, './dist'), publicPath: '/dist', filename: 'bundle.js' }, }; module.exports = config; ``` 4.附package.json文件代码 ``` { "name": "Eric", "version": "1.0.0", "description": "", "main": "index.js", "dependencies": {}, "devDependencies": { "webpack": "^2.3.2", "webpack-dev-server": "^2.4.2" }, "scripts": { "test": "echo \"Error: no test specified\" && exit 1", "dev": "webpack-dev-server --open --config webpack.config.js" }, "keywords": [], "author": "", "license": "ISC" } ``` 5.cmd中运行webpack --progress --hide-modules报错: ![图片说明](https://img-ask.csdn.net/upload/201907/12/1562895512_156950.png) 6.本人刚接触前端不久,遇到了这些问题也不知道如何解决,求解答。(PS:配置文件都调了几天了)
npm run dev啟動項目時報錯 `webpack-dev-server --inline --progress --config build/webpack.dev.conf.js`
uotation@1.0.0 dev: `webpack-dev-server --inline --progress --config build/webpack.dev.conf.js` npm ERR! Exit status 1 npm ERR! npm ERR! Failed at the quotation@1.0.0 dev script. npm ERR! This is probably not a problem with npm. There is likely additional logging output above. ``` //webpack.dev.conf.js 'use strict' const utils = require('./utils') const webpack = require('webpack') const config = require('../config') const merge = require('webpack-merge') const path = require('path') const baseWebpackConfig = require('./webpack.base.conf') const CopyWebpackPlugin = require('copy-webpack-plugin') const HtmlWebpackPlugin = require('html-webpack-plugin') const FriendlyErrorsPlugin = require('friendly-errors-webpack-plugin') const portfinder = require('portfinder') const HOST = process.env.HOST const PORT = process.env.PORT && Number(process.env.PORT) const devWebpackConfig = merge(baseWebpackConfig, { module: { rules: utils.styleLoaders({ sourceMap: config.dev.cssSourceMap, usePostCSS: true }) }, // cheap-module-eval-source-map is faster for development devtool: config.dev.devtool, // these devServer options should be customized in /config/index.js devServer: { clientLogLevel: 'warning', historyApiFallback: { rewrites: [ { from: /.*/, to: path.posix.join(config.dev.assetsPublicPath, 'index.html') }, ], }, hot: true, contentBase: false, // since we use CopyWebpackPlugin. compress: true, host: HOST || config.dev.host, port: PORT || config.dev.port, open: config.dev.autoOpenBrowser, overlay: config.dev.errorOverlay ? { warnings: false, errors: true } : false, publicPath: config.dev.assetsPublicPath, proxy: config.dev.proxyTable, quiet: true, // necessary for FriendlyErrorsPlugin watchOptions: { poll: config.dev.poll, } }, plugins: [ new webpack.DefinePlugin({ 'process.env': require('../config/dev.env') }), new webpack.HotModuleReplacementPlugin(), new webpack.NamedModulesPlugin(), // HMR shows correct file names in console on update. new webpack.NoEmitOnErrorsPlugin(), // https://github.com/ampedandwired/html-webpack-plugin new HtmlWebpackPlugin({ filename: 'index.html', template: 'index.html', inject: true }), // copy custom static assets new CopyWebpackPlugin([ { from: path.resolve(__dirname, '../static'), to: config.dev.assetsSubDirectory, ignore: ['.*'] } ]) ] }) module.exports = new Promise((resolve, reject) => { portfinder.basePort = process.env.PORT || config.dev.port portfinder.getPort((err, port) => { if (err) { reject(err) } else { // publish the new Port, necessary for e2e tests process.env.PORT = port // add port to devServer config devWebpackConfig.devServer.port = port // Add FriendlyErrorsPlugin devWebpackConfig.plugins.push(new FriendlyErrorsPlugin({ compilationSuccessInfo: { messages: [`Your application is running here: http://${devWebpackConfig.devServer.host}:${port}`], }, onErrors: config.dev.notifyOnErrors ? utils.createNotifierCallback() : undefined })) resolve(devWebpackConfig) } }) }) ``` ``` //webpack.base.conf.js 'use strict' const path = require('path') const utils = require('./utils') const config = require('../config') const vueLoaderConfig = require('./vue-loader.conf') function resolve (dir) { return path.join(__dirname, '..', dir) } module.exports = { context: path.resolve(__dirname, '../'), entry: { app: './src/main.js' }, output: { path: config.build.assetsRoot, filename: '[name].js', publicPath: process.env.NODE_ENV === 'production' ? config.build.assetsPublicPath : config.dev.assetsPublicPath }, resolve: { extensions: ['.js', '.vue', '.json'], alias: { 'vue$': 'vue/dist/vue.esm.js', '@': resolve('src'), } }, module: { rules: [ { test: /\.vue$/, loader: 'vue-loader', options: vueLoaderConfig }, { test: /\.js$/, loader: 'babel-loader', include: [resolve('src'), resolve('test'), resolve('node_modules/webpack-dev-server/client')] }, { test: /\.(png|jpe?g|gif|svg)(\?.*)?$/, loader: 'url-loader', options: { limit: 10000, name: utils.assetsPath('img/[name].[hash:7].[ext]') } }, { test: /\.(mp4|webm|ogg|mp3|wav|flac|aac)(\?.*)?$/, loader: 'url-loader', options: { limit: 10000, name: utils.assetsPath('media/[name].[hash:7].[ext]') } }, { test: /\.(woff2?|eot|ttf|otf)(\?.*)?$/, loader: 'url-loader', options: { limit: 10000, name: utils.assetsPath('fonts/[name].[hash:7].[ext]') } } ] }, node: { // prevent webpack from injecting useless setImmediate polyfill because Vue // source contains it (although only uses it if it's native). setImmediate: false, // prevent webpack from injecting mocks to Node native modules // that does not make sense for the client dgram: 'empty', fs: 'empty', net: 'empty', tls: 'empty', child_process: 'empty' } } ```
webpack4在webpack.base.conf.js配置如下,main.js内容是第二张图片,index.html导入main.js然后报错:
![图片说明](https://img-ask.csdn.net/upload/201903/01/1551399058_348528.png) ![图片说明](https://img-ask.csdn.net/upload/201903/01/1551399083_709906.png ) SyntaxError: import declarations may only appear at top level of a module
react+webpack中使用wowjs和animate.css后报错window is not defined
1.首先使用npm安装wowjs npm install wowjs --save-dev 2.在js中引用 import 'animate.css' import {WOW} from 'wowjs'; new WOW({live: false}).init(); 但是报错window is not defined 需要在webpack.config.js中配置吗?如何配置呢? 我在webpack.config.js这样配置了。不可以 ![图片说明](https://img-ask.csdn.net/upload/201809/29/1538214241_538880.jpg)
配置webpack.config.js时出现错误,提示如下所示
![图片说明](https://img-ask.csdn.net/upload/201702/14/1487087214_550237.png) 是怎么回事?我的代码如下所示: var path=require('path'); var webpack=require('webpack'); var HtmlWebpackPlugin=require('html-webpack-plugin'); //一些常用路径 var ROOT_PATH=path.resolve(__dirname); var APP_PATH=path.resolve(ROOT_PATH,'app'); var BUILD_PATH=path.resolve(ROOT_PATH,'build'); console.log("ROOT_PATH====="+ROOT_PATH); console.log("APP_PATH====="+APP_PATH); console.log("BUILD_PATH====="+BUILD_PATH); module.exports={ entry:{ app:path.resolve(APP_PATH,'index.jsx') }, output:{ path:BUILD_PATH, filename:'bundle.js' }, //开启 dev source map devtool:'eval-source-map', //开启 webpack dev server devServer:{ historyApiFallback:true, hot:true, inline:true, progress:true }, module: { //配置preLoaders,将eslint添加进入 // preLoaders: [ // { // test:/\.jsx?$/, // loaders:['eslint'], // include:APP_PATH // } // ], //配置loaders,将babel添加进去 loaders:[ { test:/\.jsx?$/, loaders:['babel'], include:APP_PATH } ] }, //配置plugin plugins:[ new HtmlWebpackPlugin({ title:'My first react app' }) ], resolve:{ extensions:['','.js','.jsx'] } } 如果去掉 , resolve:{ extensions:['','.js','.jsx'] } 这段代码之后,结果变为下面: ![图片说明](https://img-ask.csdn.net/upload/201702/15/1487141016_112667.png)
webpack4.0中引入app.vue出现报错
**webpack4.0中引入app.vue出现报错** 我正在学vue.js实战,但是这本书事两年前写的,书中的vue配置有些已经不能用了, 我在配置完webpack.config.js后创建了个app.vue,然后就报错了,百度过,没找到合适的答案,请问各位大佬有遇到过吗。求解答,谢谢,下面是报错截图,以及webpack.config.js的截图,谢谢 ![图片说明](https://img-ask.csdn.net/upload/201909/16/1568602107_212983.png) ![图片说明](https://img-ask.csdn.net/upload/201909/16/1568602131_486744.png) **webpack.config.js:** var path = require('path'); var ExtractTextPlugin = require('extract-text-webpack-plugin'); var config = { entry : { main : './main' }, output : { path : path.join(__dirname, './dist'), publicPath : '/dist/', filename : 'main.js' }, module: { rules: [ { test: /\.vue$/, loader : 'vue-loader', options : { loaders : { css : ExtractTextPlugin.extract({ use : 'css-loader', fallback : 'vue-style-loader' }) } } }, { test : /\.js$/, loader : 'babel-loader', exclude : /node_modules/ }, { test : /\.css$/, use : ExtractTextPlugin.extract({ use : 'css-loader', fallback : 'style-loader' }) } ] }, plugins : [ //重命名提取后的css文件 new ExtractTextPlugin("main.css") ] }; module.exports = config; **package.json:** { "name": "vuedemo04", "version": "1.0.0", "description": "", "main": "index.js", "scripts": { "test": "echo \"Error: no test specified\" && exit 1", "dev": "webpack-dev-server --host 192.168.0.114 --port 8888 --open --config webpack.config.js" }, "author": "", "license": "ISC", "devDependencies": { "@babel/core": "^7.6.0", "@babel/plugin-proposal-class-properties": "^7.5.5", "@babel/plugin-transform-runtime": "^7.6.0", "@babel/preset-env": "^7.6.0", "@babel/runtime": "^7.6.0", "babel": "^6.23.0", "babel-core": "^6.26.3", "babel-loader": "^8.0.6", "babel-plugin-transform-runtime": "^6.23.0", "babel-preset-env": "^1.7.0", "babel-preset-es2015": "^6.24.1", "babel-runtime": "^6.26.0", "css-loader": "^3.2.0", "extract-text-webpack-plugin": "^4.0.0-beta.0", "style-loader": "^1.0.0", "vue-hot-reload-api": "^2.3.3", "vue-loader": "^15.7.1", "vue-style-loader": "^4.1.2", "vue-template-compiler": "^2.6.10", "webpack": "^4.39.3", "webpack-cli": "^3.3.8", "webpack-dev-server": "^3.8.0" }, "dependencies": { "vue": "^2.6.10" } } **main.js:** import Vue from 'vue'; import App from './app.vue'; new Vue({ el:'#app', render : h => h(App) }); **app.vue:** ![图片说明](https://img-ask.csdn.net/upload/201909/16/1568602350_668161.png) **style.css:** ![图片说明](https://img-ask.csdn.net/upload/201909/16/1568602435_444026.png) **index.html:** ![图片说明](https://img-ask.csdn.net/upload/201909/16/1568602485_888515.png) **vue项目结构:**
webpack4没有找到配置出入口的webpack.config.js文件,npm能设置出入口文件吗
![图片说明](https://img-ask.csdn.net/upload/201902/28/1551359937_107616.png) webpack和webpack-cli都安装了
webpack build报错 ERROR in 1.ea409344b3c6c7fd1ccf.chunk.js from UglifyJs
项目可以正常运行,突然打包报错,有没有大神指点一下 ``` ERROR in 1.ea409344b3c6c7fd1ccf.chunk.js from UglifyJs Unexpected token: operator (>) [1.ea409344b3c6c7fd1ccf.chunk.js:4739,34] Child html-webpack-plugin for "..\index.html": 1 asset Child extract-text-webpack-plugin node_modules/_extract-text-webpack-plugin@3.0.2@extract-text-webpack-plugin/dist node_modules/_css-loader@0.28.11@css-loader/index.js?minimize!node_modules/_autoprefixer-loader@3.2.0@autoprefixer-loader/index.js!node_modules/_iview@3.3.3@iview/dist/styles/iview.css: 3 assets Child extract-text-webpack-plugin node_modules/_extract-text-webpack-plugin@3.0.2@extract-text-webpack-plugin/dist node_modules/_css-loader@0.28.11@css-loader/index.js?minimize!node_modules/_autoprefixer-loader@3.2.0@autoprefixer-loader/index.js!node_modules/_less-loader@4.1.0@less-loader/dist/cjs.js!src/styles/my-theme.less: Asset Size Chunks Chunk Names d535a25a79fb1365ae814b61e88fae71.ttf 198 kB [emitted] 99ac3308dd8ee14f749f51538d0d5b9e.woff 198 kB [emitted] a2c4a261a239aa84463dc70e4bac9b9a.svg 555 kB [emitted] [big] npm ERR! code ELIFECYCLE npm ERR! errno 2 npm ERR! smart-lock@1.2.3 build: `webpack --progress --hide-modules --config build/webpack.prod.config.js` npm ERR! Exit status 2 npm ERR! npm ERR! Failed at the smart-lock@1.2.3 build script. npm ERR! This is probably not a problem with npm. There is likely additional logging output above. ```
自己用webpack构建vue项目报错,求帮助万分感谢
神烦怎么也解决不了问题,用localhost能访问到的是目录 用node:{ fs: 'empty', net: 'empty', tls: 'empty', child_process: 'empty' }能减少几个报错信息 以下是我的配置 ``` const path = require('path'); const HTMLPlugin = require('html-webpack-plugin'); const VueLoaderPlugin = require('vue-loader/lib/plugin'); const webpack = require('webpack'); const isDev = process.env.NODE_ENV === 'development'; //package.json设置的对象全部存在process.env里面 const config = { target: 'web', entry: path.join(__dirname, 'src/index.js'),//设置入口,__dirname代表本文件所在的地址,也就是根目录 output: { filename: 'bundle.js', //打包的名字 path: path.join(__dirname, 'dist') //打包路径 }, plugins: [ // make sure to include the plugin for the magic new VueLoaderPlugin(), new webpack.DefinePlugin({ 'process.env': { NODE_ENV: isDev ? '"development"' : '"production"' //调用process.env.NODE_ENV 可以获取 环境 } }), new HTMLPlugin() ], module: { rules: [ { test: /\.vue$/, loader: 'vue-loader' }, { test: /\.css$/, use: [ 'style-loader', 'css-loader' ] }, { test: /\.styl$/, use: [ 'style-loader', 'css-loader', 'stylus-loader' ] }, { test: /\.(jpg|gif|jpeg|png|svg)$/, use: [{ loader: 'url-loader', options: { limit: 1024,//可以帮小于1024的图片转换base-64代码直接写在js里面,减少http请求 name: '[name].[ext]' //重命名 name图片原来的名字 ext文件扩展名 } }] } ] } }; if (isDev) { config.devServer = { port: '8200', host: '0.0.0.0', overlay: { errors: true, } } } module.exports = config; ``` 下面是报错信息 ERROR in ./node_modules/_fsevents@1.2.4@fsevents/node_modules/node-pre-gyp/lib/testbinary.js Module not found: Error: Can't resolve 'child_process' in 'D:\java\JetBrains\module\vue-app\vue-todo\node_modules\_fsevents@1.2.4@fsevents\node_modules\node-pre-gyp\lib' @ ./node_modules/_fsevents@1.2.4@fsevents/node_modules/node-pre-gyp/lib/testbinary.js 10:9-33 @ ./node_modules/_fsevents@1.2.4@fsevents/node_modules/node-pre-gyp/lib sync ^\.\/.*$ @ ./node_modules/_fsevents@1.2.4@fsevents/node_modules/node-pre-gyp/lib/node-pre-gyp.js @ ./node_modules/_fsevents@1.2.4@fsevents/fsevents.js @ ./node_modules/_chokidar@2.0.4@chokidar/lib/fsevents-handler.js @ ./node_modules/_chokidar@2.0.4@chokidar/index.js @ ./node_modules/_watchpack@1.6.0@watchpack/lib/DirectoryWatcher.js @ ./node_modules/_watchpack@1.6.0@watchpack/lib/watcherManager.js @ ./node_modules/_watchpack@1.6.0@watchpack/lib/watchpack.js @ (webpack)/lib/node/NodeWatchFileSystem.js @ (webpack)/lib/node/NodeEnvironmentPlugin.js @ (webpack)/lib/webpack.js @ multi ./node_modules/_webpack-dev-server@3.1.9@webpack-dev-server/client?http://0.0.0.0:8200 webpack ERROR in ./node_modules/_fsevents@1.2.4@fsevents/node_modules/node-pre-gyp/lib/util/compile.js Module not found: Error: Can't resolve 'child_process' in 'D:\java\JetBrains\module\vue-app\vue-todo\node_modules\_fsevents@1.2.4@fsevents\node_modules\node-pre-gyp\lib\util' @ ./node_modules/_fsevents@1.2.4@fsevents/node_modules/node-pre-gyp/lib/util/compile.js 9:9-33 @ ./node_modules/_fsevents@1.2.4@fsevents/node_modules/node-pre-gyp/lib sync ^\.\/.*$ @ ./node_modules/_fsevents@1.2.4@fsevents/node_modules/node-pre-gyp/lib/node-pre-gyp.js @ ./node_modules/_fsevents@1.2.4@fsevents/fsevents.js @ ./node_modules/_chokidar@2.0.4@chokidar/lib/fsevents-handler.js @ ./node_modules/_chokidar@2.0.4@chokidar/index.js @ ./node_modules/_watchpack@1.6.0@watchpack/lib/DirectoryWatcher.js @ ./node_modules/_watchpack@1.6.0@watchpack/lib/watcherManager.js @ ./node_modules/_watchpack@1.6.0@watchpack/lib/watchpack.js @ (webpack)/lib/node/NodeWatchFileSystem.js @ (webpack)/lib/node/NodeEnvironmentPlugin.js @ (webpack)/lib/webpack.js @ multi ./node_modules/_webpack-dev-server@3.1.9@webpack-dev-server/client?http://0.0.0.0:8200 webpack ERROR in ./node_modules/_fsevents@1.2.4@fsevents/node_modules/osenv/osenv.js Module not found: Error: Can't resolve 'child_process' in 'D:\java\JetBrains\module\vue-app\vue-todo\node_modules\_fsevents@1.2.4@fsevents\node_modules\osenv' @ ./node_modules/_fsevents@1.2.4@fsevents/node_modules/osenv/osenv.js 3:11-35 @ ./node_modules/_fsevents@1.2.4@fsevents/node_modules/nopt/lib/nopt.js @ ./node_modules/_fsevents@1.2.4@fsevents/node_modules/node-pre-gyp/lib/node-pre-gyp.js @ ./node_modules/_fsevents@1.2.4@fsevents/fsevents.js @ ./node_modules/_chokidar@2.0.4@chokidar/lib/fsevents-handler.js @ ./node_modules/_chokidar@2.0.4@chokidar/index.js @ ./node_modules/_watchpack@1.6.0@watchpack/lib/DirectoryWatcher.js @ ./node_modules/_watchpack@1.6.0@watchpack/lib/watcherManager.js @ ./node_modules/_watchpack@1.6.0@watchpack/lib/watchpack.js @ (webpack)/lib/node/NodeWatchFileSystem.js @ (webpack)/lib/node/NodeEnvironmentPlugin.js @ (webpack)/lib/webpack.js @ multi ./node_modules/_webpack-dev-server@3.1.9@webpack-dev-server/client?http://0.0.0.0:8200 webpack ERROR in ./node_modules/_worker-farm@1.6.0@worker-farm/lib/fork.js Module not found: Error: Can't resolve 'child_process' in 'D:\java\JetBrains\module\vue-app\vue-todo\node_modules\_worker-farm@1.6.0@worker-farm\lib' @ ./node_modules/_worker-farm@1.6.0@worker-farm/lib/fork.js 3:21-45 @ ./node_modules/_worker-farm@1.6.0@worker-farm/lib/farm.js @ ./node_modules/_worker-farm@1.6.0@worker-farm/lib/index.js @ ./node_modules/_uglifyjs-webpack-plugin@1.3.0@uglifyjs-webpack-plugin/dist/uglify/Runner.js @ ./node_modules/_uglifyjs-webpack-plugin@1.3.0@uglifyjs-webpack-plugin/dist/index.js @ ./node_modules/_uglifyjs-webpack-plugin@1.3.0@uglifyjs-webpack-plugin/dist/cjs.js @ (webpack)/lib/WebpackOptionsDefaulter.js @ (webpack)/lib/webpack.js @ multi ./node_modules/_webpack-dev-server@3.1.9@webpack-dev-server/client?http://0.0.0.0:8200 webpack ERROR in ./node_modules/_cacache@10.0.4@cacache/get.js Module not found: Error: Can't resolve 'fs' in 'D:\java\JetBrains\module\vue-app\vue-todo\node_modules\_cacache@10.0.4@cacache' @ ./node_modules/_cacache@10.0.4@cacache/get.js 5:11-24 @ ./node_modules/_cacache@10.0.4@cacache/locales/en.js @ ./node_modules/_cacache@10.0.4@cacache/index.js @ ./node_modules/_uglifyjs-webpack-plugin@1.3.0@uglifyjs-webpack-plugin/dist/uglify/Runner.js @ ./node_modules/_uglifyjs-webpack-plugin@1.3.0@uglifyjs-webpack-plugin/dist/index.js @ ./node_modules/_uglifyjs-webpack-plugin@1.3.0@uglifyjs-webpack-plugin/dist/cjs.js @ (webpack)/lib/WebpackOptionsDefaulter.js @ (webpack)/lib/webpack.js @ multi ./node_modules/_webpack-dev-server@3.1.9@webpack-dev-server/client?http://0.0.0.0:8200 webpack ERROR in ./node_modules/_chokidar@2.0.4@chokidar/index.js Module not found: Error: Can't resolve 'fs' in 'D:\java\JetBrains\module\vue-app\vue-todo\node_modules\_chokidar@2.0.4@chokidar' @ ./node_modules/_chokidar@2.0.4@chokidar/index.js 3:9-22 @ ./node_modules/_watchpack@1.6.0@watchpack/lib/DirectoryWatcher.js @ ./node_modules/_watchpack@1.6.0@watchpack/lib/watcherManager.js @ ./node_modules/_watchpack@1.6.0@watchpack/lib/watchpack.js @ (webpack)/lib/node/NodeWatchFileSystem.js @ (webpack)/lib/node/NodeEnvironmentPlugin.js @ (webpack)/lib/webpack.js @ multi ./node_modules/_webpack-dev-server@3.1.9@webpack-dev-server/client?http://0.0.0.0:8200 webpack ERROR in ./node_modules/_chokidar@2.0.4@chokidar/lib/fsevents-handler.js Module not found: Error: Can't resolve 'fs' in 'D:\java\JetBrains\module\vue-app\vue-todo\node_modules\_chokidar@2.0.4@chokidar\lib' @ ./node_modules/_chokidar@2.0.4@chokidar/lib/fsevents-handler.js 3:9-22 @ ./node_modules/_chokidar@2.0.4@chokidar/index.js @ ./node_modules/_watchpack@1.6.0@watchpack/lib/DirectoryWatcher.js @ ./node_modules/_watchpack@1.6.0@watchpack/lib/watcherManager.js @ ./node_modules/_watchpack@1.6.0@watchpack/lib/watchpack.js @ (webpack)/lib/node/NodeWatchFileSystem.js @ (webpack)/lib/node/NodeEnvironmentPlugin.js @ (webpack)/lib/webpack.js @ multi ./node_modules/_webpack-dev-server@3.1.9@webpack-dev-server/client?http://0.0.0.0:8200 webpack ERROR in ./node_modules/_chokidar@2.0.4@chokidar/lib/nodefs-handler.js Module not found: Error: Can't resolve 'fs' in 'D:\java\JetBrains\module\vue-app\vue-todo\node_modules\_chokidar@2.0.4@chokidar\lib' @ ./node_modules/_chokidar@2.0.4@chokidar/lib/nodefs-handler.js 3:9-22 @ ./node_modules/_chokidar@2.0.4@chokidar/index.js @ ./node_modules/_watchpack@1.6.0@watchpack/lib/DirectoryWatcher.js @ ./node_modules/_watchpack@1.6.0@watchpack/lib/watcherManager.js @ ./node_modules/_watchpack@1.6.0@watchpack/lib/watchpack.js @ (webpack)/lib/node/NodeWatchFileSystem.js @ (webpack)/lib/node/NodeEnvironmentPlugin.js @ (webpack)/lib/webpack.js @ multi ./node_modules/_webpack-dev-server@3.1.9@webpack-dev-server/client?http://0.0.0.0:8200 webpack ERROR in ./node_modules/_chownr@1.1.1@chownr/chownr.js Module not found: Error: Can't resolve 'fs' in 'D:\java\JetBrains\module\vue-app\vue-todo\node_modules\_chownr@1.1.1@chownr' @ ./node_modules/_chownr@1.1.1@chownr/chownr.js 2:11-24 @ ./node_modules/_cacache@10.0.4@cacache/lib/util/fix-owner.js @ ./node_modules/_cacache@10.0.4@cacache/lib/util/tmp.js @ ./node_modules/_cacache@10.0.4@cacache/locales/en.js @ ./node_modules/_cacache@10.0.4@cacache/index.js @ ./node_modules/_uglifyjs-webpack-plugin@1.3.0@uglifyjs-webpack-plugin/dist/uglify/Runner.js @ ./node_modules/_uglifyjs-webpack-plugin@1.3.0@uglifyjs-webpack-plugin/dist/index.js @ ./node_modules/_uglifyjs-webpack-plugin@1.3.0@uglifyjs-webpack-plugin/dist/cjs.js @ (webpack)/lib/WebpackOptionsDefaulter.js @ (webpack)/lib/webpack.js @ multi ./node_modules/_webpack-dev-server@3.1.9@webpack-dev-server/client?http://0.0.0.0:8200 webpack ERROR in ./node_modules/_copy-concurrently@1.0.5@copy-concurrently/copy.js Module not found: Error: Can't resolve 'fs' in 'D:\java\JetBrains\module\vue-app\vue-todo\node_modules\_copy-concurrently@1.0.5@copy-concurrently' @ ./node_modules/_copy-concurrently@1.0.5@copy-concurrently/copy.js 8:13-26 @ ./node_modules/_move-concurrently@1.0.1@move-concurrently/move.js @ ./node_modules/_cacache@10.0.4@cacache/lib/util/move-file.js @ ./node_modules/_cacache@10.0.4@cacache/lib/content/write.js @ ./node_modules/_cacache@10.0.4@cacache/put.js @ ./node_modules/_cacache@10.0.4@cacache/locales/en.js @ ./node_modules/_cacache@10.0.4@cacache/index.js @ ./node_modules/_uglifyjs-webpack-plugin@1.3.0@uglifyjs-webpack-plugin/dist/uglify/Runner.js @ ./node_modules/_uglifyjs-webpack-plugin@1.3.0@uglifyjs-webpack-plugin/dist/index.js @ ./node_modules/_uglifyjs-webpack-plugin@1.3.0@uglifyjs-webpack-plugin/dist/cjs.js @ (webpack)/lib/WebpackOptionsDefaulter.js @ (webpack)/lib/webpack.js @ multi ./node_modules/_webpack-dev-server@3.1.9@webpack-dev-server/client?http://0.0.0.0:8200 webpack ERROR in ./node_modules/_fs.realpath@1.0.0@fs.realpath/old.js Module not found: Error: Can't resolve 'fs' in 'D:\java\JetBrains\module\vue-app\vue-todo\node_modules\_fs.realpath@1.0.0@fs.realpath' @ ./node_modules/_fs.realpath@1.0.0@fs.realpath/old.js 24:9-22 @ ./node_modules/_fs.realpath@1.0.0@fs.realpath/index.js @ ./node_modules/_glob@7.1.3@glob/glob.js @ ./node_modules/_cacache@10.0.4@cacache/lib/verify.js @ ./node_modules/_cacache@10.0.4@cacache/verify.js @ ./node_modules/_cacache@10.0.4@cacache/locales/en.js @ ./node_modules/_cacache@10.0.4@cacache/index.js @ ./node_modules/_uglifyjs-webpack-plugin@1.3.0@uglifyjs-webpack-plugin/dist/uglify/Runner.js @ ./node_modules/_uglifyjs-webpack-plugin@1.3.0@uglifyjs-webpack-plugin/dist/index.js @ ./node_modules/_uglifyjs-webpack-plugin@1.3.0@uglifyjs-webpack-plugin/dist/cjs.js @ (webpack)/lib/WebpackOptionsDefaulter.js @ (webpack)/lib/webpack.js @ multi ./node_modules/_webpack-dev-server@3.1.9@webpack-dev-server/client?http://0.0.0.0:8200 webpack ERROR in ./node_modules/_fs.realpath@1.0.0@fs.realpath/index.js Module not found: Error: Can't resolve 'fs' in 'D:\java\JetBrains\module\vue-app\vue-todo\node_modules\_fs.realpath@1.0.0@fs.realpath' @ ./node_modules/_fs.realpath@1.0.0@fs.realpath/index.js 8:9-22 @ ./node_modules/_glob@7.1.3@glob/glob.js @ ./node_modules/_cacache@10.0.4@cacache/lib/verify.js @ ./node_modules/_cacache@10.0.4@cacache/verify.js @ ./node_modules/_cacache@10.0.4@cacache/locales/en.js @ ./node_modules/_cacache@10.0.4@cacache/index.js @ ./node_modules/_uglifyjs-webpack-plugin@1.3.0@uglifyjs-webpack-plugin/dist/uglify/Runner.js @ ./node_modules/_uglifyjs-webpack-plugin@1.3.0@uglifyjs-webpack-plugin/dist/index.js @ ./node_modules/_uglifyjs-webpack-plugin@1.3.0@uglifyjs-webpack-plugin/dist/cjs.js @ (webpack)/lib/WebpackOptionsDefaulter.js @ (webpack)/lib/webpack.js @ multi ./node_modules/_webpack-dev-server@3.1.9@webpack-dev-server/client?http://0.0.0.0:8200 webpack ERROR in ./node_modules/_fsevents@1.2.4@fsevents/fsevents.js Module not found: Error: Can't resolve 'fs' in 'D:\java\JetBrains\module\vue-app\vue-todo\node_modules\_fsevents@1.2.4@fsevents' @ ./node_modules/_fsevents@1.2.4@fsevents/fsevents.js 17:9-22 @ ./node_modules/_chokidar@2.0.4@chokidar/lib/fsevents-handler.js @ ./node_modules/_chokidar@2.0.4@chokidar/index.js @ ./node_modules/_watchpack@1.6.0@watchpack/lib/DirectoryWatcher.js @ ./node_modules/_watchpack@1.6.0@watchpack/lib/watcherManager.js @ ./node_modules/_watchpack@1.6.0@watchpack/lib/watchpack.js @ (webpack)/lib/node/NodeWatchFileSystem.js @ (webpack)/lib/node/NodeEnvironmentPlugin.js @ (webpack)/lib/webpack.js @ multi ./node_modules/_webpack-dev-server@3.1.9@webpack-dev-server/client?http://0.0.0.0:8200 webpack ERROR in ./node_modules/_fsevents@1.2.4@fsevents/node_modules/chownr/chownr.js Module not found: Error: Can't resolve 'fs' in 'D:\java\JetBrains\module\vue-app\vue-todo\node_modules\_fsevents@1.2.4@fsevents\node_modules\chownr' @ ./node_modules/_fsevents@1.2.4@fsevents/node_modules/chownr/chownr.js 4:9-22 @ ./node_modules/_fsevents@1.2.4@fsevents/node_modules/tar/lib/mkdir.js @ ./node_modules/_fsevents@1.2.4@fsevents/node_modules/tar/lib/unpack.js @ ./node_modules/_fsevents@1.2.4@fsevents/node_modules/tar/index.js @ ./node_modules/_fsevents@1.2.4@fsevents/node_modules/node-pre-gyp/lib/package.js @ ./node_modules/_fsevents@1.2.4@fsevents/node_modules/node-pre-gyp/lib sync ^\.\/.*$ @ ./node_modules/_fsevents@1.2.4@fsevents/node_modules/node-pre-gyp/lib/node-pre-gyp.js @ ./node_modules/_fsevents@1.2.4@fsevents/fsevents.js @ ./node_modules/_chokidar@2.0.4@chokidar/lib/fsevents-handler.js @ ./node_modules/_chokidar@2.0.4@chokidar/index.js @ ./node_modules/_watchpack@1.6.0@watchpack/lib/DirectoryWatcher.js @ ./node_modules/_watchpack@1.6.0@watchpack/lib/watcherManager.js @ ./node_modules/_watchpack@1.6.0@watchpack/lib/watchpack.js @ (webpack)/lib/node/NodeWatchFileSystem.js @ (webpack)/lib/node/NodeEnvironmentPlugin.js @ (webpack)/lib/webpack.js @ multi ./node_modules/_webpack-dev-server@3.1.9@webpack-dev-server/client?http://0.0.0.0:8200 webpack ERROR in ./node_modules/_fsevents@1.2.4@fsevents/node_modules/detect-libc/lib/detect-libc.js Module not found: Error: Can't resolve 'fs' in 'D:\java\JetBrains\module\vue-app\vue-todo\node_modules\_fsevents@1.2.4@fsevents\node_modules\detect-libc\lib' @ ./node_modules/_fsevents@1.2.4@fsevents/node_modules/detect-libc/lib/detect-libc.js 5:18-31 @ ./node_modules/_fsevents@1.2.4@fsevents/node_modules/node-pre-gyp/lib/util/versioning.js @ ./node_modules/_fsevents@1.2.4@fsevents/node_modules/node-pre-gyp/lib sync ^\.\/.*$ @ ./node_modules/_fsevents@1.2.4@fsevents/node_modules/node-pre-gyp/lib/node-pre-gyp.js @ ./node_modules/_fsevents@1.2.4@fsevents/fsevents.js @ ./node_modules/_chokidar@2.0.4@chokidar/lib/fsevents-handler.js @ ./node_modules/_chokidar@2.0.4@chokidar/index.js @ ./node_modules/_watchpack@1.6.0@watchpack/lib/DirectoryWatcher.js @ ./node_modules/_watchpack@1.6.0@watchpack/lib/watcherManager.js @ ./node_modules/_watchpack@1.6.0@watchpack/lib/watchpack.js @ (webpack)/lib/node/NodeWatchFileSystem.js @ (webpack)/lib/node/NodeEnvironmentPlugin.js @ (webpack)/lib/webpack.js @ multi ./node_modules/_webpack-dev-server@3.1.9@webpack-dev-server/client?http://0.0.0.0:8200 webpack ERROR in ./node_modules/_fsevents@1.2.4@fsevents/node_modules/fs-minipass/index.js Module not found: Error: Can't resolve 'fs' in 'D:\java\JetBrains\module\vue-app\vue-todo\node_modules\_fsevents@1.2.4@fsevents\node_modules\fs-minipass' @ ./node_modules/_fsevents@1.2.4@fsevents/node_modules/fs-minipass/index.js 4:11-24 @ ./node_modules/_fsevents@1.2.4@fsevents/node_modules/tar/lib/create.js @ ./node_modules/_fsevents@1.2.4@fsevents/node_modules/tar/index.js @ ./node_modules/_fsevents@1.2.4@fsevents/node_modules/node-pre-gyp/lib/package.js @ ./node_modules/_fsevents@1.2.4@fsevents/node_modules/node-pre-gyp/lib sync ^\.\/.*$ @ ./node_modules/_fsevents@1.2.4@fsevents/node_modules/node-pre-gyp/lib/node-pre-gyp.js @ ./node_modules/_fsevents@1.2.4@fsevents/fsevents.js @ ./node_modules/_chokidar@2.0.4@chokidar/lib/fsevents-handler.js @ ./node_modules/_chokidar@2.0.4@chokidar/index.js @ ./node_modules/_watchpack@1.6.0@watchpack/lib/DirectoryWatcher.js @ ./node_modules/_watchpack@1.6.0@watchpack/lib/watcherManager.js @ ./node_modules/_watchpack@1.6.0@watchpack/lib/watchpack.js @ (webpack)/lib/node/NodeWatchFileSystem.js @ (webpack)/lib/node/NodeEnvironmentPlugin.js @ (webpack)/lib/webpack.js @ multi ./node_modules/_webpack-dev-server@3.1.9@webpack-dev-server/client?http://0.0.0.0:8200 webpack ERROR in ./node_modules/_fsevents@1.2.4@fsevents/node_modules/fs.realpath/old.js Module not found: Error: Can't resolve 'fs' in 'D:\java\JetBrains\module\vue-app\vue-todo\node_modules\_fsevents@1.2.4@fsevents\node_modules\fs.realpath' @ ./node_modules/_fsevents@1.2.4@fsevents/node_modules/fs.realpath/old.js 24:9-22 @ ./node_modules/_fsevents@1.2.4@fsevents/node_modules/fs.realpath/index.js @ ./node_modules/_fsevents@1.2.4@fsevents/node_modules/glob/glob.js @ ./node_modules/_fsevents@1.2.4@fsevents/node_modules/rimraf/rimraf.js @ ./node_modules/_fsevents@1.2.4@fsevents/node_modules/node-pre-gyp/lib/util/napi.js @ ./node_modules/_fsevents@1.2.4@fsevents/node_modules/node-pre-gyp/lib/node-pre-gyp.js @ ./node_modules/_fsevents@1.2.4@fsevents/fsevents.js @ ./node_modules/_chokidar@2.0.4@chokidar/lib/fsevents-handler.js @ ./node_modules/_chokidar@2.0.4@chokidar/index.js @ ./node_modules/_watchpack@1.6.0@watchpack/lib/DirectoryWatcher.js @ ./node_modules/_watchpack@1.6.0@watchpack/lib/watcherManager.js @ ./node_modules/_watchpack@1.6.0@watchpack/lib/watchpack.js @ (webpack)/lib/node/NodeWatchFileSystem.js @ (webpack)/lib/node/NodeEnvironmentPlugin.js @ (webpack)/lib/webpack.js @ multi ./node_modules/_webpack-dev-server@3.1.9@webpack-dev-server/client?http://0.0.0.0:8200 webpack ERROR in ./node_modules/_fsevents@1.2.4@fsevents/node_modules/fs.realpath/index.js Module not found: Error: Can't resolve 'fs' in 'D:\java\JetBrains\module\vue-app\vue-todo\node_modules\_fsevents@1.2.4@fsevents\node_modules\fs.realpath' @ ./node_modules/_fsevents@1.2.4@fsevents/node_modules/fs.realpath/index.js 8:9-22 @ ./node_modules/_fsevents@1.2.4@fsevents/node_modules/glob/glob.js @ ./node_modules/_fsevents@1.2.4@fsevents/node_modules/rimraf/rimraf.js @ ./node_modules/_fsevents@1.2.4@fsevents/node_modules/node-pre-gyp/lib/util/napi.js @ ./node_modules/_fsevents@1.2.4@fsevents/node_modules/node-pre-gyp/lib/node-pre-gyp.js @ ./node_modules/_fsevents@1.2.4@fsevents/fsevents.js @ ./node_modules/_chokidar@2.0.4@chokidar/lib/fsevents-handler.js @ ./node_modules/_chokidar@2.0.4@chokidar/index.js @ ./node_modules/_watchpack@1.6.0@watchpack/lib/DirectoryWatcher.js @ ./node_modules/_watchpack@1.6.0@watchpack/lib/watcherManager.js @ ./node_modules/_watchpack@1.6.0@watchpack/lib/watchpack.js @ (webpack)/lib/node/NodeWatchFileSystem.js @ (webpack)/lib/node/NodeEnvironmentPlugin.js @ (webpack)/lib/webpack.js @ multi ./node_modules/_webpack-dev-server@3.1.9@webpack-dev-server/client?http://0.0.0.0:8200 webpack ERROR in ./node_modules/_fsevents@1.2.4@fsevents/node_modules/glob/glob.js Module not found: Error: Can't resolve 'fs' in 'D:\java\JetBrains\module\vue-app\vue-todo\node_modules\_fsevents@1.2.4@fsevents\node_modules\glob' @ ./node_modules/_fsevents@1.2.4@fsevents/node_modules/glob/glob.js 43:9-22 @ ./node_modules/_fsevents@1.2.4@fsevents/node_modules/rimraf/rimraf.js @ ./node_modules/_fsevents@1.2.4@fsevents/node_modules/node-pre-gyp/lib/util/napi.js @ ./node_modules/_fsevents@1.2.4@fsevents/node_modules/node-pre-gyp/lib/node-pre-gyp.js @ ./node_modules/_fsevents@1.2.4@fsevents/fsevents.js @ ./node_modules/_chokidar@2.0.4@chokidar/lib/fsevents-handler.js @ ./node_modules/_chokidar@2.0.4@chokidar/index.js @ ./node_modules/_watchpack@1.6.0@watchpack/lib/DirectoryWatcher.js @ ./node_modules/_watchpack@1.6.0@watchpack/lib/watcherManager.js @ ./node_modules/_watchpack@1.6.0@watchpack/lib/watchpack.js @ (webpack)/lib/node/NodeWatchFileSystem.js @ (webpack)/lib/node/NodeEnvironmentPlugin.js @ (webpack)/lib/webpack.js @ multi ./node_modules/_webpack-dev-server@3.1.9@webpack-dev-server/client?http://0.0.0.0:8200 webpack ERROR in ./node_modules/_fsevents@1.2.4@fsevents/node_modules/glob/sync.js Module not found: Error: Can't resolve 'fs' in 'D:\java\JetBrains\module\vue-app\vue-todo\node_modules\_fsevents@1.2.4@fsevents\node_modules\glob' @ ./node_modules/_fsevents@1.2.4@fsevents/node_modules/glob/sync.js 4:9-22 @ ./node_modules/_fsevents@1.2.4@fsevents/node_modules/glob/glob.js @ ./node_modules/_fsevents@1.2.4@fsevents/node_modules/rimraf/rimraf.js @ ./node_modules/_fsevents@1.2.4@fsevents/node_modules/node-pre-gyp/lib/util/napi.js @ ./node_modules/_fsevents@1.2.4@fsevents/node_modules/node-pre-gyp/lib/node-pre-gyp.js @ ./node_modules/_fsevents@1.2.4@fsevents/fsevents.js @ ./node_modules/_chokidar@2.0.4@chokidar/lib/fsevents-handler.js @ ./node_modules/_chokidar@2.0.4@chokidar/index.js @ ./node_modules/_watchpack@1.6.0@watchpack/lib/DirectoryWatcher.js @ ./node_modules/_watchpack@1.6.0@watchpack/lib/watcherManager.js @ ./node_modules/_watchpack@1.6.0@watchpack/lib/watchpack.js @ (webpack)/lib/node/NodeWatchFileSystem.js @ (webpack)/lib/node/NodeEnvironmentPlugin.js @ (webpack)/lib/webpack.js @ multi ./node_modules/_webpack-dev-server@3.1.9@webpack-dev-server/client?http://0.0.0.0:8200 webpack ERROR in ./node_modules/_fsevents@1.2.4@fsevents/node_modules/ignore-walk/index.js Module not found: Error: Can't resolve 'fs' in 'D:\java\JetBrains\module\vue-app\vue-todo\node_modules\_fsevents@1.2.4@fsevents\node_modules\ignore-walk' @ ./node_modules/_fsevents@1.2.4@fsevents/node_modules/ignore-walk/index.js 3:11-24 @ ./node_modules/_fsevents@1.2.4@fsevents/node_modules/npm-packlist/index.js @ ./node_modules/_fsevents@1.2.4@fsevents/node_modules/node-pre-gyp/lib/package.js @ ./node_modules/_fsevents@1.2.4@fsevents/node_modules/node-pre-gyp/lib sync ^\.\/.*$ @ ./node_modules/_fsevents@1.2.4@fsevents/node_modules/node-pre-gyp/lib/node-pre-gyp.js @ ./node_modules/_fsevents@1.2.4@fsevents/fsevents.js @ ./node_modules/_chokidar@2.0.4@chokidar/lib/fsevents-handler.js @ ./node_modules/_chokidar@2.0.4@chokidar/index.js @ ./node_modules/_watchpack@1.6.0@watchpack/lib/DirectoryWatcher.js @ ./node_modules/_watchpack@1.6.0@watchpack/lib/watcherManager.js @ ./node_modules/_watchpack@1.6.0@watchpack/lib/watchpack.js @ (webpack)/lib/node/NodeWatchFileSystem.js @ (webpack)/lib/node/NodeEnvironmentPlugin.js @ (webpack)/lib/webpack.js @ multi ./node_modules/_webpack-dev-server@3.1.9@webpack-dev-server/client?http://0.0.0.0:8200 webpack ERROR in ./node_modules/_fsevents@1.2.4@fsevents/node_modules/mkdirp/index.js Module not found: Error: Can't resolve 'fs' in 'D:\java\JetBrains\module\vue-app\vue-todo\node_modules\_fsevents@1.2.4@fsevents\node_modules\mkdirp' @ ./node_modules/_fsevents@1.2.4@fsevents/node_modules/mkdirp/index.js 2:9-22 @ ./node_modules/_fsevents@1.2.4@fsevents/node_modules/node-pre-gyp/lib/testpackage.js @ ./node_modules/_fsevents@1.2.4@fsevents/node_modules/node-pre-gyp/lib sync ^\.\/.*$ @ ./node_modules/_fsevents@1.2.4@fsevents/node_modules/node-pre-gyp/lib/node-pre-gyp.js @ ./node_modules/_fsevents@1.2.4@fsevents/fsevents.js @ ./node_modules/_chokidar@2.0.4@chokidar/lib/fsevents-handler.js @ ./node_modules/_chokidar@2.0.4@chokidar/index.js @ ./node_modules/_watchpack@1.6.0@watchpack/lib/DirectoryWatcher.js @ ./node_modules/_watchpack@1.6.0@watchpack/lib/watcherManager.js @ ./node_modules/_watchpack@1.6.0@watchpack/lib/watchpack.js @ (webpack)/lib/node/NodeWatchFileSystem.js @ (webpack)/lib/node/NodeEnvironmentPlugin.js @ (webpack)/lib/webpack.js @ multi ./node_modules/_webpack-dev-server@3.1.9@webpack-dev-server/client?http://0.0.0.0:8200 webpack ERROR in ./node_modules/_fsevents@1.2.4@fsevents/node_modules/needle/lib/multipart.js Module not found: Error: Can't resolve 'fs' in 'D:\java\JetBrains\module\vue-app\vue-todo\node_modules\_fsevents@1.2.4@fsevents\node_modules\needle\lib' @ ./node_modules/_fsevents@1.2.4@fsevents/node_modules/needle/lib/multipart.js 1:15-28 @ ./node_modules/_fsevents@1.2.4@fsevents/node_modules/needle/lib/needle.js @ ./node_modules/_fsevents@1.2.4@fsevents/node_modules/node-pre-gyp/lib/install.js @ ./node_modules/_fsevents@1.2.4@fsevents/node_modules/node-pre-gyp/lib sync ^\.\/.*$ @ ./node_modules/_fsevents@1.2.4@fsevents/node_modules/node-pre-gyp/lib/node-pre-gyp.js @ ./node_modules/_fsevents@1.2.4@fsevents/fsevents.js @ ./node_modules/_chokidar@2.0.4@chokidar/lib/fsevents-handler.js @ ./node_modules/_chokidar@2.0.4@chokidar/index.js @ ./node_modules/_watchpack@1.6.0@watchpack/lib/DirectoryWatcher.js @ ./node_modules/_watchpack@1.6.0@watchpack/lib/watcherManager.js @ ./node_modules/_watchpack@1.6.0@watchpack/lib/watchpack.js @ (webpack)/lib/node/NodeWatchFileSystem.js @ (webpack)/lib/node/NodeEnvironmentPlugin.js @ (webpack)/lib/webpack.js @ multi ./node_modules/_webpack-dev-server@3.1.9@webpack-dev-server/client?http://0.0.0.0:8200 webpack ERROR in ./node_modules/_fsevents@1.2.4@fsevents/node_modules/needle/lib/needle.js Module not found: Error: Can't resolve 'fs' in 'D:\java\JetBrains\module\vue-app\vue-todo\node_modules\_fsevents@1.2.4@fsevents\node_modules\needle\lib' @ ./node_modules/_fsevents@1.2.4@fsevents/node_modules/needle/lib/needle.js 8:18-31 @ ./node_modules/_fsevents@1.2.4@fsevents/node_modules/node-pre-gyp/lib/install.js @ ./node_modules/_fsevents@1.2.4@fsevents/node_modules/node-pre-gyp/lib sync ^\.\/.*$ @ ./node_modules/_fsevents@1.2.4@fsevents/node_modules/node-pre-gyp/lib/node-pre-gyp.js @ ./node_modules/_fsevents@1.2.4@fsevents/fsevents.js @ ./node_modules/_chokidar@2.0.4@chokidar/lib/fsevents-handler.js @ ./node_modules/_chokidar@2.0.4@chokidar/index.js @ ./node_modules/_watchpack@1.6.0@watchpack/lib/DirectoryWatcher.js @ ./node_modules/_watchpack@1.6.0@watchpack/lib/watcherManager.js @ ./node_modules/_watchpack@1.6.0@watchpack/lib/watchpack.js @ (webpack)/lib/node/NodeWatchFileSystem.js @ (webpack)/lib/node/NodeEnvironmentPlugin.js @ (webpack)/lib/webpack.js @ multi ./node_modules/_webpack-dev-server@3.1.9@webpack-dev-server/client?http://0.0.0.0:8200 webpack ERROR in ./node_modules/_fsevents@1.2.4@fsevents/node_modules/node-pre-gyp/lib/testbinary.js Module not found: Error: Can't resolve 'fs' in 'D:\java\JetBrains\module\vue-app\vue-todo\node_modules\_fsevents@1.2.4@fsevents\node_modules\node-pre-gyp\lib' @ ./node_modules/_fsevents@1.2.4@fsevents/node_modules/node-pre-gyp/lib/testbinary.js 7:9-22 @ ./node_modules/_fsevents@1.2.4@fsevents/node_modules/node-pre-gyp/lib sync ^\.\/.*$ @ ./node_modules/_fsevents@1.2.4@fsevents/node_modules/node-pre-gyp/lib/node-pre-gyp.js @ ./node_modules/_fsevents@1.2.4@fsevents/fsevents.js @ ./node_modules/_chokidar@2.0.4@chokidar/lib/fsevents-handler.js @ ./node_modules/_chokidar@2.0.4@chokidar/index.js @ ./node_modules/_watchpack@1.6.0@watchpack/lib/DirectoryWatcher.js @ ./node_modules/_watchpack@1.6.0@watchpack/lib/watcherManager.js @ ./node_modules/_watchpack@1.6.0@watchpack/lib/watchpack.js @ (webpack)/lib/node/NodeWatchFileSystem.js @ (webpack)/lib/node/NodeEnvironmentPlugin.js @ (webpack)/lib/webpack.js @ multi ./node_modules/_webpack-dev-server@3.1.9@webpack-dev-server/client?http://0.0.0.0:8200 webpack ERROR in ./node_modules/_fsevents@1.2.4@fsevents/node_modules/node-pre-gyp/lib/testpackage.js Module not found: Error: Can't resolve 'fs' in 'D:\java\JetBrains\module\vue-app\vue-todo\node_modules\_fsevents@1.2.4@fsevents\node_modules\node-pre-gyp\lib' @ ./node_modules/_fsevents@1.2.4@fsevents/node_modules/node-pre-gyp/lib/testpackage.js 7:9-22 @ ./node_modules/_fsevents@1.2.4@fsevents/node_modules/node-pre-gyp/lib sync ^\.\/.*$ @ ./node_modules/_fsevents@1.2.4@fsevents/node_modules/node-pre-gyp/lib/node-pre-gyp.js @ ./node_modules/_fsevents@1.2.4@fsevents/fsevents.js @ ./node_modules/_chokidar@2.0.4@chokidar/lib/fsevents-handler.js @ ./node_modules/_chokidar@2.0.4@chokidar/index.js @ ./node_modules/_watchpack@1.6.0@watchpack/lib/DirectoryWatcher.js @ ./node_modules/_watchpack@1.6.0@watchpack/lib/watcherManager.js @ ./node_modules/_watchpack@1.6.0@watchpack/lib/watchpack.js @ (webpack)/lib/node/NodeWatchFileSystem.js @ (webpack)/lib/node/NodeEnvironmentPlugin.js @ (webpack)/lib/webpack.js @ multi ./node_modules/_webpack-dev-server@3.1.9@webpack-dev-server/client?http://0.0.0.0:8200 webpack ERROR in ./node_modules/_fsevents@1.2.4@fsevents/node_modules/node-pre-gyp/lib/node-pre-gyp.js Module not found: Error: Can't resolve 'fs' in 'D:\java\JetBrains\module\vue-app\vue-todo\node_modules\_fsevents@1.2.4@fsevents\node_modules\node-pre-gyp\lib' @ ./node_modules/_fsevents@1.2.4@fsevents/node_modules/node-pre-gyp/lib/node-pre-gyp.js 13:9-22 @ ./node_modules/_fsevents@1.2.4@fsevents/fsevents.js @ ./node_modules/_chokidar@2.0.4@chokidar/lib/fsevents-handler.js @ ./node_modules/_chokidar@2.0.4@chokidar/index.js @ ./node_modules/_watchpack@1.6.0@watchpack/lib/DirectoryWatcher.js @ ./node_modules/_watchpack@1.6.0@watchpack/lib/watcherManager.js @ ./node_modules/_watchpack@1.6.0@watchpack/lib/watchpack.js @ (webpack)/lib/node/NodeWatchFileSystem.js @ (webpack)/lib/node/NodeEnvironmentPlugin.js @ (webpack)/lib/webpack.js @ multi ./node_modules/_webpack-dev-server@3.1.9@webpack-dev-server/client?http://0.0.0.0:8200 webpack ERROR in ./node_modules/_fsevents@1.2.4@fsevents/node_modules/node-pre-gyp/lib/pre-binding.js Module not found: Error: Can't resolve 'fs' in 'D:\java\JetBrains\module\vue-app\vue-todo\node_modules\_fsevents@1.2.4@fsevents\node_modules\node-pre-gyp\lib' @ ./node_modules/_fsevents@1.2.4@fsevents/node_modules/node-pre-gyp/lib/pre-binding.js 5:17-30 @ ./node_modules/_fsevents@1.2.4@fsevents/node_modules/node-pre-gyp/lib/node-pre-gyp.js @ ./node_modules/_fsevents@1.2.4@fsevents/fsevents.js @ ./node_modules/_chokidar@2.0.4@chokidar/lib/fsevents-handler.js @ ./node_modules/_chokidar@2.0.4@chokidar/index.js @ ./node_modules/_watchpack@1.6.0@watchpack/lib/DirectoryWatcher.js @ ./node_modules/_watchpack@1.6.0@watchpack/lib/watcherManager.js @ ./node_modules/_watchpack@1.6.0@watchpack/lib/watchpack.js @ (webpack)/lib/node/NodeWatchFileSystem.js @ (webpack)/lib/node/NodeEnvironmentPlugin.js @ (webpack)/lib/webpack.js @ multi ./node_modules/_webpack-dev-server@3.1.9@webpack-dev-server/client?http://0.0.0.0:8200 webpack ERROR in ./node_modules/_fsevents@1.2.4@fsevents/node_modules/node-pre-gyp/lib/clean.js Module not found: Error: Can't resolve 'fs' in 'D:\java\JetBrains\module\vue-app\vue-todo\node_modules\_fsevents@1.2.4@fsevents\node_modules\node-pre-gyp\lib' @ ./node_modules/_fsevents@1.2.4@fsevents/node_modules/node-pre-gyp/lib/clean.js 7:9-22 9:13-26 @ ./node_modules/_fsevents@1.2.4@fsevents/node_modules/node-pre-gyp/lib sync ^\.\/.*$ @ ./node_modules/_fsevents@1.2.4@fsevents/node_modules/node-pre-gyp/lib/node-pre-gyp.js @ ./node_modules/_fsevents@1.2.4@fsevents/fsevents.js @ ./node_modules/_chokidar@2.0.4@chokidar/lib/fsevents-handler.js @ ./node_modules/_chokidar@2.0.4@chokidar/index.js @ ./node_modules/_watchpack@1.6.0@watchpack/lib/DirectoryWatcher.js @ ./node_modules/_watchpack@1.6.0@watchpack/lib/watcherManager.js @ ./node_modules/_watchpack@1.6.0@watchpack/lib/watchpack.js @ (webpack)/lib/node/NodeWatchFileSystem.js @ (webpack)/lib/node/NodeEnvironmentPlugin.js @ (webpack)/lib/webpack.js @ multi ./node_modules/_webpack-dev-server@3.1.9@webpack-dev-server/client?http://0.0.0.0:8200 webpack ERROR in ./node_modules/_fsevents@1.2.4@fsevents/node_modules/node-pre-gyp/lib/unpublish.js Module not found: Error: Can't resolve 'fs' in 'D:\java\JetBrains\module\vue-app\vue-todo\node_modules\_fsevents@1.2.4@fsevents\node_modules\node-pre-gyp\lib' @ ./node_modules/_fsevents@1.2.4@fsevents/node_modules/node-pre-gyp/lib/unpublish.js 7:9-22 @ ./node_modules/_fsevents@1.2.4@fsevents/node_modules/node-pre-gyp/lib sync ^\.\/.*$ @ ./node_modules/_fsevents@1.2.4@fsevents/node_modules/node-pre-gyp/lib/node-pre-gyp.js @ ./node_modules/_fsevents@1.2.4@fsevents/fsevents.js @ ./node_modules/_chokidar@2.0.4@chokidar/lib/fsevents-handler.js @ ./node_modules/_chokidar@2.0.4@chokidar/index.js @ ./node_modules/_watchpack@1.6.0@watchpack/lib/DirectoryWatcher.js @ ./node_modules/_watchpack@1.6.0@watchpack/lib/watcherManager.js @ ./node_modules/_watchpack@1.6.0@watchpack/lib/watchpack.js @ (webpack)/lib/node/NodeWatchFileSystem.js @ (webpack)/lib/node/NodeEnvironmentPlugin.js @ (webpack)/lib/webpack.js @ multi ./node_modules/_webpack-dev-server@3.1.9@webpack-dev-server/client?http://0.0.0.0:8200 webpack ERROR in ./node_modules/_fsevents@1.2.4@fsevents/node_modules/node-pre-gyp/lib/package.js Module not found: Error: Can't resolve 'fs' in 'D:\java\JetBrains\module\vue-app\vue-todo\node_modules\_fsevents@1.2.4@fsevents\node_modules\node-pre-gyp\lib' @ ./node_modules/_fsevents@1.2.4@fsevents/node_modules/node-pre-gyp/lib/package.js 7:9-22 12:12-25 @ ./node_modules/_fsevents@1.2.4@fsevents/node_modules/node-pre-gyp/lib sync ^\.\/.*$ @ ./node_modules/_fsevents@1.2.4@fsevents/node_modules/node-pre-gyp/lib/node-pre-gyp.js @ ./node_modules/_fsevents@1.2.4@fsevents/fsevents.js @ ./node_modules/_chokidar@2.0.4@chokidar/lib/fsevents-handler.js @ ./node_modules/_chokidar@2.0.4@chokidar/index.js @ ./node_modules/_watchpack@1.6.0@watchpack/lib/DirectoryWatcher.js @ ./node_modules/_watchpack@1.6.0@watchpack/lib/watcherManager.js @ ./node_modules/_watchpack@1.6.0@watchpack/lib/watchpack.js @ (webpack)/lib/node/NodeWatchFileSystem.js @ (webpack)/lib/node/NodeEnvironmentPlugin.js @ (webpack)/lib/webpack.js @ multi ./node_modules/_webpack-dev-server@3.1.9@webpack-dev-server/client?http://0.0.0.0:8200 webpack ERROR in ./node_modules/_fsevents@1.2.4@fsevents/node_modules/npm-bundled/index.js Module not found: Error: Can't resolve 'fs' in 'D:\java\JetBrains\module\vue-app\vue-todo\node_modules\_fsevents@1.2.4@fsevents\node_modules\npm-bundled' @ ./node_modules/_fsevents@1.2.4@fsevents/node_modules/npm-bundled/index.js 10:11-24 @ ./node_modules/_fsevents@1.2.4@fsevents/node_modules/npm-packlist/index.js @ ./node_modules/_fsevents@1.2.4@fsevents/node_modules/node-pre-gyp/lib/package.js @ ./node_modules/_fsevents@1.2.4@fsevents/node_modules/node-pre-gyp/lib sync ^\.\/.*$ @ ./node_modules/_fsevents@1.2.4@fsevents/node_modules/node-pre-gyp/lib/node-pre-gyp.js @ ./node_modules/_fsevents@1.2.4@fsevents/fsevents.js @ ./node_modules/_chokidar@2.0.4@chokidar/lib/fsevents-handler.js @ ./node_modules/_chokidar@2.0.4@chokidar/index.js @ ./node_modules/_watchpack@1.6.0@watchpack/lib/DirectoryWatcher.js @ ./node_modules/_watchpack@1.6.0@watchpack/lib/watcherManager.js @ ./node_modules/_watchpack@1.6.0@watchpack/lib/watchpack.js @ (webpack)/lib/node/NodeWatchFileSystem.js @ (webpack)/lib/node/NodeEnvironmentPlugin.js @ (webpack)/lib/webpack.js @ multi ./node_modules/_webpack-dev-server@3.1.9@webpack-dev-server/client?http://0.0.0.0:8200 webpack ERROR in ./node_modules/_fsevents@1.2.4@fsevents/node_modules/rimraf/rimraf.js Module not found: Error: Can't resolve 'fs' in 'D:\java\JetBrains\module\vue-app\vue-todo\node_modules\_fsevents@1.2.4@fsevents\node_modules\rimraf' @ ./node_modules/_fsevents@1.2.4@fsevents/node_modules/rimraf/rimraf.js 6:9-22 @ ./node_modules/_fsevents@1.2.4@fsevents/node_modules/node-pre-gyp/lib/util/napi.js @ ./node_modules/_fsevents@1.2.4@fsevents/node_modules/node-pre-gyp/lib/node-pre-gyp.js @ ./node_modules/_fsevents@1.2.4@fsevents/fsevents.js @ ./node_modules/_chokidar@2.0.4@chokidar/lib/fsevents-handler.js @ ./node_modules/_chokidar@2.0.4@chokidar/index.js @ ./node_modules/_watchpack@1.6.0@watchpack/lib/DirectoryWatcher.js @ ./node_modules/_watchpack@1.6.0@watchpack/lib/watcherManager.js @ ./node_modules/_watchpack@1.6.0@watchpack/lib/watchpack.js @ (webpack)/lib/node/NodeWatchFileSystem.js @ (webpack)/lib/node/NodeEnvironmentPlugin.js @ (webpack)/lib/webpack.js @ multi ./node_modules/_webpack-dev-server@3.1.9@webpack-dev-server/client?http://0.0.0.0:8200 webpack ERROR in ./node_modules/_fsevents@1.2.4@fsevents/node_modules/tar/lib/replace.js Module not found: Error: Can't resolve 'fs' in 'D:\java\JetBrains\module\vue-app\vue-todo\node_modules\_fsevents@1.2.4@fsevents\node_modules\tar\lib' @ ./node_modules/_fsevents@1.2.4@fsevents/node_modules/tar/lib/replace.js 8:11-24 @ ./node_modules/_fsevents@1.2.4@fsevents/node_modules/tar/index.js @ ./node_modules/_fsevents@1.2.4@fsevents/node_modules/node-pre-gyp/lib/package.js @ ./node_modules/_fsevents@1.2.4@fsevents/node_modules/node-pre-gyp/lib sync ^\.\/.*$ @ ./node_modules/_fsevents@1.2.4@fsevents/node_modules/node-pre-gyp/lib/node-pre-gyp.js @ ./node_modules/_fsevents@1.2.4@fsevents/fsevents.js @ ./node_modules/_chokidar@2.0.4@chokidar/lib/fsevents-handler.js @ ./node_modules/_chokidar@2.0.4@chokidar/index.js @ ./node_modules/_watchpack@1.6.0@watchpack/lib/DirectoryWatcher.js @ ./node_modules/_watchpack@1.6.0@watchpack/lib/watcherManager.js @ ./node_modules/_watchpack@1.6.0@watchpack/lib/watchpack.js @ (webpack)/lib/node/NodeWatchFileSystem.js @ (webpack)/lib/node/NodeEnvironmentPlugin.js @ (webpack)/lib/webpack.js @ multi ./node_modules/_webpack-dev-server@3.1.9@webpack-dev-server/client?http://0.0.0.0:8200 webpack ERROR in ./node_modules/_fsevents@1.2.4@fsevents/node_modules/tar/lib/mkdir.js Module not found: Error: Can't resolve 'fs' in 'D:\java\JetBrains\module\vue-app\vue-todo\node_modules\_fsevents@1.2.4@fsevents\node_modules\tar\lib' @ ./node_modules/_fsevents@1.2.4@fsevents/node_modules/tar/lib/mkdir.js 8:11-24 @ ./node_modules/_fsevents@1.2.4@fsevents/node_modules/tar/lib/unpack.js @ ./node_modules/_fsevents@1.2.4@fsevents/node_modules/tar/index.js @ ./node_modules/_fsevents@1.2.4@fsevents/node_modules/node-pre-gyp/lib/package.js @ ./node_modules/_fsevents@1.2.4@fsevents/node_modules/node-pre-gyp/lib sync ^\.\/.*$ @ ./node_modules/_fsevents@1.2.4@fsevents/node_modules/node-pre-gyp/lib/node-pre-gyp.js @ ./node_modules/_fsevents@1.2.4@fsevents/fsevents.js @ ./node_modules/_chokidar@2.0.4@chokidar/lib/fsevents-handler.js @ ./node_modules/_chokidar@2.0.4@chokidar/index.js @ ./node_modules/_watchpack@1.6.0@watchpack/lib/DirectoryWatcher.js @ ./node_modules/_watchpack@1.6.0@watchpack/lib/watcherManager.js @ ./node_modules/_watchpack@1.6.0@watchpack/lib/watchpack.js @ (webpack)/lib/node/NodeWatchFileSystem.js @ (webpack)/lib/node/NodeEnvironmentPlugin.js @ (webpack)/lib/webpack.js @ multi ./node_modules/_webpack-dev-server@3.1.9@webpack-dev-server/client?http://0.0.0.0:8200 webpack ERROR in ./node_modules/_fsevents@1.2.4@fsevents/node_modules/tar/lib/write-entry.js Module not found: Error: Can't resolve 'fs' in 'D:\java\JetBrains\module\vue-app\vue-todo\node_modules\_fsevents@1.2.4@fsevents\node_modules\tar\lib' @ ./node_modules/_fsevents@1.2.4@fsevents/node_modules/tar/lib/write-entry.js 7:11-24 @ ./node_modules/_fsevents@1.2.4@fsevents/node_modules/tar/index.js @ ./node_modules/_fsevents@1.2.4@fsevents/node_modules/node-pre-gyp/lib/package.js @ ./node_modules/_fsevents@1.2.4@fsevents/node_modules/node-pre-gyp/lib sync ^\.\/.*$ @ ./node_modules/_fsevents@1.2.4@fsevents/node_modules/node-pre-gyp/lib/node-pre-gyp.js @ ./node_modules/_fsevents@1.2.4@fsevents/fsevents.js @ ./node_modules/_chokidar@2.0.4@chokidar/lib/fsevents-handler.js @ ./node_modules/_chokidar@2.0.4@chokidar/index.js @ ./node_modules/_watchpack@1.6.0@watchpack/lib/DirectoryWatcher.js @ ./node_modules/_watchpack@1.6.0@watchpack/lib/watcherManager.js @ ./node_modules/_watchpack@1.6.0@watchpack/lib/watchpack.js @ (webpack)/lib/node/NodeWatchFileSystem.js @ (webpack)/lib/node/NodeEnvironmentPlugin.js @ (webpack)/lib/webpack.js @ multi ./node_modules/_webpack-dev-server@3.1.9@webpack-dev-server/client?http://0.0.0.0:8200 webpack ERROR in ./node_modules/_fsevents@1.2.4@fsevents/node_modules/tar/lib/unpack.js Module not found: Error: Can't resolve 'fs' in 'D:\java\JetBrains\module\vue-app\vue-todo\node_modules\_fsevents@1.2.4@fsevents\node_modules\tar\lib' @ ./node_modules/_fsevents@1.2.4@fsevents/node_modules/tar/lib/unpack.js 6:11-24 @ ./node_modules/_fsevents@1.2.4@fsevents/node_modules/tar/index.js @ ./node_modules/_fsevents@1.2.4@fsevents/node_modules/node-pre-gyp/lib/package.js @ ./node_modules/_fsevents@1.2.4@fsevents/node_modules/node-pre-gyp/lib sync ^\.\/.*$ @ ./node_modules/_fsevents@1.2.4@fsevents/node_modules/node-pre-gyp/lib/node-pre-gyp.js @ ./node_modules/_fsevents@1.2.4@fsevents/fsevents.js @ ./node_modules/_chokidar@2.0.4@chokidar/lib/fsevents-handler.js @ ./node_modules/_chokidar@2.0.4@chokidar/index.js @ ./node_modules/_watchpack@1.6.0@watchpack/lib/DirectoryWatcher.js @ ./node_modules/_watchpack@1.6.0@watchpack/lib/watcherManager.js @ ./node_modules/_watchpack@1.6.0@watchpack/lib/watchpack.js @ (webpack)/lib/node/NodeWatchFileSystem.js @ (webpack)/lib/node/NodeEnvironmentPlugin.js @ (webpack)/lib/webpack.js @ multi ./node_modules/_webpack-dev-server@3.1.9@webpack-dev-server/client?http://0.0.0.0:8200 webpack ERROR in ./node_modules/_fsevents@1.2.4@fsevents/node_modules/tar/lib/pack.js Module not found: Error: Can't resolve 'fs' in 'D:\java\JetBrains\module\vue-app\vue-todo\node_modules\_fsevents@1.2.4@fsevents\node_modules\tar\lib' @ ./node_modules/_fsevents@1.2.4@fsevents/node_modules/tar/lib/pack.js 56:11-24 @ ./node_modules/_fsevents@1.2.4@fsevents/node_modules/tar/index.js @ ./node_modules/_fsevents@1.2.4@fsevents/node_modules/node-pre-gyp/lib/package.js @ ./node_modules/_fsevents@1.2.4@fsevents/node_modules/node-pre-gyp/lib sync ^\.\/.*$ @ ./node_modules/_fsevents@1.2.4@fsevents/node_modules/node-pre-gyp/lib/node-pre-gyp.js @ ./node_modules/_fsevents@1.2.4@fsevents/fsevents.js @ ./node_modules/_chokidar@2.0.4@chokidar/lib/fsevents-handler.js @ ./node_modules/_chokidar@2.0.4@chokidar/index.js @ ./node_modules/_watchpack@1.6.0@watchpack/lib/DirectoryWatcher.js @ ./node_modules/_watchpack@1.6.0@watchpack/lib/watcherManager.js @ ./node_modules/_watchpack@1.6.0@watchpack/lib/watchpack.js @ (webpack)/lib/node/NodeWatchFileSystem.js @ (webpack)/lib/node/NodeEnvironmentPlugin.js @ (webpack)/lib/webpack.js @ multi ./node_modules/_webpack-dev-server@3.1.9@webpack-dev-server/client?http://0.0.0.0:8200 webpack ERROR in ./node_modules/_fsevents@1.2.4@fsevents/node_modules/tar/lib/extract.js Module not found: Error: Can't resolve 'fs' in 'D:\java\JetBrains\module\vue-app\vue-todo\node_modules\_fsevents@1.2.4@fsevents\node_modules\tar\lib' @ ./node_modules/_fsevents@1.2.4@fsevents/node_modules/tar/lib/extract.js 6:11-24 @ ./node_modules/_fsevents@1.2.4@fsevents/node_modules/tar/index.js @ ./node_modules/_fsevents@1.2.4@fsevents/node_modules/node-pre-gyp/lib/package.js @ ./node_modules/_fsevents@1.2.4@fsevents/node_modules/node-pre-gyp/lib sync ^\.\/.*$ @ ./node_modules/_fsevents@1.2.4@fsevents/node_modules/node-pre-gyp/lib/node-pre-gyp.js @ ./node_modules/_fsevents@1.2.4@fsevents/fsevents.js @ ./node_modules/_chokidar@2.0.4@chokidar/lib/fsevents-handler.js @ ./node_modules/_chokidar@2.0.4@chokidar/index.js @ ./node_modules/_watchpack@1.6.0@watchpack/lib/DirectoryWatcher.js @ ./node_modules/_watchpack@1.6.0@watchpack/lib/watcherManager.js @ ./node_modules/_watchpack@1.6.0@watchpack/lib/watchpack.js @ (webpack)/lib/node/NodeWatchFileSystem.js @ (webpack)/lib/node/NodeEnvironmentPlugin.js @ (webpack)/lib/webpack.js @ multi ./node_modules/_webpack-dev-server@3.1.9@webpack-dev-server/client?http://0.0.0.0:8200 webpack ERROR in ./node_modules/_fsevents@1.2.4@fsevents/node_modules/tar/lib/list.js Module not found: Error: Can't resolve 'fs' in 'D:\java\JetBrains\module\vue-app\vue-todo\node_modules\_fsevents@1.2.4@fsevents\node_modules\tar\lib' @ ./node_modules/_fsevents@1.2.4@fsevents/node_modules/tar/lib/list.js 11:11-24 @ ./node_modules/_fsevents@1.2.4@fsevents/node_modules/tar/index.js @ ./node_modules/_fsevents@1.2.4@fsevents/node_modules/node-pre-gyp/lib/package.js @ ./node_modules/_fsevents@1.2.4@fsevents/node_modules/node-pre-gyp/lib sync ^\.\/.*$ @ ./node_modules/_fsevents@1.2.4@fsevents/node_modules/node-pre-gyp/lib/node-pre-gyp.js @ ./node_modules/_fsevents@1.2.4@fsevents/fsevents.js @ ./node_modules/_chokidar@2.0.4@chokidar/lib/fsevents-handler.js @ ./node_modules/_chokidar@2.0.4@chokidar/index.js @ ./node_modules/_watchpack@1.6.0@watchpack/lib/DirectoryWatcher.js @ ./node_modules/_watchpack@1.6.0@watchpack/lib/watcherManager.js @ ./node_modules/_watchpack@1.6.0@watchpack/lib/watchpack.js @ (webpack)/lib/node/NodeWatchFileSystem.js @ (webpack)/lib/node/NodeEnvironmentPlugin.js @ (webpack)/lib/webpack.js @ multi ./node_modules/_webpack-dev-server@3.1.9@webpack-dev-server/client?http://0.0.0.0:8200 webpack ERROR in ./node_modules/_fsevents@1.2.4@fsevents/node_modules/tar/lib/create.js Module not found: Error: Can't resolve 'fs' in 'D:\java\JetBrains\module\vue-app\vue-todo\node_modules\_fsevents@1.2.4@fsevents\node_modules\tar\lib' @ ./node_modules/_fsevents@1.2.4@fsevents/node_modules/tar/lib/create.js 7:11-24 @ ./node_modules/_fsevents@1.2.4@fsevents/node_modules/tar/index.js @ ./node_modules/_fsevents@1.2.4@fsevents/node_modules/node-pre-gyp/lib/package.js @ ./node_modules/_fsevents@1.2.4@fsevents/node_modules/node-pre-gyp/lib sync ^\.\/.*$ @ ./node_modules/_fsevents@1.2.4@fsevents/node_modules/node-pre-gyp/lib/node-pre-gyp.js @ ./node_modules/_fsevents@1.2.4@fsevents/fsevents.js @ ./node_modules/_chokidar@2.0.4@chokidar/lib/fsevents-handler.js @ ./node_modules/_chokidar@2.0.4@chokidar/index.js @ ./node_modules/_watchpack@1.6.0@watchpack/lib/DirectoryWatcher.js @ ./node_modules/_watchpack@1.6.0@watchpack/lib/watcherManager.js @ ./node_modules/_watchpack@1.6.0@watchpack/lib/watchpack.js @ (webpack)/lib/node/NodeWatchFileSystem.js @ (webpack)/lib/node/NodeEnvironmentPlugin.js @ (webpack)/lib/webpack.js @ multi ./node_modules/_webpack-dev-server@3.1.9@webpack-dev-server/client?http://0.0.0.0:8200 webpack ERROR in ./node_modules/_glob@7.1.3@glob/sync.js Module not found: Error: Can't resolve 'fs' in 'D:\java\JetBrains\module\vue-app\vue-todo\node_modules\_glob@7.1.3@glob' @ ./node_modules/_glob@7.1.3@glob/sync.js 4:9-22 @ ./node_modules/_glob@7.1.3@glob/glob.js @ ./node_modules/_cacache@10.0.4@cacache/lib/verify.js @ ./node_modules/_cacache@10.0.4@cacache/verify.js @ ./node_modules/_cacache@10.0.4@cacache/locales/en.js @ ./node_modules/_cacache@10.0.4@cacache/index.js @ ./node_modules/_uglifyjs-webpack-plugin@1.3.0@uglifyjs-webpack-plugin/dist/uglify/Runner.js @ ./node_modules/_uglifyjs-webpack-plugin@1.3.0@uglifyjs-webpack-plugin/dist/index.js @ ./node_modules/_uglifyjs-webpack-plugin@1.3.0@uglifyjs-webpack-plugin/dist/cjs.js @ (webpack)/lib/WebpackOptionsDefaulter.js @ (webpack)/lib/webpack.js @ multi ./node_modules/_webpack-dev-server@3.1.9@webpack-dev-server/client?http://0.0.0.0:8200 webpack ERROR in ./node_modules/_glob@7.1.3@glob/glob.js Module not found: Error: Can't resolve 'fs' in 'D:\java\JetBrains\module\vue-app\vue-todo\node_modules\_glob@7.1.3@glob' @ ./node_modules/_glob@7.1.3@glob/glob.js 43:9-22 @ ./node_modules/_cacache@10.0.4@cacache/lib/verify.js @ ./node_modules/_cacache@10.0.4@cacache/verify.js @ ./node_modules/_cacache@10.0.4@cacache/locales/en.js @ ./node_modules/_cacache@10.0.4@cacache/index.js @ ./node_modules/_uglifyjs-webpack-plugin@1.3.0@uglifyjs-webpack-plugin/dist/uglify/Runner.js @ ./node_modules/_uglifyjs-webpack-plugin@1.3.0@uglifyjs-webpack-plugin/dist/index.js @ ./node_modules/_uglifyjs-webpack-plugin@1.3.0@uglifyjs-webpack-plugin/dist/cjs.js @ (webpack)/lib/WebpackOptionsDefaulter.js @ (webpack)/lib/webpack.js @ multi ./node_modules/_webpack-dev-server@3.1.9@webpack-dev-server/client?http://0.0.0.0:8200 webpack ERROR in ./node_modules/_graceful-fs@4.1.11@graceful-fs/graceful-fs.js Module not found: Error: Can't resolve 'fs' in 'D:\java\JetBrains\module\vue-app\vue-todo\node_modules\_graceful-fs@4.1.11@graceful-fs' @ ./node_modules/_graceful-fs@4.1.11@graceful-fs/graceful-fs.js 1:9-22 @ ./node_modules/_enhanced-resolve@4.1.0@enhanced-resolve/lib/NodeJsInputFileSystem.js @ (webpack)/lib/node/NodeEnvironmentPlugin.js @ (webpack)/lib/webpack.js @ multi ./node_modules/_webpack-dev-server@3.1.9@webpack-dev-server/client?http://0.0.0.0:8200 webpack ERROR in ./node_modules/_graceful-fs@4.1.11@graceful-fs/fs.js Module not found: Error: Can't resolve 'fs' in 'D:\java\JetBrains\module\vue-app\vue-todo\node_modules\_graceful-fs@4.1.11@graceful-fs' @ ./node_modules/_graceful-fs@4.1.11@graceful-fs/fs.js 3:9-22 @ ./node_modules/_graceful-fs@4.1.11@graceful-fs/graceful-fs.js @ ./node_modules/_enhanced-resolve@4.1.0@enhanced-resolve/lib/NodeJsInputFileSystem.js @ (webpack)/lib/node/NodeEnvironmentPlugin.js @ (webpack)/lib/webpack.js @ multi ./node_modules/_webpack-dev-server@3.1.9@webpack-dev-server/client?http://0.0.0.0:8200 webpack ERROR in ./node_modules/_loader-runner@2.3.1@loader-runner/lib/LoaderRunner.js Module not found: Error: Can't resolve 'fs' in 'D:\java\JetBrains\module\vue-app\vue-todo\node_modules\_loader-runner@2.3.1@loader-runner\lib' @ ./node_modules/_loader-runner@2.3.1@loader-runner/lib/LoaderRunner.js 5:9-22 @ (webpack)/lib/NormalModule.js @ (webpack)/lib/AutomaticPrefetchPlugin.js @ (webpack)/lib/webpack.js @ multi ./node_modules/_webpack-dev-server@3.1.9@webpack-dev-server/client?http://0.0.0.0:8200 webpack ERROR in ./node_modules/_make-dir@1.3.0@make-dir/index.js Module not found: Error: Can't resolve 'fs' in 'D:\java\JetBrains\module\vue-app\vue-todo\node_modules\_make-dir@1.3.0@make-dir' @ ./node_modules/_make-dir@1.3.0@make-dir/index.js 2:11-24 @ ./node_modules/_find-cache-dir@1.0.0@find-cache-dir/index.js @ ./node_modules/_uglifyjs-webpack-plugin@1.3.0@uglifyjs-webpack-plugin/dist/uglify/Runner.js @ ./node_modules/_uglifyjs-webpack-plugin@1.3.0@uglifyjs-webpack-plugin/dist/index.js @ ./node_modules/_uglifyjs-webpack-plugin@1.3.0@uglifyjs-webpack-plugin/dist/cjs.js @ (webpack)/lib/WebpackOptionsDefaulter.js @ (webpack)/lib/webpack.js @ multi ./node_modules/_webpack-dev-server@3.1.9@webpack-dev-server/client?http://0.0.0.0:8200 webpack ERROR in ./node_modules/_mkdirp@0.5.1@mkdirp/index.js Module not found: Error: Can't resolve 'fs' in 'D:\java\JetBrains\module\vue-app\vue-todo\node_modules\_mkdirp@0.5.1@mkdirp' @ ./node_modules/_mkdirp@0.5.1@mkdirp/index.js 2:9-22 @ (webpack)/lib/node/NodeOutputFileSystem.js @ (webpack)/lib/node/NodeEnvironmentPlugin.js @ (webpack)/lib/webpack.js @ multi ./node_modules/_webpack-dev-server@3.1.9@webpack-dev-server/client?http://0.0.0.0:8200 webpack ERROR in ./node_modules/_move-concurrently@1.0.1@move-concurrently/move.js Module not found: Error: Can't resolve 'fs' in 'D:\java\JetBrains\module\vue-app\vue-todo\node_modules\_move-concurrently@1.0.1@move-concurrently' @ ./node_modules/_move-concurrently@1.0.1@move-concurrently/move.js 4:13-26 @ ./node_modules/_cacache@10.0.4@cacache/lib/util/move-file.js @ ./node_modules/_cacache@10.0.4@cacache/lib/content/write.js @ ./node_modules/_cacache@10.0.4@cacache/put.js @ ./node_modules/_cacache@10.0.4@cacache/locales/en.js @ ./node_modules/_cacache@10.0.4@cacache/index.js @ ./node_modules/_uglifyjs-webpack-plugin@1.3.0@uglifyjs-webpack-plugin/dist/uglify/Runner.js @ ./node_modules/_uglifyjs-webpack-plugin@1.3.0@uglifyjs-webpack-plugin/dist/index.js @ ./node_modules/_uglifyjs-webpack-plugin@1.3.0@uglifyjs-webpack-plugin/dist/cjs.js @ (webpack)/lib/WebpackOptionsDefaulter.js @ (webpack)/lib/webpack.js @ multi ./node_modules/_webpack-dev-server@3.1.9@webpack-dev-server/client?http://0.0.0.0:8200 webpack ERROR in ./node_modules/_path-exists@3.0.0@path-exists/index.js Module not found: Error: Can't resolve 'fs' in 'D:\java\JetBrains\module\vue-app\vue-todo\node_modules\_path-exists@3.0.0@path-exists' @ ./node_modules/_path-exists@3.0.0@path-exists/index.js 2:11-24 @ ./node_modules/_locate-path@2.0.0@locate-path/index.js @ ./node_modules/_find-up@2.1.0@find-up/index.js @ ./node_modules/_pkg-dir@2.0.0@pkg-dir/index.js @ ./node_modules/_find-cache-dir@1.0.0@find-cache-dir/index.js @ ./node_modules/_uglifyjs-webpack-plugin@1.3.0@uglifyjs-webpack-plugin/dist/uglify/Runner.js @ ./node_modules/_uglifyjs-webpack-plugin@1.3.0@uglifyjs-webpack-plugin/dist/index.js @ ./node_modules/_uglifyjs-webpack-plugin@1.3.0@uglifyjs-webpack-plugin/dist/cjs.js @ (webpack)/lib/WebpackOptionsDefaulter.js @ (webpack)/lib/webpack.js @ multi ./node_modules/_webpack-dev-server@3.1.9@webpack-dev-server/client?http://0.0.0.0:8200 webpack ERROR in ./node_modules/_rimraf@2.6.2@rimraf/rimraf.js Module not found: Error: Can't resolve 'fs' in 'D:\java\JetBrains\module\vue-app\vue-todo\node_modules\_rimraf@2.6.2@rimraf' @ ./node_modules/_rimraf@2.6.2@rimraf/rimraf.js 6:9-22 @ ./node_modules/_cacache@10.0.4@cacache/lib/util/tmp.js @ ./node_modules/_cacache@10.0.4@cacache/locales/en.js @ ./node_modules/_cacache@10.0.4@cacache/index.js @ ./node_modules/_uglifyjs-webpack-plugin@1.3.0@uglifyjs-webpack-plugin/dist/uglify/Runner.js @ ./node_modules/_uglifyjs-webpack-plugin@1.3.0@uglifyjs-webpack-plugin/dist/index.js @ ./node_modules/_uglifyjs-webpack-plugin@1.3.0@uglifyjs-webpack-plugin/dist/cjs.js @ (webpack)/lib/WebpackOptionsDefaulter.js @ (webpack)/lib/webpack.js @ multi ./node_modules/_webpack-dev-server@3.1.9@webpack-dev-server/client?http://0.0.0.0:8200 webpack ERROR in ./node_modules/_schema-utils@0.4.7@schema-utils/src/validateOptions.js Module not found: Error: Can't resolve 'fs' in 'D:\java\JetBrains\module\vue-app\vue-todo\node_modules\_schema-utils@0.4.7@schema-utils\src' @ ./node_modules/_schema-utils@0.4.7@schema-utils/src/validateOptions.js 8:11-24 @ ./node_modules/_schema-utils@0.4.7@schema-utils/src/index.js @ (webpack)/lib/BannerPlugin.js @ (webpack)/lib/webpack.js @ multi ./node_modules/_webpack-dev-server@3.1.9@webpack-dev-server/client?http://0.0.0.0:8200 webpack ERROR in ./node_modules/_snapdragon@0.8.2@snapdragon/lib/source-maps.js Module not found: Error: Can't resolve 'fs' in 'D:\java\JetBrains\module\vue-app\vue-todo\node_modules\_snapdragon@0.8.2@snapdragon\lib' @ ./node_modules/_snapdragon@0.8.2@snapdragon/lib/source-maps.js 3:9-22 @ ./node_modules/_snapdragon@0.8.2@snapdragon/lib/compiler.js @ ./node_modules/_snapdragon@0.8.2@snapdragon/index.js @ ./node_modules/_micromatch@3.1.10@micromatch/lib/utils.js @ ./node_modules/_micromatch@3.1.10@micromatch/index.js @ (webpack)/lib/optimize/SideEffectsFlagPlugin.js @ (webpack)/lib/webpack.js @ multi ./node_modules/_webpack-dev-server@3.1.9@webpack-dev-server/client?http://0.0.0.0:8200 webpack ERROR in ./node_modules/_uglify-es@3.3.9@uglify-es/tools/node.js Module not found: Error: Can't resolve 'fs' in 'D:\java\JetBrains\module\vue-app\vue-todo\node_modules\_uglify-es@3.3.9@uglify-es\tools' @ ./node_modules/_uglify-es@3.3.9@uglify-es/tools/node.js 1:9-22 @ ./node_modules/_uglifyjs-webpack-plugin@1.3.0@uglifyjs-webpack-plugin/dist/uglify/minify.js @ ./node_modules/_uglifyjs-webpack-plugin@1.3.0@uglifyjs-webpack-plugin/dist/uglify/Runner.js @ ./node_modules/_uglifyjs-webpack-plugin@1.3.0@uglifyjs-webpack-plugin/dist/index.js @ ./node_modules/_uglifyjs-webpack-plugin@1.3.0@uglifyjs-webpack-plugin/dist/cjs.js @ (webpack)/lib/WebpackOptionsDefaulter.js @ (webpack)/lib/webpack.js @ multi ./node_modules/_webpack-dev-server@3.1.9@webpack-dev-server/client?http://0.0.0.0:8200 webpack ERROR in (webpack)/lib/debug/ProfilingPlugin.js Module not found: Error: Can't resolve 'fs' in 'D:\java\JetBrains\module\vue-app\vue-todo\node_modules\_webpack@4.20.2@webpack\lib\debug' @ (webpack)/lib/debug/ProfilingPlugin.js 1:11-24 @ (webpack)/lib/webpack.js @ multi ./node_modules/_webpack-dev-server@3.1.9@webpack-dev-server/client?http://0.0.0.0:8200 webpack ERROR in (webpack)/lib/node/NodeMainTemplateAsync.runtime.js Module not found: Error: Can't resolve 'fs' in 'D:\java\JetBrains\module\vue-app\vue-todo\node_modules\_webpack@4.20.2@webpack\lib\node' @ (webpack)/lib/node/NodeMainTemplateAsync.runtime.js 10:2-15 28:3-16 @ (webpack)/lib/node/NodeMainTemplatePlugin.js @ (webpack)/lib/node/NodeTemplatePlugin.js @ (webpack)/lib/webpack.js @ multi ./node_modules/_webpack-dev-server@3.1.9@webpack-dev-server/client?http://0.0.0.0:8200 webpack ERROR in (webpack)/lib/node/NodeOutputFileSystem.js Module not found: Error: Can't resolve 'fs' in 'D:\java\JetBrains\module\vue-app\vue-todo\node_modules\_webpack@4.20.2@webpack\lib\node' @ (webpack)/lib/node/NodeOutputFileSystem.js 7:11-24 @ (webpack)/lib/node/NodeEnvironmentPlugin.js @ (webpack)/lib/webpack.js @ multi ./node_modules/_webpack-dev-server@3.1.9@webpack-dev-server/client?http://0.0.0.0:8200 webpack ERROR in ./node_modules/_y18n@4.0.0@y18n/index.js Module not found: Error: Can't resolve 'fs' in 'D:\java\JetBrains\module\vue-app\vue-todo\node_modules\_y18n@4.0.0@y18n' @ ./node_modules/_y18n@4.0.0@y18n/index.js 1:9-22 @ ./node_modules/_cacache@10.0.4@cacache/lib/util/y.js @ ./node_modules/_cacache@10.0.4@cacache/locales/en.js @ ./node_modules/_cacache@10.0.4@cacache/index.js @ ./node_modules/_uglifyjs-webpack-plugin@1.3.0@uglifyjs-webpack-plugin/dist/uglify/Runner.js @ ./node_modules/_uglifyjs-webpack-plugin@1.3.0@uglifyjs-webpack-plugin/dist/index.js @ ./node_modules/_uglifyjs-webpack-plugin@1.3.0@uglifyjs-webpack-plugin/dist/cjs.js @ (webpack)/lib/WebpackOptionsDefaulter.js @ (webpack)/lib/webpack.js @ multi ./node_modules/_webpack-dev-server@3.1.9@webpack-dev-server/client?http://0.0.0.0:8200 webpack ERROR in (webpack)/lib/NormalModule.js Module not found: Error: Can't resolve 'module' in 'D:\java\JetBrains\module\vue-app\vue-todo\node_modules\_webpack@4.20.2@webpack\lib' @ (webpack)/lib/NormalModule.js 7:21-38 @ (webpack)/lib/AutomaticPrefetchPlugin.js @ (webpack)/lib/webpack.js @ multi ./node_modules/_webpack-dev-server@3.1.9@webpack-dev-server/client?http://0.0.0.0:8200 webpack ERROR in (webpack)/lib/node/NodeTargetPlugin.js Module not found: Error: Can't resolve 'module' in 'D:\java\JetBrains\module\vue-app\vue-todo\node_modules\_webpack@4.20.2@webpack\lib\node' @ (webpack)/lib/node/NodeTargetPlugin.js 11:1-18 @ (webpack)/lib/WebpackOptionsApply.js @ (webpack)/lib/webpack.js @ multi ./node_modules/_webpack-dev-server@3.1.9@webpack-dev-server/client?http://0.0.0.0:8200 webpack Child html-webpack-plugin for "index.html": 1 asset Entrypoint undefined = index.html [0] ./node_modules/_html-webpack-plugin@3.2.0@html-webpack-plugin/lib/loader.js!./node_modules/_html-webpack-plugin@3.2.0@html-webpack-plugin/default_index.ejs 392 bytes {0} [b uilt] [1] ./node_modules/_lodash@4.17.11@lodash/lodash.js 527 KiB {0} [built] [2] (webpack)/buildin/global.js 509 bytes {0} [built] [3] (webpack)/buildin/module.js 519 bytes {0} [built] i 「wdm」: Failed to compile.
webpack4 + vue2 编译.vue文件失败错误
# 提示如下的错误![图片说明](https://img-ask.csdn.net/upload/201805/04/1525424808_11411.png) 这是我有的所有的依赖 ![图片说明](https://img-ask.csdn.net/upload/201805/04/1525424879_290303.png) webpack的配置文件 ![图片说明](https://img-ask.csdn.net/upload/201805/04/1525424904_596031.png) 这个只是按照网上一个demo写的,不知道为什么编译vue的时候报错,PS:菜鸟一只,头回使用webpack 和 vue 我是想把vue文件编译到某某js中,所以和服务器上的dev不太一样 不知道为什么就是不好用
webpack如何安装,总是说webpack不是内部命令
尝试着学习webpack,但总是说webpack不是内部命令,我是这样做的(事先已经安好了node和npm): 1.先在命令行执行 npm config set prefix “d:\node\node_global”设置全局路径 2.再执行 npm install webpack -g 在node_gloal下生成文件如下图: ![图片说明](https://img-ask.csdn.net/upload/201608/07/1470552517_803506.png) 3.配置环境变量,新增NODE_PATH属性指向node_global/node_modules,并把这个路径同时添加到path里 4.新建文件夹webpackPractice,里面有两个文件 //entry.js document.write("It works."); //index.html <html> <head> <meta charset="utf-8"> </head> <body> <script type="text/javascript" src="bundle.js" charset="utf-8"></script> </body> </html> 5.用命令行把目录跳转到D:webpackTest 然后执行执行命令npm install --save-dev webpack 在这个文件夹下生成node_modules 6.执行 webpack webpack ./entry.js bundle.js 这时候就一直说 'webpack' 不是内部或外部命令,也不是可运行的程序 或批处理文件。 请教大神这怎么办啊?急急急
webpack vue.js 配置为什么会出错
为什么webpack 导入vue会出错.![图片说明](https://img-ask.csdn.net/upload/201808/07/1533614196_548680.png)![图片说明](https://img-ask.csdn.net/upload/201808/07/1533614220_224976.png)
webpack2 在打包css时,css引用图片报错
ERROR in ./src/imgs/left.png Module parse failed: C:\Users\Administrator\Desktop\test\src\imgs\left.png Unexpected character '�' (1:0) You may need an appropriate loader to handle this file type. (Source code omitted for this binary file) @ ./~/css-loader!./src/css/banner.css 6:570-597 @ ./src/css/banner.css @ ./src/js/index.js ERROR in ./src/imgs/right.png Module parse failed: C:\Users\Administrator\Desktop\test\src\imgs\right.png Unexpected character '�' (1:0) You may need an appropriate loader to handle this file type. (Source code omitted for this binary file) @ ./~/css-loader!./src/css/banner.css 6:737-765 @ ./src/css/banner.css @ ./src/js/index.js 我的webpack.config.js配置如下 var webpack=require('webpack'); module.exports={ entry:'./src/js/index.js', output:{ path:__dirname+'/bundle', filename:'[name].js' }, module: { rules: [ { test: /\.css$/, use: ['style-loader','css-loader'] }, { test:'/\.(png|jpg|gif)$/', use: [ { loader: 'url-loader', options: { name: 'assets/[name]-[hash:5].[ext]', limit: 4000 } }, 'image-webpack-loader' ] } ] } } 请问大神为什么会报那样的错误 求指教
vux配置问题,启动webpack找不到main.js
![图片说明](https://img-ask.csdn.net/upload/201712/04/1512366397_47290.png) 配置文件这样写的: ```javascript 'use strict' const path = require('path') const utils = require('./utils') const config = require('../config') const vueLoaderConfig = require('./vue-loader.conf') // 配置vux const vuxLoader = require('vux-loader') const webpackConfig = originalConfig function resolve (dir) { return path.join(__dirname, '..', dir) } const createLintingRule = () => ({ test: /\.(js|vue)$/, loader: 'eslint-loader', enforce: 'pre', include: [resolve('src'), resolve('test')], options: { formatter: require('eslint-friendly-formatter'), emitWarning: !config.dev.showEslintErrorsInOverlay } }) var originalConfig = { context: path.resolve(__dirname, '../'), entry: { app: './src/main.js' }, output: { path: config.build.assetsRoot, filename: '[name].js', publicPath: process.env.NODE_ENV === 'production' ? config.build.assetsPublicPath : config.dev.assetsPublicPath }, resolve: { extensions: ['.js', '.vue', '.json', '.less'], alias: { 'vue$': 'vue/dist/vue.esm.js', '@': resolve('src'), } }, module: { rules: [ ...(config.dev.useEslint ? [createLintingRule()] : []), { test: /\.vue$/, loader: 'vue-loader', options: vueLoaderConfig }, { test: /\.js$/, loader: 'babel-loader', include: [resolve('src'), resolve('test')] }, { test: /\.(png|jpe?g|gif|svg)(\?.*)?$/, loader: 'url-loader', options: { limit: 10000, name: utils.assetsPath('img/[name].[hash:7].[ext]') } }, { test: /\.(mp4|webm|ogg|mp3|wav|flac|aac)(\?.*)?$/, loader: 'url-loader', options: { limit: 10000, name: utils.assetsPath('media/[name].[hash:7].[ext]') } }, { test: /\.(woff2?|eot|ttf|otf)(\?.*)?$/, loader: 'url-loader', options: { limit: 10000, name: utils.assetsPath('fonts/[name].[hash:7].[ext]') } } ] }, node: { // prevent webpack from injecting useless setImmediate polyfill because Vue // source contains it (although only uses it if it's native). setImmediate: false, // prevent webpack from injecting mocks to Node native modules // that does not make sense for the client dgram: 'empty', fs: 'empty', net: 'empty', tls: 'empty', child_process: 'empty' } } module.exports = vuxLoader.merge(originalConfig, { plugins: ['vux-ui'] }) ``` 哪里出问题了?
vue-cli配合webpack搭建多页面应用,测试、打包没报错,但打开打包生成html文件就报错。
如标题所示:vue-cli配合webpack搭建多页面应用,测试、打包没报错,但打开打包生成html文件就报错。望大神指点指点。 ![图片说明](https://img-ask.csdn.net/upload/201804/15/1523795530_349133.png) csdn.net/upload/201804/15/1523795495_611472.png) ![图片说明](https://img-ask.csdn.net/upload/201804/15/1523795509_693963.png)
vue打包后iphone 5c ios10.3.3打开报错,调试时无错误. 求解决办法
### 问题描述: 公司测试小哥的苹果5c在本地调试的时候是可以打开的. 蓝后.. 打包后页面打开空白,在别的手机上表现良好.(可能安卓低版本也会报错吧) ### 环境背景及尝试过的方法: 出现问题的手机是 10.3ios版本的苹果5c 问题出现后, 我尝试加载 babel-polyfill,es6-promise但没有卵用,依旧报同样的错误 ### 相关代码 ``` main.js中 import 'babel-polyfill' import Es6Promise from 'es6-promise' require('es6-promise').polyfill() Es6Promise.polyfill() webpack.base.conf.js中也尝试过 entry: { app: ["babel-polyfill","./src/main.js"] } ``` ### 报错 1. SyntaxError: Cannot declare a let variable twice: 't'. vendor.js 2. TypeError: undefined is not an object (evaluating 'r[n].call') 各位大佬请问是我的开发方式不对吗? 寻求解决办法 .babelrc 代码 ``` { "presets": [ ["env", { "modules": false, "targets": { "browsers": ["> 1%", "last 2 versions", "not ie <= 8"] } }], "stage-2" ], "plugins": ["transform-vue-jsx", "transform-runtime"], "env": { "test": { "presets": ["env", "stage-2"], "plugins": ["istanbul"] } } } ``` webpack.base.conf.js ``` 'use strict' const path = require('path') const utils = require('./utils') const config = require('../config') const vueLoaderConfig = require('./vue-loader.conf') function resolve (dir) { return path.join(__dirname, '..', dir) } module.exports = { context: path.resolve(__dirname, '../'), entry: { app: ["./src/main.js"] }, output: { path: config.build.assetsRoot, filename: '[name].js', publicPath: process.env.NODE_ENV === 'production' ? config.build.assetsPublicPath : config.dev.assetsPublicPath }, plugins: [ new webpack.ProvidePlugin({ $: "jquery", jQuery: "jquery", "windows.jQuery": "jquery" }) ], resolve: { extensions: ['.js', '.vue', '.json'], alias: { 'vue$': 'vue/dist/vue.esm.js', '@': resolve('src'), } }, module: { rules: [ { test: /\.vue$/, loader: 'vue-loader', options: vueLoaderConfig }, { test: /\.js$/, loader: 'babel-loader', include: [resolve('src'), resolve('test'), resolve('node_modules/webpack-dev-server/client')] }, { test: /\.(png|jpe?g|gif|svg)(\?.*)?$/, loader: 'url-loader', options: { limit: 10000, name: utils.assetsPath('img/[name].[hash:7].[ext]') } }, { test: /\.(mp4|webm|ogg|mp3|wav|flac|aac)(\?.*)?$/, loader: 'url-loader', options: { limit: 10000, name: utils.assetsPath('media/[name].[hash:7].[ext]') } }, { test: /\.(woff2?|eot|ttf|otf)(\?.*)?$/, loader: 'url-loader', options: { limit: 10000, name: utils.assetsPath('fonts/[name].[hash:7].[ext]') } } ] }, node: { // prevent webpack from injecting useless setImmediate polyfill because Vue // source contains it (although only uses it if it's native). setImmediate: false, // prevent webpack from injecting mocks to Node native modules // that does not make sense for the client dgram: 'empty', fs: 'empty', net: 'empty', tls: 'empty', child_process: 'empty' } } ```
执行命令npx webpack 报错Cannot find module 'html-webpack-plugin'
安装了html-webpack-plugin也还是报这个错 把node降到8.2.1版本还是不行
webpack。因为HtmlWebpackPlugin中的模板html使用了thymeleaf报错了
我的HtmlWebpackPlugin配置是 ```new HtmlWebpackPlugin({ template: '../template/sidebars.html', filename: '../../../templates/home/sidebars.html', imagePath:'http://static.test.koolink.com/www', xhtml:true, inject: false }) ``` sidebars.html的其中一段语法是这样的 ```<div class="visiter kl-container" th:fragment="visitors (maxShow)" th:if="${not #lists.isEmpty(visitors)}"> <div class="side-title"> <span class="fb">谁看过我</span> </div> <div class="list"> <div class="user" th:each="visit, vStat : ${visitors}" th:unless="${vStat.index > maxShow}"> <a href="#" target="_blank" kl:profile="${visit.visitor}" kl:homepage="@{/}"> <img class="sider-avatar" src="/images/avatar.png" th:if="${not #strings.isEmpty(visit.visitor.link)}" kl:thumbnail="sqr72" th:src="@{${visit.visitor.link}}" th:alt="${visit.visitor.name + 'Logo'}"/> <img class="sider-avatar" src="/images/avatar.png" th:if="${#strings.isEmpty(visit.visitor.link)}" th:alt="${visit.visitor.name + 'Logo'}"/> <div class="name" > <span class="name-text con-overflow" th:text="${visit.visitor.name}"></span> <svg class="kl global-icon-verified" th:if="${visit.visitor.sign > 1}" aria-hidden="true"> <use xlink:href="#kl-certification"></use> </svg> </div> <div class="info con-overflow" th:text="${visit.visitor.title}">CEO</div> </a> </div> </div> </div> ``` 报错是这样的 ```Html Webpack Plugin: <pre> Error: Child compilation failed: Module build failed: SyntaxError: Unexpected token ILLEGAL - Function - lodash.js:14843 [js]/[lodash]/lodash.js:14843:16 - lodash.js:494 apply [js]/[lodash]/lodash.js:494:27 - lodash.js:15227 [js]/[lodash]/lodash.js:15227:16 - lodash.js:496 apply [js]/[lodash]/lodash.js:496:27 - lodash.js:6600 [js]/[lodash]/lodash.js:6600:16 - lodash.js:14842 Function.template [js]/[lodash]/lodash.js:14842:20 - SyntaxError: Unexpected token ILLEGAL - compiler.js:76 [js]/[html-webpack-plugin]/lib/compiler.js:76:16 - Compiler.js:304 [js]/[webpack]/lib/Compiler.js:304:11 - Compiler.js:520 [js]/[webpack]/lib/Compiler.js:520:14 - Tapable.js:202 next [js]/[tapable]/lib/Tapable.js:202:11 - CachePlugin.js:62 Compiler.<anonymous> [js]/[webpack]/lib/CachePlugin.js:62:5 - Tapable.js:206 Compiler.applyPluginsAsyncSeries [js]/[tapable]/lib/Tapable.js:206:13 - Compiler.js:517 [js]/[webpack]/lib/Compiler.js:517:11 - Tapable.js:195 Compilation.applyPluginsAsyncSeries [js]/[tapable]/lib/Tapable.js:195:46 - Compilation.js:671 [js]/[webpack]/lib/Compilation.js:671:19 - Tapable.js:195 Compilation.applyPluginsAsyncSeries [js]/[tapable]/lib/Tapable.js:195:46 - Compilation.js:662 [js]/[webpack]/lib/Compilation.js:662:11 - Tapable.js:202 next [js]/[tapable]/lib/Tapable.js:202:11 - index.js:244 Compilation.<anonymous> [js]/[uglifyjs-webpack-plugin]/dist/index.js:244:6 - Tapable.js:206 Compilation.applyPluginsAsyncSeries [js]/[tapable]/lib/Tapable.js:206:13 - Compilation.js:657 [js]/[webpack]/lib/Compilation.js:657:10 - Tapable.js:195 Compilation.applyPluginsAsyncSeries [js]/[tapable]/lib/Tapable.js:195:46 - Compilation.js:653 sealPart2 [js]/[webpack]/lib/Compilation.js:653:9 - Tapable.js:195 Compilation.applyPluginsAsyncSeries [js]/[tapable]/lib/Tapable.js:195:46 - Compilation.js:596 Compilation.seal [js]/[webpack]/lib/Compilation.js:596:8 - Compiler.js:514 [js]/[webpack]/lib/Compiler.js:514:17 - Tapable.js:289 [js]/[tapable]/lib/Tapable.js:289:11 - Compilation.js:498 [js]/[webpack]/lib/Compilation.js:498:11 - Compilation.js:468 [js]/[webpack]/lib/Compilation.js:468:14 </pre> ``` 请问有什么办法解决吗
终于明白阿里百度这样的大公司,为什么面试经常拿ThreadLocal考验求职者了
点击上面↑「爱开发」关注我们每晚10点,捕获技术思考和创业资源洞察什么是ThreadLocalThreadLocal是一个本地线程副本变量工具类,各个线程都拥有一份线程私有的数
win10系统安装教程(U盘PE+UEFI安装)
一、准备工作 u盘,电脑一台,win10原版镜像(msdn官网) 二、下载wepe工具箱  极力推荐微pe(微pe官方下载) 下载64位的win10 pe,使用工具箱制作启动U盘打开软件,   选择安装到U盘(按照操作无需更改) 三、重启进入pe系统   1、关机后,将U盘插入电脑 2、按下电源后,按住F12进入启动项选择(技嘉主板是F12)     选择需要启
程序员必须掌握的核心算法有哪些?
由于我之前一直强调数据结构以及算法学习的重要性,所以就有一些读者经常问我,数据结构与算法应该要学习到哪个程度呢?,说实话,这个问题我不知道要怎么回答你,主要取决于你想学习到哪些程度,不过针对这个问题,我稍微总结一下我学过的算法知识点,以及我觉得值得学习的算法。这些算法与数据结构的学习大多数是零散的,并没有一本把他们全部覆盖的书籍。下面是我觉得值得学习的一些算法以及数据结构,当然,我也会整理一些看过
《奇巧淫技》系列-python!!每天早上八点自动发送天气预报邮件到QQ邮箱
将代码部署服务器,每日早上定时获取到天气数据,并发送到邮箱。 也可以说是一个小人工智障。 思路可以运用在不同地方,主要介绍的是思路。
Nginx 软件层面加强Nginx性能优化的面试问答和解决方案
Nginx 软件层面加强Nginx性能优化的面试问答和解决方案 去年我去爱卡汽车面试PHP,一轮和二轮面的都不错,在三轮面到Nginx的时候很多问题当时不知道怎么回答,确实没有深入学习过,花了一段时间的学习,终于能解答Nginx高性能优化的问题了,10月24号为了获得程序员勋章,发布了半个优化笔记,浏览到了1000+,受到这个鼓舞,我抽时间在仔细整理下关于Nginx性能优化的问题,我们从软件说起。...
【管理系统课程设计】美少女手把手教你后台管理
【文章后台管理系统】URL设计与建模分析+项目源码+运行界面 栏目管理、文章列表、用户管理、角色管理、权限管理模块(文章最后附有源码) 1. 这是一个什么系统? 1.1 学习后台管理系统的原因 随着时代的变迁,现如今各大云服务平台横空出世,市面上有许多如学生信息系统、图书阅读系统、停车场管理系统等的管理系统,而本人家里就有人在用烟草销售系统,直接在网上完成挑选、购买与提交收货点,方便又快捷。 试想,若没有烟草销售系统,本人家人想要购买烟草,还要独自前往药...
11月19日科技资讯|华为明日发布鸿蒙整体战略;京东宣告全面向技术转型;Kotlin 1.3.60 发布
「极客头条」—— 技术人员的新闻圈! CSDN 的读者朋友们早上好哇,「极客头条」来啦,快来看今天都有哪些值得我们技术人关注的重要新闻吧。扫描上方二维码进入 CSDN App 可以收听御姐萌妹 Style 的人工版音频哟。 一分钟速览新闻点! 6G 专家组成员:速率是 5G 的 10 至 100 倍,预计 2030 年商用 雷军:很多人多次劝我放弃WPS,能坚持下来并不是纯粹的商业决定 ...
C语言魔塔游戏
很早就很想写这个,今天终于写完了。 游戏截图: 编译环境: VS2017 游戏需要一些图片,如果有想要的或者对游戏有什么看法的可以加我的QQ 2985486630 讨论,如果暂时没有回应,可以在博客下方留言,到时候我会看到。 下面我来介绍一下游戏的主要功能和实现方式 首先是玩家的定义,使用结构体,这个名字是可以自己改变的 struct gamerole { char n
化繁为简 - 腾讯计费高一致TDXA的实践之路
导语:腾讯计费是孵化于支撑腾讯内部业务千亿级营收的互联网计费平台,在如此庞大的业务体量下,腾讯计费要支撑业务的快速增长,同时还要保证每笔交易不错账。采用最终一致性或离线补...
Python爬虫爬取淘宝,京东商品信息
小编是一个理科生,不善长说一些废话。简单介绍下原理然后直接上代码。 使用的工具(Python+pycharm2019.3+selenium+xpath+chromedriver)其中要使用pycharm也可以私聊我selenium是一个框架可以通过pip下载 pip install selenium -i https://pypi.tuna.tsinghua.edu.cn/simple/ 
Java学习笔记(七十二)—— Cookie
概述 会话技术: 会话:一次会话中包含多次请求和响应 一次会话:浏览器第一次给服务器发送资源请求,会话建立,直到有一方断开为止 功能:在一次会话的范围内的多次请求间,共享数据 方式: 客户端会话技术:Cookie,把数据存储到客户端 服务器端会话技术:Session,把数据存储到服务器端 Cookie 概念:客户端会话技术,将数据存储到客户端 快速入门: 使用步骤: 创建C
阿里程序员写了一个新手都写不出的低级bug,被骂惨了。
这种新手都不会范的错,居然被一个工作好几年的小伙子写出来,差点被当场开除了。
Java工作4年来应聘要16K最后没要,细节如下。。。
前奏: 今天2B哥和大家分享一位前几天面试的一位应聘者,工作4年26岁,统招本科。 以下就是他的简历和面试情况。 基本情况: 专业技能: 1、&nbsp;熟悉Sping了解SpringMVC、SpringBoot、Mybatis等框架、了解SpringCloud微服务 2、&nbsp;熟悉常用项目管理工具:SVN、GIT、MAVEN、Jenkins 3、&nbsp;熟悉Nginx、tomca
2020年,冯唐49岁:我给20、30岁IT职场年轻人的建议
点击“技术领导力”关注∆  每天早上8:30推送 作者| Mr.K   编辑| Emma 来源| 技术领导力(ID:jishulingdaoli) 前天的推文《冯唐:职场人35岁以后,方法论比经验重要》,收到了不少读者的反馈,觉得挺受启发。其实,冯唐写了不少关于职场方面的文章,都挺不错的。可惜大家只记住了“春风十里不如你”、“如何避免成为油腻腻的中年人”等不那么正经的文章。 本文整理了冯
程序员该看的几部电影
##1、骇客帝国(1999) 概念:在线/离线,递归,循环,矩阵等 剧情简介: 不久的将来,网络黑客尼奥对这个看似正常的现实世界产生了怀疑。 他结识了黑客崔妮蒂,并见到了黑客组织的首领墨菲斯。 墨菲斯告诉他,现实世界其实是由一个名叫“母体”的计算机人工智能系统控制,人们就像他们饲养的动物,没有自由和思想,而尼奥就是能够拯救人类的救世主。 可是,救赎之路从来都不会一帆风顺,到底哪里才是真实的世界?
作为一个程序员,CPU的这些硬核知识你必须会!
CPU对每个程序员来说,是个既熟悉又陌生的东西? 如果你只知道CPU是中央处理器的话,那可能对你并没有什么用,那么作为程序员的我们,必须要搞懂的就是CPU这家伙是如何运行的,尤其要搞懂它里面的寄存器是怎么一回事,因为这将让你从底层明白程序的运行机制。 随我一起,来好好认识下CPU这货吧 把CPU掰开来看 对于CPU来说,我们首先就要搞明白它是怎么回事,也就是它的内部构造,当然,CPU那么牛的一个东
@程序员,如何花式构建线程?
作者 |曾建责编 | 郭芮出品 | CSDN(ID:CSDNnews)在项目和业务的开发中,我们难免要经常使用线程来进行业务处理,使用线程可以保证我们的业务在相互处理之间可以保证原子性...
破14亿,Python分析我国存在哪些人口危机!
2020年1月17日,国家统计局发布了2019年国民经济报告,报告中指出我国人口突破14亿。 猪哥的朋友圈被14亿人口刷屏,但是很多人并没有看到我国复杂的人口问题:老龄化、男女比例失衡、生育率下降、人口红利下降等。 今天我们就来分析一下我们国家的人口数据吧! 一、背景 1.人口突破14亿 2020年1月17日,国家统计局发布了 2019年国民经济报告 ,报告中指出:年末中国大陆总人口(包括31个
强烈推荐10本程序员在家读的书
很遗憾,这个鼠年春节注定是刻骨铭心的,新型冠状病毒让每个人的神经都是紧绷的。那些处在武汉的白衣天使们,尤其值得我们的尊敬。而我们这些窝在家里的程序员,能不外出就不外出,就是对社会做出的最大的贡献。 有些读者私下问我,窝了几天,有点颓丧,能否推荐几本书在家里看看。我花了一天的时间,挑选了 10 本我最喜欢的书,你可以挑选感兴趣的来读一读。读书不仅可以平复恐惧的压力,还可以对未来充满希望,毕竟苦难终
Linux自学篇——linux命令英文全称及解释
man: Manual 意思是手册,可以用这个命令查询其他命令的用法。 pwd:Print working directory 显示当前目录 su:Swith user 切换用户,切换到root用户 cd:Change directory 切换目录 ls:List files 列出目录下的文件 ps:Process Status 进程状态 mk
Python实战:抓肺炎疫情实时数据,画2019-nCoV疫情地图
文章目录1. 前言2. 数据下载3. 数据处理4. 数据可视化 1. 前言 今天,群里白垩老师问如何用python画武汉肺炎疫情地图。白垩老师是研究海洋生态与地球生物的学者,国家重点实验室成员,于不惑之年学习python,实为我等学习楷模。先前我并没有关注武汉肺炎的具体数据,也没有画过类似的数据分布图。于是就拿了两个小时,专门研究了一下,遂成此文。 2月6日追记:本文发布后,腾讯的数据源多次变更u
智力题(程序员面试经典)
NO.1  有20瓶药丸,其中19瓶装有1克/粒的药丸,余下一瓶装有1.1克/粒的药丸。给你一台称重精准的天平,怎么找出比较重的那瓶药丸?天平只能用一次。 解法 有时候,严格的限制条件有可能反倒是解题的线索。在这个问题中,限制条件是天平只能用一次。 因为天平只能用一次,我们也得以知道一个有趣的事实:一次必须同时称很多药丸,其实更准确地说,是必须从19瓶拿出药丸进行称重。否则,如果跳过两瓶或更多瓶药
在家远程办公效率低?那你一定要收好这个「在家办公」神器!
相信大家都已经收到国务院延长春节假期的消息,接下来,在家远程办公可能将会持续一段时间。 但是问题来了。远程办公不是人在电脑前就当坐班了,相反,对于沟通效率,文件协作,以及信息安全都有着极高的要求。有着非常多的挑战,比如: 1在异地互相不见面的会议上,如何提高沟通效率? 2文件之间的来往反馈如何做到及时性?如何保证信息安全? 3如何规划安排每天工作,以及如何进行成果验收? ......
作为一个程序员,内存和磁盘的这些事情,你不得不知道啊!!!
截止目前,我已经分享了如下几篇文章: 一个程序在计算机中是如何运行的?超级干货!!! 作为一个程序员,CPU的这些硬核知识你必须会! 作为一个程序员,内存的这些硬核知识你必须懂! 这些知识可以说是我们之前都不太重视的基础知识,可能大家在上大学的时候都学习过了,但是嘞,当时由于老师讲解的没那么有趣,又加上这些知识本身就比较枯燥,所以嘞,大家当初几乎等于没学。 再说啦,学习这些,也看不出来有什么用啊!
2020年的1月,我辞掉了我的第一份工作
其实,这篇文章,我应该早点写的,毕竟现在已经2月份了。不过一些其它原因,或者是我的惰性、还有一些迷茫的念头,让自己迟迟没有试着写一点东西,记录下,或者说是总结下自己前3年的工作上的经历、学习的过程。 我自己知道的,在写自己的博客方面,我的文笔很一般,非技术类的文章不想去写;另外我又是一个还比较热衷于技术的人,而平常复杂一点的东西,如果想写文章写的清楚点,是需要足够...
别低估自己的直觉,也别高估自己的智商
所有群全部吵翻天,朋友圈全部沦陷,公众号疯狂转发。这两周没怎么发原创,只发新闻,可能有人注意到了。我不是懒,是文章写了却没发,因为大家的关注力始终在这次的疫情上面,发了也没人看。当然,我...
Java坑人面试题系列: 包装类(中级难度)
Java Magazine上面有一个专门坑人的面试题系列: https://blogs.oracle.com/javamagazine/quiz-2。 这些问题的设计宗旨,主要是测试面试者对Java语言的了解程度,而不是为了用弯弯绕绕的手段把面试者搞蒙。 如果你看过往期的问题,就会发现每一个都不简单。 这些试题模拟了认证考试中的一些难题。 而 “中级(intermediate)” 和 “高级(ad
Spring Boot 2.x基础教程:使用JdbcTemplate访问MySQL数据库
在第2章节中,我们介绍了如何通过Spring Boot来实现HTTP接口,以及围绕HTTP接口相关的单元测试、文档生成等实用技能。但是,这些内容还不足以帮助我们构建一个动态应用的服务端程序。不论我们是要做App、小程序、还是传统的Web站点,对于用户的信息、相关业务的内容,通常都需要对其进行存储,而不是像第2章节中那样,把用户信息存储在内存中(重启就丢了!)。 对于信息的存储,现在已经有非常非常多...
基于Python的人脸自动戴口罩系统
目录 1、项目背景 2、页面设计 3、器官识别 4、退出系统 1、项目背景 2019年新型冠状病毒感染的肺炎疫情发生以来,牵动人心,举国哀痛,口罩、酒精、消毒液奇货可居。 抢不到口罩,怎么办?作为技术人今天分享如何使用Python实现自动戴口罩系统,来安慰自己,系统效果如下所示: 本系统的实现原理是借助 Dlib模块的Landmark人脸68个关键点检测库轻松识别出人脸五官
这个世界上人真的分三六九等,你信吗?
偶然间,在知乎上看到一个问题 一时间,勾起了我深深的回忆。 以前在厂里打过两次工,做过家教,干过辅导班,做过中介。零下几度的晚上,贴过广告,满脸、满手地长冻疮。   再回首那段岁月,虽然苦,但让我学会了坚持和忍耐。让我明白了,在这个世界上,无论环境多么的恶劣,只要心存希望,星星之火,亦可燎原。   下文是原回答,希望能对你能有所启发。   如果我说,这个世界上人真的分三六九等,
相关热词 c#导入fbx c#中屏蔽键盘某个键 c#正态概率密度 c#和数据库登陆界面设计 c# 高斯消去法 c# codedom c#读取cad文件文本 c# 控制全局鼠标移动 c# temp 目录 bytes初始化 c#
立即提问