xamarin 生成没有报错 真机测试出现部署异常 解决方案

图片说明

严重性 代码 说明 项目 文件 行 禁止显示状态
错误 ADB0000: Could not determine the installation path for package App1.App1. adb shell pm path App1.App1 returned ''. 0

1个回答

Csdn user default icon
上传中...
上传图片
插入图片
抄袭、复制答案,以达到刷声望分或其他目的的行为,在CSDN问答是严格禁止的,一经发现立刻封号。是时候展现真正的技术了!
其他相关推荐
Xamarin IOS 真机测试
[img=https://img-bbs.csdn.net/upload/201511/24/1448335453_466625.jpg][/img]rnrnXamarin IOS 真机测试 出现以上错误rnrnXcode 可以正常使用
android真机测试出现whitelist异常
模拟器上运行正常,连接真机进行测试,疯狂刷这个 open whitelist file error异常rn貌似百度也查不到。。求解释,什么情况rn09-27 11:00:05.826: E/IBINDER_HOOK(5880): open whitelist file errorrn09-27 11:00:07.268: E/IBINDER_HOOK(5880): open whitelist file errorrn09-27 11:00:07.269: E/IBINDER_HOOK(5880): open whitelist file errorrn09-27 11:00:07.270: E/IBINDER_HOOK(5880): open whitelist file errorrn
Xamarin Android项目真机测试闪退
Xamarin Android项目真机测试闪退Xamarin Android项目真机测试闪退
AS真机测试报错
Error running apprnInstant Run requies "Tools | Android | Enable ADB integration" to be enabledrn原本还好好的,今天跑的时候就出现这个[img=https://img-bbs.csdn.net/upload/201607/24/1469332004_838027.png][/img]rn什么原因啊
部署解决方案时报错
stsadm -o addSolution -filename QuickPart.wsprnrn用以上命令在新服务器部署时报错,但在我的电脑和其他服务器上都能正常装。。rn不知道是我那台服务器的哪里没配置好。。有遇到过这个问题的朋友帮忙解答下。rnrn错误提示:未将对象引用设置到实例
Android真机测试时ADB报错解决方案
异常代码: Unable to create Debug Bridge: Unable to start adb server: error: could not install *smartsocket* listener: cannot bind to 127.0.0.1:5037: 通常每个套接字地址(协议/网络地址/端口)只允许使用一次。 (10048) This applicat
生成解决方案报错
[img=C:\Documents and Settings\Administrator\桌面][/img][align=center][/align]rn早上360提示有系统漏洞补上漏洞后就生成解决方案是就报错。。。rnrn昨天晚上调试还可以,到了早上不知道什么原因就不行了。。。。代码一点都没改过rn在线等[align=center][/align]rn
Xamarin IOS MAC虚拟机(VisualBox5.0) 真机测试成功!
apple  开发者帐号付款后几天没消息,联系apple客服,说要上传身份证什么的。。上传了,终于搞掂。 接下来就是申请证书和绑定APP等等一系列操作(网上有教程,但都不是最新的,但能看一点英文的应该知道怎么配置,这里省略) 穷人家没有MAC,用X86安装MAC又麻烦,能直接用虚拟机+真机IPHONE6 Plus 测试就好了。 上网查资料,没什么发现。 自己试吧,我
xamarin 安卓部署错误
Android application is debugging.rnThe application could not be started. Ensure that the application has been installed to the target device and has a launchable activity (MainLauncher = true).rnrnAdditionally, check Build->Configuration Manager to ensure this project is set to Deploy for this configuration.rnrnSDK15 19 21 23都装了rn虚拟机也不行。。rn试过adb connect 还是不行..rnrn配置里arm 部署也都勾选了。。rnrn求解什么情况
iOS 真机测试报错
真机测试报错 The certificate used to sign "Hmss" has either expired or has been revoked. An updated certificate is required to sign and install the application. Signing for "XXX" requires a development team. Select a development team in the project editor. requi
jboss6部署出现sturts异常
在tomcat下都可以运行。rnjboss5也可以。rn在jboss6上部署出现rnCaused by: org.jboss.xb.binding.JBossXBException: Failed to parse source: cvc-datatype-valid.1.2.1: '2.2.3' is not a valid value for 'decimal'. @ vfszip:/E:/jboss-6.0.0.20100216-M2/server/default/deploy/test.war/WEB-INF/lib/struts2-core-2.1.8.1.jar/META-INF/struts-tags.tld[9,37]rn求高手解答
Xamarin accounts登录报错
[img=https://img-bbs.csdn.net/upload/201508/16/1439730763_197130.png][/img]rnrnrn安装完破解的xamarin之后帐号登录不上去,重启电脑也不行。
xamarin 中文枚举报错
我使用 xamarin 6.0打开一个 vs2010创建的 asp.net mvc4项目。rn我的项目中存在一些中文枚举,xamarin直接报错。rn我在官网论坛上并没有搜索到相关信息,特来请教各位大神rnrn报错如下。rn[img=https://img-bbs.csdn.net/upload/201605/17/1463459856_425624.png][/img]rnrn环境信息:rnmac osx 10.11.3rnxamarin 6.0
scapyd部署出现的问题的解决方案
1. 使用scrapyd-deploy部署时,发现spiders为0的排查,首先用 scrapy list 看一下是否可以识别 2. windows下 scrapyd-deploy无后缀文件不能启动: 解决方案一: 执行命令pip install scrapy-client,安装完成后,在虚拟环境的scripts中会出现scrapyd-deploy无后缀文件,这个scrapyd-depl
证书的生成 真机测试
主要讲述申请生成证书,下载证书,在证书下面添加设备,如何在真机上使用。
redis缓存,出现系列化异常,解决方案
1.错误日志 java.lang.IllegalArgumentException: DefaultSerializer requires a Serializable payload but received an object of type [com.example.springboot_redis_demo.been.User] 2.解决方案:实现序列化接口Serializable ...
使用elastic-job出现的异常解决方案
<dependency>     <groupId>com.dangdang</groupId>     <artifactId>elastic-job-lite-spring</artifactId>     <version>2.1.5</version> </dependency>
真机测试没有连接网络?????
我在网上下载了一个HTTPClientExample例子,在真机上测试通过,然后我自己新建了一个项目,把HTTPClientExample中的clientEngine拿过来使用,我通过一个按钮触发了一个事件,然后调用TRAPD(err, iEngine->IssueHTTPGetL(uri8));,在模拟器上测试通过,也可以访问网页,但放到真机上就不行了,这是为什么??
第一次生成解决方案是报错
问题描述:1>Rcc'ing test1.qrc... 1>系统找不到指定的路径。 解决方案:4.7.3解压后的文件应该放在C盘,否则系统找不到制定路径。
VS08生成解决方案时报错
提示错误是“无法识别的工具版本‘3.5’”rn我安装08版本的时候是自动安装了.NETframework3.5的。。。为什么识别不了呢?rn重新安装的时候也提示无法安装。,。
真机测试出现的小问题
真机测试遇到的一个小问题
真机测试出现中文乱码
这个问题,说实话,很少遇到,因为一般想象,只有出bug才会有,然后最近观摩一个项目出现了这个问题 原因: 手机端以UTF-8编码信息(包括汉字),Eclips端用GBK编码了,修改Eclipse的编码格式后问题解决,重新生成apk安装,问题得到解决
真机测试出现INSTALL_FAILED_USER_RESTRICTED安装错误
之前用小米测试的时候遇到一个问题,两个一样型号的手机一个能直接用Android Studio安装公司的项目一个却不可以,总是报INSTALL_FAILED_USER_RESTRICTED错误,具体见下图 查了许多资料,最后通过打开开发者选项里的允许通过usb安装应用解决了,不过打开这个选项需要先安装一个sim卡,之后可以拿出来。 其他机型貌似也会出现这个问题,都差不多自行解决吧
安卓真机测试出现闪退
在虚拟机上完美运行,在安卓4.0手机上也可以运行,但我用安卓5.0测试就会打不开应用,一点击就退出。
Nokia真机测试异常中的异常问题
程序中有public void update()这个函数,一运行就退出!改为updateinput()就没问题了。郁闷!第一次遇到这么BT的bug。机子是Nokia N70!!!!!!
基于vue-cl+carefree的web真机测试解决方案
背景 互联网移动端的真机测试通常是让开发人员感到非常头痛的一件事情,不仅是因为移动端测试中各个型号手机兼容性的多样性,还有测试低效的问题。传统的移动端测试流程如下: 抓包定位→开发人员修改代码→上传代码管理器→测试服务器jenkins打包构建→通过手机访问测试 乍看整个流程很连贯,但仔细分析后却极为低效,每一个细小甚微的诸如css改动都需要经过jenkins重新构建后才可以呈现在手机上...
Xamarin 安卓调试部署出错
[img=https://img-bbs.csdn.net/upload/201604/30/1461972617_433316.png][/img]rn新建helloworld项目调试,进入模拟器后程序并没有生成到模拟器内关闭模拟器就出现上述提示,但是错误信息里没有任何输出[img=https://img-bbs.csdn.net/upload/201604/30/1461972693_807256.png][/img]依赖环境如图所示应该已经齐全,运行代码分析提示[img=https://img-bbs.csdn.net/upload/201604/30/1461972735_567231.png][/img]rn以下是Xamarin诊断日志[code=text]rn[I:sdk]: Looking for Android SDK..rn[I:sdk]: Key HKCU\SOFTWARE\Novell\Mono for Android\AndroidSdkDirectory found:rn Path contains adb.exe in \platform-tools (D:\XamarinSdk\Android\android-sdk).rn[I:sdk]: Key HKLM\SOFTWARE\Novell\Mono for Android\AndroidSdkDirectory found:rn Path does not contain adb.exe in \platform-tools (C:\android-sdk-windows).rn[I:sdk]: Key HKCU\SOFTWARE\Xamarin\MonoAndroid\PrivateAndroidSdkPath not found.rn[I:sdk]: Key HKCU\SOFTWARE\Android SDK Tools\Path not found.rn[I:sdk]: Key HKLM\SOFTWARE\Android SDK Tools\Path found:rn Path does not contain adb.exe in \platform-tools (C:\Program Files (x86)\Android\android-sdk).rn[I:sdk]: Looking for Android NDK..rn[I:sdk]: Key HKCU\SOFTWARE\Novell\Mono for Android\AndroidNdkDirectory found:rn Path contains ndk-stack.exe in \. (C:\Users\admin\Documents\Android\ndk\android-ndk-r10e).rn[I:sdk]: Key HKLM\SOFTWARE\Novell\Mono for Android\AndroidNdkDirectory not found.rn[I:sdk]: Key HKCU\SOFTWARE\Novell\Mono for Android\JavaSdkDirectory not found.rn[I:sdk]: Key HKLM\SOFTWARE\Novell\Mono for Android\JavaSdkDirectory not found.rn[I:sdk]: Looking for Java 6 SDK..rn[I:sdk]: Key HKLM\SOFTWARE\JavaSoft\Java Development Kit\CurrentVersion found.rn[I:sdk]: Key HKLM\SOFTWARE\JavaSoft\Java Development Kit\1.6\JavaHome not found.rn[I:sdk]: Key HKLM\SOFTWARE\JavaSoft\Java Development Kit\1.7\JavaHome found:rn Path contains jarsigner.exe in \bin (D:\XamarinSdk\Java\jdk1.7.0_71).rn[I:Unknown]: Found Android SDK. API levels: 15, 19, 21, 22, 23rn[I:Unknown]: Found Xamarin.Android 6.0.3rn[I:sdk]: Looking for Android SDK..rn[I:sdk]: Key HKCU\SOFTWARE\Novell\Mono for Android\AndroidSdkDirectory found:rn Path contains adb.exe in \platform-tools (D:\XamarinSdk\Android\android-sdk).rn[I:sdk]: Key HKLM\SOFTWARE\Novell\Mono for Android\AndroidSdkDirectory found:rn Path does not contain adb.exe in \platform-tools (C:\android-sdk-windows).rn[I:sdk]: Key HKCU\SOFTWARE\Xamarin\MonoAndroid\PrivateAndroidSdkPath not found.rn[I:sdk]: Key HKCU\SOFTWARE\Android SDK Tools\Path not found.rn[I:sdk]: Key HKLM\SOFTWARE\Android SDK Tools\Path found:rn Path does not contain adb.exe in \platform-tools (C:\Program Files (x86)\Android\android-sdk).rn[I:sdk]: Looking for Android NDK..rn[I:sdk]: Key HKCU\SOFTWARE\Novell\Mono for Android\AndroidNdkDirectory found:rn Path contains ndk-stack.exe in \. (C:\Users\admin\Documents\Android\ndk\android-ndk-r10e).rn[I:sdk]: Key HKLM\SOFTWARE\Novell\Mono for Android\AndroidNdkDirectory not found.rn[I:Unknown]: Found Android SDK. API levels: 15, 19, 21, 22, 23rn[I:Unknown]: Found Xamarin.Android 6.0.3rn[I:sdk]: Looking for Android SDK..rn[I:sdk]: Key HKCU\SOFTWARE\Novell\Mono for Android\AndroidSdkDirectory found:rn Path contains adb.exe in \platform-tools (D:\XamarinSdk\Android\android-sdk).rn[I:sdk]: Key HKLM\SOFTWARE\Novell\Mono for Android\AndroidSdkDirectory found:rn Path does not contain adb.exe in \platform-tools (C:\android-sdk-windows).rn[I:sdk]: Key HKCU\SOFTWARE\Xamarin\MonoAndroid\PrivateAndroidSdkPath not found.rn[I:sdk]: Key HKCU\SOFTWARE\Android SDK Tools\Path not found.rn[I:sdk]: Key HKLM\SOFTWARE\Android SDK Tools\Path found:rn Path does not contain adb.exe in \platform-tools (C:\Program Files (x86)\Android\android-sdk).rn[I:sdk]: Looking for Android NDK..rn[I:sdk]: Key HKCU\SOFTWARE\Novell\Mono for Android\AndroidNdkDirectory found:rn Path contains ndk-stack.exe in \. (C:\Users\admin\Documents\Android\ndk\android-ndk-r10e).rn[I:sdk]: Key HKLM\SOFTWARE\Novell\Mono for Android\AndroidNdkDirectory not found.rn[I:sdk]: Key HKCU\SOFTWARE\Novell\Mono for Android\JavaSdkDirectory not found.rn[I:sdk]: Key HKLM\SOFTWARE\Novell\Mono for Android\JavaSdkDirectory not found.rn[I:sdk]: Looking for Java 6 SDK..rn[I:sdk]: Key HKLM\SOFTWARE\JavaSoft\Java Development Kit\CurrentVersion found.rn[I:sdk]: Key HKLM\SOFTWARE\JavaSoft\Java Development Kit\1.6\JavaHome not found.rn[I:sdk]: Key HKLM\SOFTWARE\JavaSoft\Java Development Kit\1.7\JavaHome found:rn Path contains jarsigner.exe in \bin (D:\XamarinSdk\Java\jdk1.7.0_71).rn[I:Unknown]: Found Android SDK. API levels: 15, 19, 21, 22, 23rn[I:Unknown]: Found Xamarin.Android 6.0.3rn[I:sdk]: Looking for Android SDK..rn[I:sdk]: Key HKCU\SOFTWARE\Novell\Mono for Android\AndroidSdkDirectory found:rn Path contains adb.exe in \platform-tools (D:\XamarinSdk\Android\android-sdk).rn[I:sdk]: Key HKLM\SOFTWARE\Novell\Mono for Android\AndroidSdkDirectory found:rn Path does not contain adb.exe in \platform-tools (C:\android-sdk-windows).rn[I:sdk]: Key HKCU\SOFTWARE\Xamarin\MonoAndroid\PrivateAndroidSdkPath not found.rn[I:sdk]: Key HKCU\SOFTWARE\Android SDK Tools\Path not found.rn[I:sdk]: Key HKLM\SOFTWARE\Android SDK Tools\Path found:rn Path does not contain adb.exe in \platform-tools (C:\Program Files (x86)\Android\android-sdk).rn[I:sdk]: Looking for Android NDK..rn[I:sdk]: Key HKCU\SOFTWARE\Novell\Mono for Android\AndroidNdkDirectory found:rn Path contains ndk-stack.exe in \. (C:\Users\admin\Documents\Android\ndk\android-ndk-r10e).rn[I:sdk]: Key HKLM\SOFTWARE\Novell\Mono for Android\AndroidNdkDirectory not found.rn[I:Unknown]: Found Android SDK. API levels: 15, 19, 21, 22, 23rn[I:Unknown]: Found Xamarin.Android 6.0.3rn[I:]: Tracking android devices startedrn[D:]: Tracking avd startedrn[D:]: avd watcher *.ini path: 'C:\Users\admin\.android\avd'rn[D:]: avd watcher android path: 'D:\XAMARI~1\Android\ANDROI~1\tools\android.bat'rn[D:]: TrackDeviceTask got: rn[I:]: Got new device list from adb with 0 devicesrn[D:]: avd watcher: got device list from avd with 1 devicesrnrn[/code]
android真机测试出现闪退,logcat没有报错,eventlog上出现 Must be called inside command。
android真机测试出现闪退,logcat没有报错,eventlog上出现 Must be called inside command。
安卓真机测试安装时报错
安卓真机测试安装时报错 在将程序发布到手机上时提示该错误: INSTALL_FAILED_INSUFFICIENT_STORAGE 手机内存满了...删除程序... 就可以安装了` posted @ 2016-03-15 15:48 HaoK 阅读(...) 评论(...) 编辑 收...
模拟器完美运行,真机测试报错
使用模拟器运行时,可以运行,效果很好,但使用真机测试就报错了,错误信息如下:clang: error: linker command failed with exit code 1 (use -v to see invocation)错误提示: You must rebuild it with bitcode enabled (Xcode setting ENABLE_BITCODE), obta
Android Studio2.3小米真机测试报错
* - 错误信息 * Installation failed with message Failed to establish session. It is possible that this issue is resolved by uninstalling an existing version of the apk if it is present, and then re-insta
关于Android Studio 真机测试运行时报错
目前用Android Studio工具开发安卓APP应用,在用真机运行时报错。请帮忙看看此问题如何解决。谢谢!rnrnAndroid IDE的开发工具版本为:Android Studio 2.2rn真机的Android版本信息为:Android 4.4.2rnrn报错信息详见截图rn[img=https://img-bbs.csdn.net/upload/201706/23/1498195393_640950.png][/img]
Django阿里云部署同步数据库报错解决方案
写在最前面:   在阿里云租了一台服务器,搭建了一个博客,采用的是Ubuntu+Django+uwsgi+nginx+mysql的结构。 运行了一段时间后,我发现我忘记了django自带后台的密码! 然后很常规的修改密码的操作,就是无法登陆! 然后想再创建一个超级用户,登上去看看什么情况,结果创建超级用户又报错? 可是本地环境是ok的,然后同步数据库出错。。。反正没有对的。 然后同步...
CentOS6.0部署Nagios3.4.4+PNP4(附带部分报错解决方案)
本文档详细讲解了CentOS 6.0操作系统中部署Nagios3.4.4+PNP4nagios的过程,文尾附带了部分本人在搭建的时候遇到的部分报错和解决方法。欢迎各位参考,如有不足,请提出宝贵意见。 本文来自网络,文档内容仅供参考。
异常_Eclipse下config.json文件第一行报错解决方案
如下图解决方案取消对json文件的校验:windows-preferences-Validation,然后再右边取消json校验注意,这里的validation不是一级目录json下的,这里的validation是个一级目录。                                                                         (如下图)如果还有疑问加QQ...
【吼吼】收集整理tomcat各种异常报错及解决方案。。。
2011-8-12 22:57:12 [b]【1】[/b]org.apache.catalina.loader.WebappClassLoader loadClassrn信息: [color=#FF0000]Illegal access: this web application instance has been stopped already. [/color] Could not load com.mysql.jdbc.SQLError. The eventual following stack trace is caused by an error thrown for debugging purposes as well as to attempt to terminate the thread which caused the illegal access, and has no functional impact.rnjava.lang.IllegalStateExceptionrn at org.apache.catalina.loader.WebappClassLoader.loadClass(WebappClassLoader.java:1244)rn at org.apache.catalina.loader.WebappClassLoader.loadClass(WebappClassLoader.java:1204)rn at java.lang.ClassLoader.loadClassInternal(Unknown Source)rn at com.mysql.jdbc.MysqlIO.send(MysqlIO.java:3246)rn at com.mysql.jdbc.MysqlIO.quit(MysqlIO.java:1656)rn at com.mysql.jdbc.ConnectionImpl.realClose(ConnectionImpl.java:4261)rn at com.mysql.jdbc.ConnectionImpl.cleanup(ConnectionImpl.java:1248)rn at com.mysql.jdbc.ConnectionImpl.finalize(ConnectionImpl.java:2655)rn at java.lang.ref.Finalizer.invokeFinalizeMethod(Native Method)rn at java.lang.ref.Finalizer.runFinalizer(Unknown Source)rn at java.lang.ref.Finalizer.access$100(Unknown Source)rn at java.lang.ref.Finalizer$FinalizerThread.run(Unknown Source)rn2011-8-12 22:57:15 org.apache.catalina.core.ApplicationContext logrn信息: Initializing Spring root WebApplicationContextrnlog4j:WARN No appenders could be found for logger (org.springframework.web.context.ContextLoader).rnlog4j:WARN Please initialize the log4j system properly.
attr/pivotX 和 attr/pivotY 异常报错解决方案
在项目中一个project依赖了一个library。其中app.build配置如下: 但是在library中的配置为: 然后就出现了如下的报错,其实后面各种测试,百度,网上查找才知道是这两个配置不一样引发了冲突,真他吗难找,且build都是success,没有详细的错误信息。 解决方案很简单,划线部分统一为同样配置就好了。 ...
VS2013出现没有为此解决方案配置选中要生成的项目
使用VS2013编译生成项目时有时会出现没有为此解决方案配置选中要生成的项目,如下图所示: 解决方法: 菜单->生成->配置管理器->给要生成的项目打钩 ...
真机测试出现的一个异常,肿么办呢?
12-24 13:36:36.474: E/PhonePolicy(27800): Could not preload class for phone policy: com.android.internal.policy.impl.PhoneWindow$ContextMenuCallback
iOS开发-Apple 真机测试出现了新问题
刚刚在做Apple真机测试,发现又出了新问题。 遇到这种问题我的内心是拒绝的,因为从来没有遇到,自己赶紧百度了一下 真机测试现在出现新的规定了-在7天内只能创建一个10个APP ID. 对于这个错误的解决方法就是:把你的bundle id修改成在之前7天内创建的bundle id就能再次运行了.目前只能这样了,希望有大神可以找到好的解决办法
相关热词 c# login 居中 c# 考试软件 c# 自然语言分析 c# 分段读取文件 c# 泛型反射 c#打断点 c# 时间转多少秒 c# 线程函数加参数 c# modbus 读取 c#查询集合表