python配置问题,API设置 5C

各位大神能帮我看我的python在配置时,出现了什么了问题了吗?

原本的电脑只会执行到 * Debugger PIN: 228-383-603这行就停止
新配置的电脑,会出现下面的字串

感谢

 * Serving Flask app "api" (lazy loading)
  • Environment: production WARNING: Do not use the development server in a production environment. Use a production WSGI server instead.
  • Debug mode: on
  • Restarting with stat
  • Debugger is active!
  • Debugger PIN: 228-383-603 Exception in thread Thread-1: Traceback (most recent call last): File "C:\Users\Administrator\AppData\Local\Programs\Python\Python37\lib\threading.py", line 917, in bootstrap_inner self.run() File "C:\Users\Administrator\AppData\Local\Programs\Python\Python37\lib\threading.py", line 865, in run self._target(*self._args, **self._kwargs) File "C:\Users\Administrator\AppData\Local\Programs\Python\Python37\lib\site-packages\werkzeug\serving.py", line 774, in inner fd=fd) File "C:\Users\Administrator\AppData\Local\Programs\Python\Python37\lib\site-packages\werkzeug\serving.py", line 660, in make_server passthrough_errors, ssl_context, fd=fd) File "C:\Users\Administrator\AppData\Local\Programs\Python\Python37\lib\site-packages\werkzeug\serving.py", line 577, in __init_ self.address_family), handler) File "C:\Users\Administrator\AppData\Local\Programs\Python\Python37\lib\socketserver.py", line 449, in init self.server_bind() File "C:\Users\Administrator\AppData\Local\Programs\Python\Python37\lib\http\server.py", line 139, in server_bind self.server_name = socket.getfqdn(host) File "C:\Users\Administrator\AppData\Local\Programs\Python\Python37\lib\socket.py", line 676, in getfqdn hostname, aliases, ipaddrs = gethostbyaddr(name) UnicodeDecodeError: 'utf-8' codec can't decode byte 0xc5 in position 2: invalid continuation byte

2个回答

这只是警告,你如果是开发环境,可以忽略。如果是部署到生产环境,用wsgi server代替

UnicodeDecodeError: 'utf-8' codec can't decode byte 0xc5 in position 2: invalid continuation byte
也就是说你的哪个配置文件格式错误

xingjianfengaa
xingjianfengaa 编码有问题
一年多之前 回复
Csdn user default icon
上传中...
上传图片
插入图片
抄袭、复制答案,以达到刷声望分或其他目的的行为,在CSDN问答是严格禁止的,一经发现立刻封号。是时候展现真正的技术了!
其他相关推荐
VS2015 C++编译并调用python源码API产生error LINK2019

我使用VS2015加载了python34 平台是32位Debug版本源码的相关模组块,并且设置为静态库形式后, 编译没有问题。但是,用新建的win32应用控制台程序调用其源码内的API, 编译产生错误如下: 1>------ 已启动生成: 项目: operatorPy, 配置: Debug Win32 ------ 1>python34_d.lib(posixmodule.obj) : warning LNK4049: 已导入本地定义的符号 ___pioinfo 1>python34_d.lib(sysmodule.obj) : error LNK2019: 无法解析的外部符号 __Py_hgidentifier,该符号在函数 __PySys_Init 中被引用 1>python34_d.lib(sysmodule.obj) : error LNK2019: 无法解析的外部符号 __Py_hgversion,该符号在函数 __PySys_Init 中被引用 1>python34_d.lib(getversion.obj) : error LNK2019: 无法解析的外部符号 _Py_GetBuildInfo,该符号在函数 _Py_GetVersion 中被引用 1>D:\visualstduio2015\testMfcFunc\Debug\operatorPy.exe : fatal error LNK1120: 3 个无法解析的外部命令 不知道是哪里缺少了一些步骤?

python3爬取豆瓣读书的API报错400,bad request

使用如下python代码读取配置文件中的linkLists(https://api.douban.com/v2/book/1006639),每次爬取到100条左右时就报错bad request 请教各位大神有木有遇到过这种情况,该怎么解决 import json import pymysql import random import time import urllib from urllib import request import doubans.config.linkconfig conn = pymysql.connect( user="root",password="root",database="python",charset='utf8') cur = conn.cursor() def getDetail(url): req = urllib.request.Request(url) req.add_header('User-Agent','Mozilla/5.0 (Windows NT 6.1; Win64; x64) AppleWebKit/537.36 (KHTML, like Gecko) Chrome/56.0.2924.87 Safari/537.36') try : res = urllib.request.urlopen(req) jsondata = res.read().decode("UTF-8") res.close() result = json.loads(jsondata) except urllib.error.URLError as e : print(e.reason) if ('title' in result.keys()): title = result["title"] else: title = "" if ('isbn13' in result.keys() and 'ibsn13' != ""): isbn = result["isbn13"] else: isbn = result["isbn10"] l = [] l.append([title,isbn]) sql = "INSERT INTO allbooks values(%s,%s)" cur.executemany(sql, l) conn.commit() for i in range(0,len(doubans.config.linkconfig.linkLists)): print(doubans.config.linkconfig.linkLists[i]) getDetail(doubans.config.linkconfig.linkLists[i]) time.sleep(int(format(random.randint(0, 9)))) 报错信息如下 Traceback (most recent call last): File "F:/Python/doubans/getDetail.py", line 143, in <module> getDetail(doubans.config.linkconfig.linkLists[i]) File "F:/Python/doubans/getDetail.py", line 27, in getDetail if ('title' in result.keys()): UnboundLocalError: local variable 'result' referenced before assignment Bad Request

python调用模块连接交换机(串口)

我在测试一项功能,使用python连接交换机(串口线COM口连接) 根据模块serial测试,数据无法传输到交换机,交换机也无法提供数据给电脑,求各位指导,相同的方法即可,不一定需要serial模块 想用COM口直连交换机进行配置调试,想用python,也可换其他语言

Python多线程多进程问题

新手求问,刚学习python,发现在两个线程或两个进程开启后(都有一个while循环),必须要第一个执行完成,第二个才会执行,求问为什么会这样 ``` import threading import time class Test: def run(self): threading.Thread(target=self.func1()).start() threading.Thread(target=self.func2()).start() def func1(self): count = 0 while count < 3: print("thread1") count += 1 time.sleep(2) def func2(self): count = 0 while count < 3: print("thread2") count += 1 time.sleep(1) if __name__ == "__main__": Test().run() ``` ``` import multiprocessing import time class Test: def run(self): multiprocessing.Process(target=self.func1()).start() multiprocessing.Process(target=self.func2()).start() def func1(self): count = 0 while count < 3: print("thread1") count += 1 time.sleep(2) def func2(self): count = 0 while count < 3: print("thread2") count += 1 time.sleep(1) if __name__ == "__main__": Test().run() ``` 执行结果: ``` thread1 thread1 thread1 thread2 thread2 thread2 ```

服务器怎么用Python写https响应程序

比如程序请求Https://www.example.com/getuser 然后服务器收到请求之后执行相应操作返回数据?

Java使用Jython,如何切换python项目

##Java使用Jython,如何切换python项目 ###假设C盘下有这样的目录结构(两个包含python代码的文件夹): --- 文件夹:C:/jython/p1 ![图片说明](https://img-ask.csdn.net/upload/202002/24/1582550307_868689.png) --- 文件夹:C:/jython/p2 ![图片说明](https://img-ask.csdn.net/upload/202002/24/1582551560_983207.png) --- ###我的代码:(执行结果已经在注释中) ``` public class Demo1 { public static void main(String[] args) { PySystemState sys = Py.getSystemState(); sys.path.add("C:/Jython/p1"); PythonInterpreter i1 = new PythonInterpreter(null,sys); /** * 输出: * 调用了p1/t1.m1 * 执行p1/t2完毕 */ i1.execfile("C:/Jython/p1/t2.py"); sys.path.remove(4,5);//根据下标删除C:/Jython/p1 sys.path.add("C:/Jython/p2"); PythonInterpreter i2 = new PythonInterpreter(null,sys); /** * 输出: * 调用了p1/t1.m1 * 执行p2/t2完毕 */ i1.execfile("C:/Jython/p1/t2.py"); } } ``` ###现象: 第二个输出给人的感觉就是p2中的t1.py没有被导入。 ###问题: 怎样才能让第二个输出语句输出的是调用p2/t1.m1?即让p2/t1.py覆盖原有的p1/t1.py ###我所知道: Py.getSystemState()获取到的是Python中的sys(Jython Api解释),所以应该怎样设置Python文件的目录,用什么对象/操作进行目录地址的存储???

python自动化测试环境配置成功以后的奇葩问题,求大腿

配置好环境以后启动Firefox报错提示 C:\Python27\python.exe C:/Users/jkp/PycharmProjects/untitled/hello.py Traceback (most recent call last): File "C:/Users/jkp/PycharmProjects/untitled/hello.py", line 2, in <module> b=webdriver.Firefox() File "C:\Python27\lib\site-packages\selenium\webdriver\firefox\webdriver.py", line 135, in __init__ self.service.start() File "C:\Python27\lib\site-packages\selenium\webdriver\common\service.py", line 71, in start os.path.basename(self.path), self.start_error_message) selenium.common.exceptions.WebDriverException: Message: 'geckodriver' executable needs to be in PATH. Exception AttributeError: "'Service' object has no attribute 'process'" in <bound method Service.__del__ of <selenium.webdriver.firefox.service.Service object at 0x02538F50>> ignored Process finished with exit code 1 启动谷歌浏览器打不开网址

用windows api能否让本程序不受win10的布局缩放影响?

在学pywin32。 想截取整个屏幕显示在窗口里。 但由于布局缩放的关系,窗口里的图片会过大,导致整个屏幕只能显示1/4。 用StretchBlt的话,又会导致图片失真,变模糊。 有没有办法阻止本程序被缩放?谢谢。

PCL在vs2017下的配置问题(win10)

所有东西都配置好了 下了一个例子,运行后出现下面的错误。 ![图片说明](https://img-ask.csdn.net/upload/201812/11/1544512993_588664.png)![图片说明](https://img-ask.csdn.net/upload/201812/11/1544513004_46551.png)![图片说明](https://img-ask.csdn.net/upload/201812/11/1544513008_453195.png)![图片说明](https://img-ask.csdn.net/upload/201812/11/1544513021_128519.png) 弄了好久了都没有弄好 请各位大神指点一下 小弟不胜感激 方便的话 可以加一下 QQ 1931425626

使用MailGun API发送邮件报错

求助,Java开发,配置好了MailGun,使用API发送邮件的时候,返回来提示,from参数错误 ``` { "message": "'from' parameter is missing" } ``` 我的from参数格式写法如下: ``` jsonObject.put("from", "xxx@xxx.com"); jsonObject.put("to", "xxx@xxx.com"); ``` 请问这个写法的格式是怎样的。 谢谢。

windows上用python如何执行sql文件或者sql语句

在windows上用python如何执行sql文件或者sql语句(不存在db api情况下) 求大神指点 或者是windows上如何可以跳转到db2上执行命令 sql 语句如下: db2 connect to schema user userid password password load client from dir of del modified by type.... connect reset 如何在不存在db2 api的情况下执行 跪谢~~~

Android Studio如何配置环境变量

想请教一下,用Android Studio开发时,需要配置ANDROID_SDK_HOME环境变量吗?我设置的是sdk文件夹所在的路径: ``` C:\Users\acer\AppData\Local\Android\sdk ``` 有没有错呢?或者说是否需要配置呢?因为当我启动模拟器或者启动手机编译的时候,会有提示信息: ``` Waiting for device. C:\Users\acer\AppData\Local\Android\sdk\tools\emulator.exe -avd Nexus_5_API_21_x86 -netspeed full -netdelay none ``` 以及gradle console的报错信息: ``` FAILURE: Build failed with an exception. * What went wrong: Execution failed for task ':app:preDexDebug'. > com.android.ide.common.internal.LoggedErrorException: Failed to run command: C:\Users\acer\AppData\Local\Android\sdk\build-tools\21.1.1\dx.bat --dex --output C:\Users\acer\AndroidStudioProjects\AndroidTutorial\app\build\intermediates\pre-dexed\debug\classes-88c274548bdbb2cca7c59c342ef8955f7e09092a.jar C:\Users\acer\AndroidStudioProjects\AndroidTutorial\app\build\intermediates\exploded-aar\com.android.support\support-v4\21.0.3\classes.jar Error Code: 255 Output: 'reg' 不是内部或外部命令,也不是可运行的程序 或批处理文件。 ```

为GOOGLE_APPLICATION_CREDENTIALS设置凭据的替代方法

<div class="post-text" itemprop="text"> <p>I've a Go app that uses the <em>Google Vision API</em> and <em>Google Video intelligence</em> API. To enter my credentials, I set the environment variable called <code>GOOGLE_APPLICATION_CREDENTIALS</code>. To do so, I assign a file path to this variable that points to the directory where my credentials are stored in.</p> <p><em>Problem:</em></p> <p>My credentials are <em>not</em> initially saved in a file. Instead they are assigned to a string variable inside my app. As a workaround, I store that value to a temporary file and then assign it's path to <code>GOOGLE_APPLICATION_CREDENTIALS</code>, like described above.</p> <p><em>Question:</em></p> <p>Is it possible to set API credentials for <code>cloud.google.com/go/vision/apiv1</code> without this file?</p> </div>

Python anaconda jupyter

各位大神为什么我在Ubuntu下安装完anaconda后不能使用jupyter notebook啊?![图片说明](http://img.bbs.csdn.net/upload/201611/28/1480263901_788042.png)

利用twitter api爬取twitter数据有哪些限制?

利用twitter提供的API来爬取twitter数据都有那些限制啊?例如之前每个用户限制一个小时150次可是现在貌似没有这个限制了,不过限速,小弟初学,想请教下,这样爬取twitter数据的官方限制都具体有哪些?

python3.7使用pip安装dlib失败,已使用pip安装cmake和boost

下面是错误代码 Looking in indexes: https://pypi.tuna.tsinghua.edu.cn/simple Collecting dlib Using cached https://pypi.tuna.tsinghua.edu.cn/packages/63/92/05c3b98636661cb80d190a5a777dd94effcc14c0f6893222e5ca81e74fbc/dlib-19.19.0.tar.gz (3.2 MB) Building wheels for collected packages: dlib Building wheel for dlib (setup.py) ... error ERROR: Command errored out with exit status 1: command: 'd:\python\python37\python.exe' -u -c 'import sys, setuptools, tokenize; sys.argv[0] = '"'"'C:\\Users\\Ray\\AppData\\Local\\Temp\\pip-install-adkry0ue\\dlib\\setup.py'"'"'; __file__='"'"'C:\\Users\\Ray\\AppData\\Local\\Temp\\pip-install-adkry0ue\\dlib\\setup.py'"'"';f=getattr(tokenize, '"'"'open'"'"', open)(__file__);code=f.read().replace('"'"'\r\n'"'"', '"'"'\n'"'"');f.close();exec(compile(code, __file__, '"'"'exec'"'"'))' bdist_wheel -d 'C:\Users\Ray\AppData\Local\Temp\pip-wheel-s_easgnt' cwd: C:\Users\Ray\AppData\Local\Temp\pip-install-adkry0ue\dlib\ Complete output (149 lines): running bdist_wheel running build running build_py package init file 'dlib\__init__.py' not found (or not a regular file) running build_ext Building extension for Python 3.7.6 (tags/v3.7.6:43364a7ae0, Dec 19 2019, 00:42:30) [MSC v.1916 64 bit (AMD64)] Invoking CMake setup: 'cmake C:\Users\Ray\AppData\Local\Temp\pip-install-adkry0ue\dlib\tools\python -DCMAKE_LIBRARY_OUTPUT_DIRECTORY=C:\Users\Ray\AppData\Local\Temp\pip-install-adkry0ue\dlib\build\lib.win-amd64-3.7 -DPYTHON_EXECUTABLE=d:\python\python37\python.exe -DCMAKE_LIBRARY_OUTPUT_DIRECTORY_RELEASE=C:\Users\Ray\AppData\Local\Temp\pip-install-adkry0ue\dlib\build\lib.win-amd64-3.7 -A x64' -- Building for: Visual Studio 15 2017 -- The C compiler identification is MSVC 19.16.27034.0 -- The CXX compiler identification is MSVC 19.16.27034.0 -- Check for working C compiler: D:/Microsoft Visual Studio/2017/Community/VC/Tools/MSVC/14.16.27023/bin/Hostx86/x64/cl.exe -- Check for working C compiler: D:/Microsoft Visual Studio/2017/Community/VC/Tools/MSVC/14.16.27023/bin/Hostx86/x64/cl.exe -- works -- Detecting C compiler ABI info -- Detecting C compiler ABI info - done -- Detecting C compile features -- Detecting C compile features - done -- Check for working CXX compiler: D:/Microsoft Visual Studio/2017/Community/VC/Tools/MSVC/14.16.27023/bin/Hostx86/x64/cl.exe -- Check for working CXX compiler: D:/Microsoft Visual Studio/2017/Community/VC/Tools/MSVC/14.16.27023/bin/Hostx86/x64/cl.exe -- works -- Detecting CXX compiler ABI info -- Detecting CXX compiler ABI info - done -- Detecting CXX compile features -- Detecting CXX compile features - done -- Found PythonInterp: D:/Python/Python37/python.exe (found version "3.7.6") -- Found PythonLibs: D:/Python/Python37/libs/Python37.lib -- pybind11 v2.2.2 -- Using CMake version: 3.16.3 -- Compiling dlib version: 19.19.0 -- SSE4 instructions can be executed by the host processor. -- AVX instructions can be executed by the host processor. -- Looking for sys/types.h -- Looking for sys/types.h - found -- Looking for stdint.h -- Looking for stdint.h - found -- Looking for stddef.h -- Looking for stddef.h - found -- Check size of void* -- Check size of void* - done -- Enabling AVX instructions -- Searching for BLAS and LAPACK -- Searching for BLAS and LAPACK -- Looking for pthread.h -- Looking for pthread.h - not found -- Found Threads: TRUE CUDA_TOOLKIT_ROOT_DIR not found or specified -- Could NOT find CUDA (missing: CUDA_TOOLKIT_ROOT_DIR CUDA_NVCC_EXECUTABLE CUDA_INCLUDE_DIRS CUDA_CUDART_LIBRARY) (Required is at least version "7.5") -- DID NOT FIND CUDA -- Disabling CUDA support for dlib. DLIB WILL NOT USE CUDA -- C++11 activated. -- Configuring done -- Generating done -- Build files have been written to: C:/Users/Ray/AppData/Local/Temp/pip-install-adkry0ue/dlib/build/temp.win-amd64-3.7/Release Invoking CMake build: 'cmake --build . --config Release -- /m' 用于 .NET Framework 的 Microsoft (R) 生成引擎版本 15.9.21+g9802d43bc3 版权所有(C) Microsoft Corporation。保留所有权利。 D:\Microsoft Visual Studio\2017\Community\Common7\IDE\VC\VCTargets\Microsoft.CppBuild.targets(399,5): warning MSB8029: 中间目录或输出目录无法驻留在临时目录 下,因为这可能会导致增量生成出现问题。 [C:\Users\Ray\AppData\Local\Temp\pip-install-adkry0ue\dlib\build\temp.win-amd64-3.7\Release\ZERO_CHECK.vcxproj] Checking Build System D:\Microsoft Visual Studio\2017\Community\Common7\IDE\VC\VCTargets\Microsoft.CppBuild.targets(399,5): warning MSB8029: 中间目录或输出目录无法驻留在临时目录 下,因为这可能会导致增量生成出现问题。 [C:\Users\Ray\AppData\Local\Temp\pip-install-adkry0ue\dlib\build\temp.win-amd64-3.7\Release\dlib_build\dlib.vcxproj] Building Custom Rule C:/Users/Ray/AppData/Local/Temp/pip-install-adkry0ue/dlib/dlib/CMakeLists.txt base64_kernel_1.cpp bigint_kernel_1.cpp bigint_kernel_2.cpp bit_stream_kernel_1.cpp entropy_decoder_kernel_1.cpp entropy_decoder_kernel_2.cpp entropy_encoder_kernel_1.cpp entropy_encoder_kernel_2.cpp md5_kernel_1.cpp tokenizer_kernel_1.cpp unicode.cpp image_dataset_metadata.cpp mnist.cpp global_function_search.cpp kalman_filter.cpp test_for_odr_violations.cpp auto.cpp sockets_kernel_1.cpp c:\users\ray\appdata\local\temp\pip-install-adkry0ue\dlib\dlib\sockets\../dlib_basic_cpp_build_tutorial.txt(1): fatal error C1189: #error: "Don't write #include <dlib/all/source.cpp> in your code." (编译源文件 C:\Users\Ray\AppData\Local\Temp\pip-install-adkry0ue\dlib\dlib\sockets\sockets_kernel_1.cpp) [C:\Users\Ray\AppData\Local\Temp\pip-install-adkry0ue\dlib\build\temp.win-amd64-3.7\Release\dlib_build\dlib.vcxproj] bsp.cpp dir_nav_kernel_1.cpp dir_nav_kernel_2.cpp dir_nav_extensions.cpp linker_kernel_1.cpp extra_logger_headers.cpp logger_kernel_1.cpp logger_config_file.cpp misc_api_kernel_1.cpp misc_api_kernel_2.cpp sockets_extensions.cpp sockets_kernel_2.cpp sockstreambuf.cpp sockstreambuf_unbuffered.cpp server_kernel.cpp server_iostream.cpp server_http.cpp multithreaded_object_extension.cpp threaded_object_extension.cpp threads_kernel_1.cpp threads_kernel_2.cpp threads_kernel_shared.cpp thread_pool_extension.cpp async.cpp timer.cpp stack_trace.cpp cpu_dlib.cpp tensor_tools.cpp fonts.cpp widgets.cpp drawable.cpp canvas_drawing.cpp style.cpp base_widgets.cpp gui_core_kernel_1.cpp gui_core_kernel_2.cpp png_loader.cpp save_png.cpp jpeg_loader.cpp save_jpeg.cpp Traceback (most recent call last): File "<string>", line 1, in <module> File "C:\Users\Ray\AppData\Local\Temp\pip-install-adkry0ue\dlib\setup.py", line 261, in <module> 'Topic :: Software Development', File "d:\python\python37\lib\site-packages\setuptools\__init__.py", line 145, in setup return distutils.core.setup(**attrs) File "d:\python\python37\lib\distutils\core.py", line 148, in setup dist.run_commands() File "d:\python\python37\lib\distutils\dist.py", line 966, in run_commands self.run_command(cmd) File "d:\python\python37\lib\distutils\dist.py", line 985, in run_command cmd_obj.run() File "d:\python\python37\lib\site-packages\wheel\bdist_wheel.py", line 223, in run self.run_command('build') File "d:\python\python37\lib\distutils\cmd.py", line 313, in run_command self.distribution.run_command(command) File "d:\python\python37\lib\distutils\dist.py", line 985, in run_command cmd_obj.run() File "d:\python\python37\lib\distutils\command\build.py", line 135, in run self.run_command(cmd_name) File "d:\python\python37\lib\distutils\cmd.py", line 313, in run_command self.distribution.run_command(command) File "d:\python\python37\lib\distutils\dist.py", line 985, in run_command cmd_obj.run() File "C:\Users\Ray\AppData\Local\Temp\pip-install-adkry0ue\dlib\setup.py", line 135, in run self.build_extension(ext) File "C:\Users\Ray\AppData\Local\Temp\pip-install-adkry0ue\dlib\setup.py", line 175, in build_extension subprocess.check_call(cmake_build, cwd=build_folder) File "d:\python\python37\lib\subprocess.py", line 363, in check_call raise CalledProcessError(retcode, cmd) subprocess.CalledProcessError: Command '['cmake', '--build', '.', '--config', 'Release', '--', '/m']' returned non-zero exit status 1. ---------------------------------------- ERROR: Failed building wheel for dlib Running setup.py clean for dlib Failed to build dlib Installing collected packages: dlib Running setup.py install for dlib ... error ERROR: Command errored out with exit status 1: command: 'd:\python\python37\python.exe' -u -c 'import sys, setuptools, tokenize; sys.argv[0] = '"'"'C:\\Users\\Ray\\AppData\\Local\\Temp\\pip-install-adkry0ue\\dlib\\setup.py'"'"'; __file__='"'"'C:\\Users\\Ray\\AppData\\Local\\Temp\\pip-install-adkry0ue\\dlib\\setup.py'"'"';f=getattr(tokenize, '"'"'open'"'"', open)(__file__);code=f.read().replace('"'"'\r\n'"'"', '"'"'\n'"'"');f.close();exec(compile(code, __file__, '"'"'exec'"'"'))' install --record 'C:\Users\Ray\AppData\Local\Temp\pip-record-70rug5ub\install-record.txt' --single-version-externally-managed --compile --install-headers 'd:\python\python37\Include\dlib' cwd: C:\Users\Ray\AppData\Local\Temp\pip-install-adkry0ue\dlib\ Complete output (151 lines): running install running build running build_py package init file 'dlib\__init__.py' not found (or not a regular file) running build_ext Building extension for Python 3.7.6 (tags/v3.7.6:43364a7ae0, Dec 19 2019, 00:42:30) [MSC v.1916 64 bit (AMD64)] Invoking CMake setup: 'cmake C:\Users\Ray\AppData\Local\Temp\pip-install-adkry0ue\dlib\tools\python -DCMAKE_LIBRARY_OUTPUT_DIRECTORY=C:\Users\Ray\AppData\Local\Temp\pip-install-adkry0ue\dlib\build\lib.win-amd64-3.7 -DPYTHON_EXECUTABLE=d:\python\python37\python.exe -DCMAKE_LIBRARY_OUTPUT_DIRECTORY_RELEASE=C:\Users\Ray\AppData\Local\Temp\pip-install-adkry0ue\dlib\build\lib.win-amd64-3.7 -A x64' -- Building for: Visual Studio 15 2017 -- The C compiler identification is MSVC 19.16.27034.0 -- The CXX compiler identification is MSVC 19.16.27034.0 -- Check for working C compiler: D:/Microsoft Visual Studio/2017/Community/VC/Tools/MSVC/14.16.27023/bin/Hostx86/x64/cl.exe -- Check for working C compiler: D:/Microsoft Visual Studio/2017/Community/VC/Tools/MSVC/14.16.27023/bin/Hostx86/x64/cl.exe -- works -- Detecting C compiler ABI info -- Detecting C compiler ABI info - done -- Detecting C compile features -- Detecting C compile features - done -- Check for working CXX compiler: D:/Microsoft Visual Studio/2017/Community/VC/Tools/MSVC/14.16.27023/bin/Hostx86/x64/cl.exe -- Check for working CXX compiler: D:/Microsoft Visual Studio/2017/Community/VC/Tools/MSVC/14.16.27023/bin/Hostx86/x64/cl.exe -- works -- Detecting CXX compiler ABI info -- Detecting CXX compiler ABI info - done -- Detecting CXX compile features -- Detecting CXX compile features - done -- Found PythonInterp: D:/Python/Python37/python.exe (found version "3.7.6") -- Found PythonLibs: D:/Python/Python37/libs/Python37.lib -- pybind11 v2.2.2 -- Using CMake version: 3.16.3 -- Compiling dlib version: 19.19.0 -- SSE4 instructions can be executed by the host processor. -- AVX instructions can be executed by the host processor. -- Looking for sys/types.h -- Looking for sys/types.h - found -- Looking for stdint.h -- Looking for stdint.h - found -- Looking for stddef.h -- Looking for stddef.h - found -- Check size of void* -- Check size of void* - done -- Enabling AVX instructions -- Searching for BLAS and LAPACK -- Searching for BLAS and LAPACK -- Looking for pthread.h -- Looking for pthread.h - not found -- Found Threads: TRUE CUDA_TOOLKIT_ROOT_DIR not found or specified -- Could NOT find CUDA (missing: CUDA_TOOLKIT_ROOT_DIR CUDA_NVCC_EXECUTABLE CUDA_INCLUDE_DIRS CUDA_CUDART_LIBRARY) (Required is at least version "7.5") -- DID NOT FIND CUDA -- Disabling CUDA support for dlib. DLIB WILL NOT USE CUDA -- C++11 activated. -- Configuring done -- Generating done -- Build files have been written to: C:/Users/Ray/AppData/Local/Temp/pip-install-adkry0ue/dlib/build/temp.win-amd64-3.7/Release Invoking CMake build: 'cmake --build . --config Release -- /m' 用于 .NET Framework 的 Microsoft (R) 生成引擎版本 15.9.21+g9802d43bc3 版权所有(C) Microsoft Corporation。保留所有权利。 D:\Microsoft Visual Studio\2017\Community\Common7\IDE\VC\VCTargets\Microsoft.CppBuild.targets(399,5): warning MSB8029: 中间目录或输出目录无法驻留在临时目 录下,因为这可能会导致增量生成出现问题。 [C:\Users\Ray\AppData\Local\Temp\pip-install-adkry0ue\dlib\build\temp.win-amd64-3.7\Release\ZERO_CHECK.vcxproj] Checking Build System D:\Microsoft Visual Studio\2017\Community\Common7\IDE\VC\VCTargets\Microsoft.CppBuild.targets(399,5): warning MSB8029: 中间目录或输出目录无法驻留在临时目 录下,因为这可能会导致增量生成出现问题。 [C:\Users\Ray\AppData\Local\Temp\pip-install-adkry0ue\dlib\build\temp.win-amd64-3.7\Release\dlib_build\dlib.vcxproj] Building Custom Rule C:/Users/Ray/AppData/Local/Temp/pip-install-adkry0ue/dlib/dlib/CMakeLists.txt base64_kernel_1.cpp bigint_kernel_1.cpp bigint_kernel_2.cpp bit_stream_kernel_1.cpp entropy_decoder_kernel_1.cpp entropy_decoder_kernel_2.cpp entropy_encoder_kernel_1.cpp entropy_encoder_kernel_2.cpp md5_kernel_1.cpp tokenizer_kernel_1.cpp unicode.cpp image_dataset_metadata.cpp mnist.cpp global_function_search.cpp kalman_filter.cpp test_for_odr_violations.cpp auto.cpp sockets_kernel_1.cpp c:\users\ray\appdata\local\temp\pip-install-adkry0ue\dlib\dlib\sockets\../dlib_basic_cpp_build_tutorial.txt(1): fatal error C1189: #error: "Don't write #include <dlib/all/source.cpp> in your code." (编译源文件 C:\Users\Ray\AppData\Local\Temp\pip-install-adkry0ue\dlib\dlib\sockets\sockets_kernel_1.cpp) [C:\Users\Ray\AppData\Local\Temp\pip-install-adkry0ue\dlib\build\temp.win-amd64-3.7\Release\dlib_build\dlib.vcxproj] bsp.cpp dir_nav_kernel_1.cpp dir_nav_kernel_2.cpp dir_nav_extensions.cpp linker_kernel_1.cpp extra_logger_headers.cpp logger_kernel_1.cpp logger_config_file.cpp misc_api_kernel_1.cpp misc_api_kernel_2.cpp sockets_extensions.cpp sockets_kernel_2.cpp sockstreambuf.cpp sockstreambuf_unbuffered.cpp server_kernel.cpp server_iostream.cpp server_http.cpp multithreaded_object_extension.cpp threaded_object_extension.cpp threads_kernel_1.cpp threads_kernel_2.cpp threads_kernel_shared.cpp thread_pool_extension.cpp async.cpp timer.cpp stack_trace.cpp cpu_dlib.cpp tensor_tools.cpp fonts.cpp widgets.cpp drawable.cpp canvas_drawing.cpp style.cpp base_widgets.cpp gui_core_kernel_1.cpp gui_core_kernel_2.cpp png_loader.cpp save_png.cpp jpeg_loader.cpp save_jpeg.cpp Traceback (most recent call last): File "<string>", line 1, in <module> File "C:\Users\Ray\AppData\Local\Temp\pip-install-adkry0ue\dlib\setup.py", line 261, in <module> 'Topic :: Software Development', File "d:\python\python37\lib\site-packages\setuptools\__init__.py", line 145, in setup return distutils.core.setup(**attrs) File "d:\python\python37\lib\distutils\core.py", line 148, in setup dist.run_commands() File "d:\python\python37\lib\distutils\dist.py", line 966, in run_commands self.run_command(cmd) File "d:\python\python37\lib\distutils\dist.py", line 985, in run_command cmd_obj.run() File "d:\python\python37\lib\site-packages\setuptools\command\install.py", line 61, in run return orig.install.run(self) File "d:\python\python37\lib\distutils\command\install.py", line 545, in run self.run_command('build') File "d:\python\python37\lib\distutils\cmd.py", line 313, in run_command self.distribution.run_command(command) File "d:\python\python37\lib\distutils\dist.py", line 985, in run_command cmd_obj.run() File "d:\python\python37\lib\distutils\command\build.py", line 135, in run self.run_command(cmd_name) File "d:\python\python37\lib\distutils\cmd.py", line 313, in run_command self.distribution.run_command(command) File "d:\python\python37\lib\distutils\dist.py", line 985, in run_command cmd_obj.run() File "C:\Users\Ray\AppData\Local\Temp\pip-install-adkry0ue\dlib\setup.py", line 135, in run self.build_extension(ext) File "C:\Users\Ray\AppData\Local\Temp\pip-install-adkry0ue\dlib\setup.py", line 175, in build_extension subprocess.check_call(cmake_build, cwd=build_folder) File "d:\python\python37\lib\subprocess.py", line 363, in check_call raise CalledProcessError(retcode, cmd) subprocess.CalledProcessError: Command '['cmake', '--build', '.', '--config', 'Release', '--', '/m']' returned non-zero exit status 1. ---------------------------------------- ERROR: Command errored out with exit status 1: 'd:\python\python37\python.exe' -u -c 'import sys, setuptools, tokenize; sys.argv[0] = '"'"'C:\\Users\\Ray\\AppData\\Local\\Temp\\pip-install-adkry0ue\\dlib\\setup.py'"'"'; __file__='"'"'C:\\Users\\Ray\\AppData\\Local\\Temp\\pip-install-adkry0ue\\dlib\\setup.py'"'"';f=getattr(tokenize, '"'"'open'"'"', open)(__file__);code=f.read().replace('"'"'\r\n'"'"', '"'"'\n'"'"');f.close();exec(compile(code, __file__, '"'"'exec'"'"'))' install --record 'C:\Users\Ray\AppData\Local\Temp\pip-record-70rug5ub\install-record.txt' --single-version-externally-managed --compile --install-headers 'd:\python\python37\Include\dlib' Check the logs for full command output.

mysql cluster 问题,mysqld(api)连不上

数据库肯定是跑起来了,应该是配置问题,贴一下 my.cnf ``` [mysqld] basedir =/usr/local/mysql datadir =/usr/local/mysql/data user = mysql port =3306 ndbcluster ndb-connectstring=server [mysql_cluster] ndb-connectstring=server ``` config.ini ``` [NDBD DEFAULT] NoOfReplicas=1 #每个数据节点的镜像数量 DataMemory=500M #每个数据节点中给数据分配的内存 IndexMemory=300M #每个数据节点中给索引分配的内存 [TCP DEFAULT] portnumber=2202 #数据节点的默认连接端口 [NDB_MGMD] hostname=server datadir=/var/lib/mysql-cluster/ [NDBD] hostname=client1 datadir=/usr/local/mysql/data/ [NDBD] hostname=client2 datadir=/usr/local/mysql/data/ [MYSQLD] hostname=client1 [MYSQLD] hostname=client2 ``` 另外听说启动的顺序必须是,管理节点,数据节点,sql节点,然而因为我的mysqld是开机自启的,每次都是service mysqld stop,然后再分别打开管理节点,数据节点,mysql,结果就是连接不上,请问是怎么回事,谢谢 ``` Connected to Management Server at: server:1186 Cluster Configuration --------------------- [ndbd(NDB)] 2 node(s) id=2 @192.168.1.103 (mysql-5.6.34 ndb-7.4.13, starting, Nodegroup: 0) id=3 (not connected, accepting connect from client2) [ndb_mgmd(MGM)] 1 node(s) id=1 @192.168.1.103 (mysql-5.6.34 ndb-7.4.13) [mysqld(API)] 2 node(s) id=4 (not connected, accepting connect from client1) id=5 (not connected, accepting connect from client2) ```

有没有办法在 Android 上运行 Python? [打烊]

<div class="post-text" itemprop="text"> <p>We are working on an <a href="http://en.wikipedia.org/wiki/S60_%28software_platform%29" rel="noreferrer">S60</a> version and this platform has a nice Python API. </p> <p>However, there is nothing official about Python on Android, but since <a href="http://en.wikipedia.org/wiki/Jython" rel="noreferrer">Jython</a> exists, is there a way to let the snake and the robot work together?</p> </div> <p>转载于:https://stackoverflow.com/questions/101754/is-there-a-way-to-run-python-on-android</p>

pycharm上面简单的python代码运行报错怎么解决?貌似是pycharm的环境没有配置好,跪求大神指点!

各位大神好: 本人是一枚python初学者,最近在练习编码的时候用的是pycharm,同样写了一段简单的代码,就是把两个表格进行拼接合并,pandas库也进行了安装,写好之后,在pycharm上运行,一堆报错的,但是在其他程序上代码是可以正常运行的,感觉像是哪的环境没有搭配好。 自己也尝试了百度搜索答案,在pycharm里面配置了本地的python程序,可是还是不行。期望各位大神和老师有空了能给些指点!非常感谢了。 ![图片说明](https://img-ask.csdn.net/upload/201906/25/1561425967_103879.png) 代码如下: #data1和data2两个表格进行拼接合并 import pandas as pd data1 = pd.read_excel( r"C:\Users\cui\Desktop\测试\2\客户资金对帐2019601-20190619_001.xlsx", sheet_name=0, header=0, dtype='str') data2 = pd.read_excel( r"C:\Users\cui\Desktop\测试\2\客户资金对帐2019601-20190619_002.xlsx", sheet_name=0, header=0, dtype='str') data3 = pd.concat([data1, data2]) data3.to_excel(excel_writer=r"C:\Users\cui\Desktop\测试\汇总输出\huizong.xlsx") ``` ![图片说明](https://img-ask.csdn.net/upload/201906/25/1561425996_709591.png) 报错的代码如下:报错的内容比写的代码都长 Python 3.7.0 (v3.7.0:1bf9cc5093, Jun 27 2018, 04:06:47) [MSC v.1914 32 bit (Intel)] on win32 runfile('C:/Users/cui/PycharmProjects/untitled/ceshi1.py', wdir='C:/Users/cui/PycharmProjects/untitled') Traceback (most recent call last): File "<input>", line 1, in <module> File "C:\Program Files\JetBrains\PyCharm 2019.1.3\helpers\pydev\_pydev_bundle\pydev_umd.py", line 197, in runfile pydev_imports.execfile(filename, global_vars, local_vars) # execute the script File "C:\Program Files\JetBrains\PyCharm 2019.1.3\helpers\pydev\_pydev_imps\_pydev_execfile.py", line 18, in execfile exec(compile(contents+"\n", file, 'exec'), glob, loc) File "C:/Users/cui/PycharmProjects/untitled/ceshi1.py", line 2, in <module> import pandas as pd File "C:\Program Files\JetBrains\PyCharm 2019.1.3\helpers\pydev\_pydev_bundle\pydev_import_hook.py", line 21, in do_import module = self._system_import(name, *args, **kwargs) File "C:\Users\cui\.virtualenvs\untitled\lib\site-packages\pandas\__init__.py", line 42, in <module> from pandas.core.api import * File "C:\Program Files\JetBrains\PyCharm 2019.1.3\helpers\pydev\_pydev_bundle\pydev_import_hook.py", line 21, in do_import module = self._system_import(name, *args, **kwargs) File "C:\Users\cui\.virtualenvs\untitled\lib\site-packages\pandas\core\api.py", line 7, in <module> from pandas.core.arrays.integer import ( File "C:\Program Files\JetBrains\PyCharm 2019.1.3\helpers\pydev\_pydev_bundle\pydev_import_hook.py", line 21, in do_import module = self._system_import(name, *args, **kwargs) File "C:\Users\cui\.virtualenvs\untitled\lib\site-packages\pandas\core\arrays\__init__.py", line 2, in <module> from .base import (ExtensionArray, # noqa File "C:\Program Files\JetBrains\PyCharm 2019.1.3\helpers\pydev\_pydev_bundle\pydev_import_hook.py", line 21, in do_import module = self._system_import(name, *args, **kwargs) File "C:\Users\cui\.virtualenvs\untitled\lib\site-packages\pandas\core\arrays\base.py", line 21, in <module> from pandas.core import ops File "C:\Program Files\JetBrains\PyCharm 2019.1.3\helpers\pydev\_pydev_bundle\pydev_import_hook.py", line 21, in do_import module = self._system_import(name, *args, **kwargs) File "C:\Users\cui\.virtualenvs\untitled\lib\site-packages\pandas\core\ops.py", line 16, in <module> from pandas._libs import algos as libalgos, lib, ops as libops ImportError: cannot import name 'ops' from 'pandas._libs' (C:\Users\cui\.virtualenvs\untitled\lib\site-packages\pandas\_libs\__init__.py) ``` ![图片说明](https://img-ask.csdn.net/upload/201906/25/1561426121_610768.png) ![图片说明](https://img-ask.csdn.net/upload/201906/25/1561426201_516230.png)

在中国程序员是青春饭吗?

今年,我也32了 ,为了不给大家误导,咨询了猎头、圈内好友,以及年过35岁的几位老程序员……舍了老脸去揭人家伤疤……希望能给大家以帮助,记得帮我点赞哦。 目录: 你以为的人生 一次又一次的伤害 猎头界的真相 如何应对互联网行业的「中年危机」 一、你以为的人生 刚入行时,拿着傲人的工资,想着好好干,以为我们的人生是这样的: 等真到了那一天,你会发现,你的人生很可能是这样的: ...

技术大佬:我去,你写的 switch 语句也太老土了吧

昨天早上通过远程的方式 review 了两名新来同事的代码,大部分代码都写得很漂亮,严谨的同时注释也很到位,这令我非常满意。但当我看到他们当中有一个人写的 switch 语句时,还是忍不住破口大骂:“我擦,小王,你丫写的 switch 语句也太老土了吧!” 来看看小王写的代码吧,看完不要骂我装逼啊。 private static String createPlayer(PlayerTypes p...

华为初面+综合面试(Java技术面)附上面试题

华为面试整体流程大致分为笔试,性格测试,面试,综合面试,回学校等结果。笔试来说,华为的难度较中等,选择题难度和网易腾讯差不多。最后的代码题,相比下来就简单很多,一共3道题目,前2题很容易就AC,题目已经记不太清楚,不过难度确实不大。最后一题最后提交的代码过了75%的样例,一直没有发现剩下的25%可能存在什么坑。 笔试部分太久远,我就不怎么回忆了。直接将面试。 面试 如果说腾讯的面试是挥金如土...

和黑客斗争的 6 天!

互联网公司工作,很难避免不和黑客们打交道,我呆过的两家互联网公司,几乎每月每天每分钟都有黑客在公司网站上扫描。有的是寻找 Sql 注入的缺口,有的是寻找线上服务器可能存在的漏洞,大部分都...

讲一个程序员如何副业月赚三万的真实故事

loonggg读完需要3分钟速读仅需 1 分钟大家好,我是你们的校长。我之前讲过,这年头,只要肯动脑,肯行动,程序员凭借自己的技术,赚钱的方式还是有很多种的。仅仅靠在公司出卖自己的劳动时...

win10暴力查看wifi密码

刚才邻居打了个电话说:喂小灰,你家wifi的密码是多少,我怎么连不上了。 我。。。 我也忘了哎,就找到了一个好办法,分享给大家: 第一种情况:已经连接上的wifi,怎么知道密码? 打开:控制面板\网络和 Internet\网络连接 然后右击wifi连接的无线网卡,选择状态 然后像下图一样: 第二种情况:前提是我不知道啊,但是我以前知道密码。 此时可以利用dos命令了 1、利用netsh wlan...

上班一个月,后悔当初着急入职的选择了

最近有个老铁,告诉我说,上班一个月,后悔当初着急入职现在公司了。他之前在美图做手机研发,今年美图那边今年也有一波组织优化调整,他是其中一个,在协商离职后,当时捉急找工作上班,因为有房贷供着,不能没有收入来源。所以匆忙选了一家公司,实际上是一个大型外包公司,主要派遣给其他手机厂商做外包项目。**当时承诺待遇还不错,所以就立马入职去上班了。但是后面入职后,发现薪酬待遇这块并不是HR所说那样,那个HR自...

总结了 150 余个神奇网站,你不来瞅瞅吗?

原博客再更新,可能就没了,之后将持续更新本篇博客。

副业收入是我做程序媛的3倍,工作外的B面人生是怎样的?

提到“程序员”,多数人脑海里首先想到的大约是:为人木讷、薪水超高、工作枯燥…… 然而,当离开工作岗位,撕去层层标签,脱下“程序员”这身外套,有的人生动又有趣,马上展现出了完全不同的A/B面人生! 不论是简单的爱好,还是正经的副业,他们都干得同样出色。偶尔,还能和程序员的特质结合,产生奇妙的“化学反应”。 @Charlotte:平日素颜示人,周末美妆博主 大家都以为程序媛也个个不修边幅,但我们也许...

如果你是老板,你会不会踢了这样的员工?

有个好朋友ZS,是技术总监,昨天问我:“有一个老下属,跟了我很多年,做事勤勤恳恳,主动性也很好。但随着公司的发展,他的进步速度,跟不上团队的步伐了,有点...

我入职阿里后,才知道原来简历这么写

私下里,有不少读者问我:“二哥,如何才能写出一份专业的技术简历呢?我总感觉自己写的简历太烂了,所以投了无数份,都石沉大海了。”说实话,我自己好多年没有写过简历了,但我认识的一个同行,他在阿里,给我说了一些他当年写简历的方法论,我感觉太牛逼了,实在是忍不住,就分享了出来,希望能够帮助到你。 01、简历的本质 作为简历的撰写者,你必须要搞清楚一点,简历的本质是什么,它就是为了来销售你的价值主张的。往深...

带了6个月的徒弟当了面试官,而身为高级工程师的我天天修Bug......

即将毕业的应届毕业生一枚,现在只拿到了两家offer,但最近听到一些消息,其中一个offer,我这个组据说客户很少,很有可能整组被裁掉。 想问大家: 如果我刚入职这个组就被裁了怎么办呢? 大家都是什么时候知道自己要被裁了的? 面试软技能指导: BQ/Project/Resume 试听内容: 除了刷题,还有哪些技能是拿到offer不可或缺的要素 如何提升面试软实力:简历, 行为面试,沟通能...

!大部分程序员只会写3年代码

如果世界上都是这种不思进取的软件公司,那别说大部分程序员只会写 3 年代码,恐怕就没有程序员这种职业。

离职半年了,老东家又发 offer,回不回?

有小伙伴问松哥这个问题,他在上海某公司,在离职了几个月后,前公司的领导联系到他,希望他能够返聘回去,他很纠结要不要回去? 俗话说好马不吃回头草,但是这个小伙伴既然感到纠结了,我觉得至少说明了两个问题:1.曾经的公司还不错;2.现在的日子也不是很如意。否则应该就不会纠结了。 老实说,松哥之前也有过类似的经历,今天就来和小伙伴们聊聊回头草到底吃不吃。 首先一个基本观点,就是离职了也没必要和老东家弄的苦...

HTTP与HTTPS的区别

面试官问HTTP与HTTPS的区别,我这样回答让他竖起大拇指!

程序员毕业去大公司好还是小公司好?

虽然大公司并不是人人都能进,但我仍建议还未毕业的同学,尽力地通过校招向大公司挤,但凡挤进去,你这一生会容易很多。 大公司哪里好?没能进大公司怎么办?答案都在这里了,记得帮我点赞哦。 目录: 技术氛围 内部晋升与跳槽 啥也没学会,公司倒闭了? 不同的人脉圈,注定会有不同的结果 没能去大厂怎么办? 一、技术氛围 纵观整个程序员技术领域,哪个在行业有所名气的大牛,不是在大厂? 而且众所...

程序员为什么千万不要瞎努力?

本文作者用对比非常鲜明的两个开发团队的故事,讲解了敏捷开发之道 —— 如果你的团队缺乏统一标准的环境,那么即使勤劳努力,不仅会极其耗时而且成果甚微,使用...

为什么程序员做外包会被瞧不起?

二哥,有个事想询问下您的意见,您觉得应届生值得去外包吗?公司虽然挺大的,中xx,但待遇感觉挺低,马上要报到,挺纠结的。

当HR压你价,说你只值7K,你该怎么回答?

当HR压你价,说你只值7K时,你可以流畅地回答,记住,是流畅,不能犹豫。 礼貌地说:“7K是吗?了解了。嗯~其实我对贵司的面试官印象很好。只不过,现在我的手头上已经有一份11K的offer。来面试,主要也是自己对贵司挺有兴趣的,所以过来看看……”(未完) 这段话主要是陪HR互诈的同时,从公司兴趣,公司职员印象上,都给予对方正面的肯定,既能提升HR的好感度,又能让谈判气氛融洽,为后面的发挥留足空间。...

面试:第十六章:Java中级开发(16k)

HashMap底层实现原理,红黑树,B+树,B树的结构原理 Spring的AOP和IOC是什么?它们常见的使用场景有哪些?Spring事务,事务的属性,传播行为,数据库隔离级别 Spring和SpringMVC,MyBatis以及SpringBoot的注解分别有哪些?SpringMVC的工作原理,SpringBoot框架的优点,MyBatis框架的优点 SpringCould组件有哪些,他们...

面试阿里p7,被按在地上摩擦,鬼知道我经历了什么?

面试阿里p7被问到的问题(当时我只知道第一个):@Conditional是做什么的?@Conditional多个条件是什么逻辑关系?条件判断在什么时候执...

终于懂了TCP和UDP协议区别

终于懂了TCP和UDP协议区别

Python爬虫,高清美图我全都要(彼岸桌面壁纸)

爬取彼岸桌面网站较为简单,用到了requests、lxml、Beautiful Soup4

无代码时代来临,程序员如何保住饭碗?

编程语言层出不穷,从最初的机器语言到如今2500种以上的高级语言,程序员们大呼“学到头秃”。程序员一边面临编程语言不断推陈出新,一边面临由于许多代码已存在,程序员编写新应用程序时存在重复“搬砖”的现象。 无代码/低代码编程应运而生。无代码/低代码是一种创建应用的方法,它可以让开发者使用最少的编码知识来快速开发应用程序。开发者通过图形界面中,可视化建模来组装和配置应用程序。这样一来,开发者直...

面试了一个 31 岁程序员,让我有所触动,30岁以上的程序员该何去何从?

最近面试了一个31岁8年经验的程序猿,让我有点感慨,大龄程序猿该何去何从。

大三实习生,字节跳动面经分享,已拿Offer

说实话,自己的算法,我一个不会,太难了吧

程序员垃圾简历长什么样?

已经连续五年参加大厂校招、社招的技术面试工作,简历看的不下于万份 这篇文章会用实例告诉你,什么是差的程序员简历! 疫情快要结束了,各个公司也都开始春招了,作为即将红遍大江南北的新晋UP主,那当然要为小伙伴们做点事(手动狗头)。 就在公众号里公开征简历,义务帮大家看,并一一点评。《启舰:春招在即,义务帮大家看看简历吧》 一石激起千层浪,三天收到两百多封简历。 花光了两个星期的所有空闲时...

美团面试,问了ThreadLocal原理,这个回答让我通过了

他想都想不到,ThreadLocal我烂熟于心

大牛都会用的IDEA调试技巧!!!

导读 前天面试了一个985高校的实习生,问了他平时用什么开发工具,他想也没想的说IDEA,于是我抛砖引玉的问了一下IDEA的调试用过吧,你说说怎么设置断点...

面试官:你连SSO都不懂,就别来面试了

大厂竟然要考我SSO,卧槽。

立即提问
相关内容推荐