将项目发布到was上 发现监听过滤的时候 request.getServletPath()为空 请问是什么问题引起的? 300C

图片说明本地获取的是正常的 !本地用的weblogic 部署的
图片说明 部署到was上 服务器上获取就是少了index.jsp
图片说明
这是我配置
图片说明
这是我的目录树
感谢大神的提点

4个回答

本地和打包之后的路径会变化的 如果要不变 放在static或者resource中

大概was给webapp挂了filter了,你换个方法拿拿看:

 String path = request.getRequestURI().substring(request.getContextPath().length());

新增个回避方法看看:

         <servlet>
                <servlet-name>FileServlet</servlet-name>
                <servlet-class>
                        com.ibm.ws.webcontainer.servlet.SimpleFileServlet
                </servlet-class>
                <load-on-startup>1</load-on-startup>
        </servlet>

        <servlet-mapping>
                <servlet-name>FileServlet</servlet-name>
                <url-pattern>*.jsp</url-pattern>
        </servlet-mapping>

或者你urlpattern不要用/*,只去map你感兴趣的模式

xiaomad
xiaomad 回复xhd1611: 我查了下网上有人说WAS这种做法反倒是符合规范的(困惑)。那恐怕只有两条路了,要么hack或者侵入was的代码,要么自己map到所有可能的url上如*.jsp,*.html,*.css,*.js。。。
大约一年之前 回复
xhd1611
神奇两点半 回复xiaomad: 我试了加你那个回避方法 访问报错403禁止访问 应该是将*.jsp设置成禁止访问了 如果按照你说的 在fifter改成其他的 那我就无法监听过滤所有请求
大约一年之前 回复
xiaomad
xiaomad 回复xhd1611: 那你的filter是map到/*上了吗?试试看加个不起什么作用的filter看看,比如我新增的回复内容那样
大约一年之前 回复
xhd1611
神奇两点半 我服务器上request.getRequestURI() 获取到的是 /SunAMS
大约一年之前 回复
public void doFilter(ServletRequest servletRequest, ServletResponse servletResponse, FilterChain filterChain)
        throws IOException, ServletException {
    try {
        HttpServletRequest request = (HttpServletRequest) servletRequest;
        String url = request.getServletPath();
        }
        filterChain.doFilter(request, response);
    } catch (Exception e) {
        // TODO Auto-generated catch block
        e.printStackTrace();
   }
}

你试试我这种方式,我以前记得也是本地可以,发布到服务器上不行.是调用错了。

xhd1611
神奇两点半 回复feng2147685: 能提供方法已经很感谢了
大约一年之前 回复
feng2147685
皮卡丘踢球 回复xhd1611: 因为是在WAS上发布,我觉得你重心可以偏向找基础环境问题。没帮到你比较遗憾、、、
大约一年之前 回复
feng2147685
皮卡丘踢球 回复xhd1611: 嗯,首先,代码是不可能错的.都是这么用的。
大约一年之前 回复
xhd1611
神奇两点半 你可以看我上一个提问
大约一年之前 回复
xhd1611
神奇两点半 我代码就是这么写的
大约一年之前 回复

可能是web.xml的servlet-mapping配置引起的,不同的url-pattern配置会使request.getServletPath()的返回值不同

Csdn user default icon
上传中...
上传图片
插入图片
抄袭、复制答案,以达到刷声望分或其他目的的行为,在CSDN问答是严格禁止的,一经发现立刻封号。是时候展现真正的技术了!
其他相关推荐
项目发布到was上 登录监听的时候 没有获取到 request.getServletPath()取值 该怎么解决?
![图片说明](https://img-ask.csdn.net/upload/201811/01/1541039640_165933.png)代码是这样 但是项目放到websphere 没获取到访问路径 放在本地weblogic上 是能获取到登录地址的
问个有关django+heroku的问题
``` Traceback (most recent call last): File "/app/.heroku/python/lib/python3.6/site-packages/django/db/backends/utils.py", line 64, in execute return self.cursor.execute(sql, params) psycopg2.errors.UndefinedTable: relation "auth_user" does not exist LINE 1: ...user"."is_active", "auth_user"."date_joined" FROM "auth_user... The above exception was the direct cause of the following exception: Traceback (most recent call last): File "manage.py", line 10, in <module> execute_from_command_line(sys.argv) File "/app/.heroku/python/lib/python3.6/site-packages/django/core/management/__init__.py", line 351, in execute_from_command_line utility.execute() File "/app/.heroku/python/lib/python3.6/site-packages/django/core/management/__init__.py", line 325, in execute django.setup() File "/app/.heroku/python/lib/python3.6/site-packages/django/__init__.py", line 18, in setup apps.populate(settings.INSTALLED_APPS) File "/app/.heroku/python/lib/python3.6/site-packages/django/apps/registry.py", line 108, in populate app_config.import_models(all_models) File "/app/.heroku/python/lib/python3.6/site-packages/django/apps/config.py", line 198, in import_models self.models_module = import_module(models_module_name) File "/app/.heroku/python/lib/python3.6/importlib/__init__.py", line 126, in import_module return _bootstrap._gcd_import(name[level:], package, level) File "<frozen importlib._bootstrap>", line 978, in _gcd_import File "<frozen importlib._bootstrap>", line 961, in _find_and_load File "<frozen importlib._bootstrap>", line 950, in _find_and_load_unlocked File "<frozen importlib._bootstrap>", line 655, in _load_unlocked File "<frozen importlib._bootstrap_external>", line 678, in exec_module File "<frozen importlib._bootstrap>", line 205, in _call_with_frames_removed File "/app/learning_logs/models.py", line 7, in <module> class Topic(models.Model): File "/app/learning_logs/models.py", line 8, in Topic choices=Help().choices() File "/app/learning_logs/help.py", line 9, in choices for user in users: File "/app/.heroku/python/lib/python3.6/site-packages/django/db/models/query.py", line 162, in __iter__ self._fetch_all() File "/app/.heroku/python/lib/python3.6/site-packages/django/db/models/query.py", line 965, in _fetch_all self._result_cache = list(self.iterator()) File "/app/.heroku/python/lib/python3.6/site-packages/django/db/models/query.py", line 238, in iterator results = compiler.execute_sql() File "/app/.heroku/python/lib/python3.6/site-packages/django/db/models/sql/compiler.py", line 840, in execute_sql cursor.execute(sql, params) File "/app/.heroku/python/lib/python3.6/site-packages/django/db/backends/utils.py", line 64, in execute return self.cursor.execute(sql, params) File "/app/.heroku/python/lib/python3.6/site-packages/django/db/utils.py", line 97, in __exit__ six.reraise(dj_exc_type, dj_exc_value, traceback) File "/app/.heroku/python/lib/python3.6/site-packages/django/utils/six.py", line 658, in reraise raise value.with_traceback(tb) File "/app/.heroku/python/lib/python3.6/site-packages/django/db/backends/utils.py", line 64, in execute return self.cursor.execute(sql, params) django.db.utils.ProgrammingError: relation "auth_user" does not exist LINE 1: ...user"."is_active", "auth_user"."date_joined" FROM "auth_user... ``` 在heroku bash操作makemigrations,migrate中出现的错误 在本地用这些没问题 settings.py ``` """ Django settings for learning_log project. Generated by 'django-admin startproject' using Django 1.8.5. For more information on this file, see https://docs.djangoproject.com/en/1.8/topics/settings/ For the full list of settings and their values, see https://docs.djangoproject.com/en/1.8/ref/settings/ """ # Build paths inside the project like this: os.path.join(BASE_DIR, ...) import os import django_heroku BASE_DIR = os.path.dirname(os.path.dirname(os.path.abspath(__file__))) # Quick-start development settings - unsuitable for production # See https://docs.djangoproject.com/en/1.8/howto/deployment/checklist/ # SECURITY WARNING: keep the secret key used in production secret! SECRET_KEY = 'o47!#$sbu_&=)pnbk63ra!hjbx@+pc=2j42cf(&mx82&hs&ph_' # SECURITY WARNING: don't run with debug turned on in production! DEBUG = True ALLOWED_HOSTS = [] # Application definition INSTALLED_APPS = ( 'whitenoise.runserver_nostatic', 'django.contrib.admin', 'django.contrib.auth', 'django.contrib.contenttypes', 'django.contrib.sessions', 'django.contrib.messages', 'django.contrib.staticfiles', #my app 'learning_logs', 'users', #other app 'bootstrap3', ) MIDDLEWARE = [ 'django.middleware.clickjacking.XFrameOptionsMiddleware', 'whitenoise.middleware.WhiteNoiseMiddleware', ] MIDDLEWARE_CLASSES = ( 'django.contrib.sessions.middleware.SessionMiddleware', 'django.middleware.common.CommonMiddleware', 'django.middleware.csrf.CsrfViewMiddleware', 'django.contrib.auth.middleware.AuthenticationMiddleware', 'django.contrib.auth.middleware.SessionAuthenticationMiddleware', 'django.contrib.messages.middleware.MessageMiddleware', 'django.middleware.clickjacking.XFrameOptionsMiddleware', 'django.middleware.security.SecurityMiddleware', ) ROOT_URLCONF = 'learning_log.urls' TEMPLATES = [ { 'BACKEND': 'django.template.backends.django.DjangoTemplates', 'DIRS': [], 'APP_DIRS': True, 'OPTIONS': { 'context_processors': [ 'django.template.context_processors.debug', 'django.template.context_processors.request', 'django.contrib.auth.context_processors.auth', 'django.contrib.messages.context_processors.messages', ], }, }, ] WSGI_APPLICATION = 'learning_log.wsgi.application' # Database # https://docs.djangoproject.com/en/1.8/ref/settings/#databases DATABASES = { 'default': { 'ENGINE': 'django.db.backends.sqlite3', 'NAME': os.path.join(BASE_DIR, 'db.sqlite3'), } } # Internationalization # https://docs.djangoproject.com/en/1.8/topics/i18n/ LANGUAGE_CODE = 'en-us' TIME_ZONE = 'UTC' USE_I18N = True USE_L10N = True USE_TZ = True LOGIN_URL = '/users/login/' # Static files (CSS, JavaScript, Images) # https://docs.djangoproject.com/en/1.8/howto/static-files/ STATIC_URL = '/static/' MEDIA_URL = '/media/' MEDIA_ROOT = os.path.join(BASE_DIR, 'media') STATIC_ROOT = os.path.join(BASE_DIR, 'staticfiles') if os.getenv('DATABASE_URL') is not None: import dj_database_url DATABASES['default'] = dj_database_url.config() SECURE_PROXY_SSL_HEADER = ('HTTP_X_FORWARDED_PROTO', 'https') ALLOWED_HOSTS = ['stark-anchorage-08076.herokuapp.com'] DEBUG = False BASE_DIR = os.path.dirname(os.path.abspath(__file__)) STATICFILES_DIRS = ( os.path.join(BASE_DIR, 'static'), ) django_heroku.settings(locals()) ``` views.py ``` from django.shortcuts import render from .models import Topic, Entry, Root, Suf_Pre_fix from django.http import HttpResponseRedirect, Http404 from django.core.urlresolvers import reverse from .forms import TopicForm, EntryForm, RootForm from django.contrib.auth.decorators import login_required from .help import Help from django.contrib.auth.models import User # Create your views here. def index(request): return render(request, 'learning_logs/index.html') @login_required def topics(request): topics = Topic.objects.order_by('date_added') context = {'topics': topics} return render(request, 'learning_logs/topics.html', context) @login_required def topic(request, topic_id): topic = Topic.objects.get(id=topic_id) entries = topic.entry_set.order_by('-date_added') context = {'topic': topic,'entries': entries} return render(request, 'learning_logs/topic.html', context) @login_required def new_topic(request): if request.method != 'POST': form = TopicForm() else: form = TopicForm(request.POST) if form.is_valid(): new_topic = form.save(commit=False) new_topic.owner = request.user new_topic.edit_able = request.POST.getlist("edit_able") new_topic.save() return HttpResponseRedirect(reverse('learning_logs:topics')) context = {'form': form, 'users':Help().users()} return render(request, 'learning_logs/new_topic.html', context) @login_required def new_entry(request, topic_id): topic = Topic.objects.get(id=topic_id) if request.method != 'POST': form = EntryForm() else: form = EntryForm(data=request.POST) if form.is_valid(): new_entry = form.save(commit=False) new_entry.topic = topic new_entry.edit_able = request.POST.getlist("edit_able") new_entry.save() return HttpResponseRedirect(reverse('learning_logs:topic',args=[topic_id])) context = {'topic':topic, 'form': form, 'users':Help().users()} return render(request, 'learning_logs/new_entry.html', context) @login_required def edit_entry(request, entry_id): entry = Entry.objects.get(id=entry_id) topic = entry.topic if not Help().check_user(request.user,entry.edit_able) or not Help().check_user(request.user,topic.edit_able): raise Http404 if request.method != 'POST': form = EntryForm(instance=entry) else: form = EntryForm(instance=entry, data=request.POST) if form.is_valid(): edit_entry = form.save(commit=False) edit_entry.edit_able = request.POST.getlist("edit_able") edit_entry.save() return HttpResponseRedirect(reverse('learning_logs:topic',args=[topic.id])) context = {'entry': entry, 'topic': topic, 'form': form ,'users':Help().users()} return render(request, 'learning_logs/edit_entry.html', context) @login_required def roots(request): roots = Root.objects.order_by('date_added') context = {'roots': roots} return render(request, 'learning_logs/roots.html', context) def root(request, root_id): root = Root.objects.get(id=root_id) things = root.things.order_by('-date_added') context = {'root':root, 'things':things} return render(request, 'learning_logs/root.html', context) ``` help.py ``` from django.contrib.auth.models import User class Help(): def __init__(self): pass def choices(self): users=User.objects.all() choices=[] a=1 for user in users: choices.append((a,str(user))) a+=1 return choices def check_user(self,user,users): try: str(users).index(str(user)) except: return False else: return True def users(self): users=[] for user in User.objects.all(): users.append(str(user)) return users def test_list(self,list1): for item in list1: print(type(item)) def test_word(self,item): print(item,type(item)) ```
请各位大佬看看???
``` Traceback (most recent call last): File "/app/.heroku/python/lib/python3.6/site-packages/django/db/backends/utils.py", line 64, in execute return self.cursor.execute(sql, params) psycopg2.errors.UndefinedTable: relation "auth_user" does not exist LINE 1: ...user"."is_active", "auth_user"."date_joined" FROM "auth_user... The above exception was the direct cause of the following exception: Traceback (most recent call last): File "manage.py", line 10, in <module> execute_from_command_line(sys.argv) File "/app/.heroku/python/lib/python3.6/site-packages/django/core/management/__init__.py", line 351, in execute_from_command_line utility.execute() File "/app/.heroku/python/lib/python3.6/site-packages/django/core/management/__init__.py", line 325, in execute django.setup() File "/app/.heroku/python/lib/python3.6/site-packages/django/__init__.py", line 18, in setup apps.populate(settings.INSTALLED_APPS) File "/app/.heroku/python/lib/python3.6/site-packages/django/apps/registry.py", line 108, in populate app_config.import_models(all_models) File "/app/.heroku/python/lib/python3.6/site-packages/django/apps/config.py", line 198, in import_models self.models_module = import_module(models_module_name) File "/app/.heroku/python/lib/python3.6/importlib/__init__.py", line 126, in import_module return _bootstrap._gcd_import(name[level:], package, level) File "<frozen importlib._bootstrap>", line 978, in _gcd_import File "<frozen importlib._bootstrap>", line 961, in _find_and_load File "<frozen importlib._bootstrap>", line 950, in _find_and_load_unlocked File "<frozen importlib._bootstrap>", line 655, in _load_unlocked File "<frozen importlib._bootstrap_external>", line 678, in exec_module File "<frozen importlib._bootstrap>", line 205, in _call_with_frames_removed File "/app/learning_logs/models.py", line 7, in <module> class Topic(models.Model): File "/app/learning_logs/models.py", line 8, in Topic choices=Help().choices() File "/app/learning_logs/help.py", line 9, in choices for user in users: File "/app/.heroku/python/lib/python3.6/site-packages/django/db/models/query.py", line 162, in __iter__ self._fetch_all() File "/app/.heroku/python/lib/python3.6/site-packages/django/db/models/query.py", line 965, in _fetch_all self._result_cache = list(self.iterator()) File "/app/.heroku/python/lib/python3.6/site-packages/django/db/models/query.py", line 238, in iterator results = compiler.execute_sql() File "/app/.heroku/python/lib/python3.6/site-packages/django/db/models/sql/compiler.py", line 840, in execute_sql cursor.execute(sql, params) File "/app/.heroku/python/lib/python3.6/site-packages/django/db/backends/utils.py", line 64, in execute return self.cursor.execute(sql, params) File "/app/.heroku/python/lib/python3.6/site-packages/django/db/utils.py", line 97, in __exit__ six.reraise(dj_exc_type, dj_exc_value, traceback) File "/app/.heroku/python/lib/python3.6/site-packages/django/utils/six.py", line 658, in reraise raise value.with_traceback(tb) File "/app/.heroku/python/lib/python3.6/site-packages/django/db/backends/utils.py", line 64, in execute return self.cursor.execute(sql, params) django.db.utils.ProgrammingError: relation "auth_user" does not exist LINE 1: ...user"."is_active", "auth_user"."date_joined" FROM "auth_user... ``` 在heroku bash操作makemigrations,migrate中出现的错误 在本地用这些没问题 settings.py ``` """ Django settings for learning_log project. Generated by 'django-admin startproject' using Django 1.8.5. For more information on this file, see https://docs.djangoproject.com/en/1.8/topics/settings/ For the full list of settings and their values, see https://docs.djangoproject.com/en/1.8/ref/settings/ """ # Build paths inside the project like this: os.path.join(BASE_DIR, ...) import os import django_heroku BASE_DIR = os.path.dirname(os.path.dirname(os.path.abspath(__file__))) # Quick-start development settings - unsuitable for production # See https://docs.djangoproject.com/en/1.8/howto/deployment/checklist/ # SECURITY WARNING: keep the secret key used in production secret! SECRET_KEY = 'o47!#$sbu_&=)pnbk63ra!hjbx@+pc=2j42cf(&mx82&hs&ph_' # SECURITY WARNING: don't run with debug turned on in production! DEBUG = True ALLOWED_HOSTS = [] # Application definition INSTALLED_APPS = ( 'whitenoise.runserver_nostatic', 'django.contrib.admin', 'django.contrib.auth', 'django.contrib.contenttypes', 'django.contrib.sessions', 'django.contrib.messages', 'django.contrib.staticfiles', #my app 'learning_logs', 'users', #other app 'bootstrap3', ) MIDDLEWARE = [ 'django.middleware.clickjacking.XFrameOptionsMiddleware', 'whitenoise.middleware.WhiteNoiseMiddleware', ] MIDDLEWARE_CLASSES = ( 'django.contrib.sessions.middleware.SessionMiddleware', 'django.middleware.common.CommonMiddleware', 'django.middleware.csrf.CsrfViewMiddleware', 'django.contrib.auth.middleware.AuthenticationMiddleware', 'django.contrib.auth.middleware.SessionAuthenticationMiddleware', 'django.contrib.messages.middleware.MessageMiddleware', 'django.middleware.clickjacking.XFrameOptionsMiddleware', 'django.middleware.security.SecurityMiddleware', ) ROOT_URLCONF = 'learning_log.urls' TEMPLATES = [ { 'BACKEND': 'django.template.backends.django.DjangoTemplates', 'DIRS': [], 'APP_DIRS': True, 'OPTIONS': { 'context_processors': [ 'django.template.context_processors.debug', 'django.template.context_processors.request', 'django.contrib.auth.context_processors.auth', 'django.contrib.messages.context_processors.messages', ], }, }, ] WSGI_APPLICATION = 'learning_log.wsgi.application' # Database # https://docs.djangoproject.com/en/1.8/ref/settings/#databases DATABASES = { 'default': { 'ENGINE': 'django.db.backends.sqlite3', 'NAME': os.path.join(BASE_DIR, 'db.sqlite3'), } } # Internationalization # https://docs.djangoproject.com/en/1.8/topics/i18n/ LANGUAGE_CODE = 'en-us' TIME_ZONE = 'UTC' USE_I18N = True USE_L10N = True USE_TZ = True LOGIN_URL = '/users/login/' # Static files (CSS, JavaScript, Images) # https://docs.djangoproject.com/en/1.8/howto/static-files/ STATIC_URL = '/static/' MEDIA_URL = '/media/' MEDIA_ROOT = os.path.join(BASE_DIR, 'media') STATIC_ROOT = os.path.join(BASE_DIR, 'staticfiles') if os.getenv('DATABASE_URL') is not None: import dj_database_url DATABASES['default'] = dj_database_url.config() SECURE_PROXY_SSL_HEADER = ('HTTP_X_FORWARDED_PROTO', 'https') ALLOWED_HOSTS = ['stark-anchorage-08076.herokuapp.com'] DEBUG = False BASE_DIR = os.path.dirname(os.path.abspath(__file__)) STATICFILES_DIRS = ( os.path.join(BASE_DIR, 'static'), ) django_heroku.settings(locals()) ``` views.py ``` from django.shortcuts import render from .models import Topic, Entry, Root, Suf_Pre_fix from django.http import HttpResponseRedirect, Http404 from django.core.urlresolvers import reverse from .forms import TopicForm, EntryForm, RootForm from django.contrib.auth.decorators import login_required from .help import Help from django.contrib.auth.models import User # Create your views here. def index(request): return render(request, 'learning_logs/index.html') @login_required def topics(request): topics = Topic.objects.order_by('date_added') context = {'topics': topics} return render(request, 'learning_logs/topics.html', context) @login_required def topic(request, topic_id): topic = Topic.objects.get(id=topic_id) entries = topic.entry_set.order_by('-date_added') context = {'topic': topic,'entries': entries} return render(request, 'learning_logs/topic.html', context) @login_required def new_topic(request): if request.method != 'POST': form = TopicForm() else: form = TopicForm(request.POST) if form.is_valid(): new_topic = form.save(commit=False) new_topic.owner = request.user new_topic.edit_able = request.POST.getlist("edit_able") new_topic.save() return HttpResponseRedirect(reverse('learning_logs:topics')) context = {'form': form, 'users':Help().users()} return render(request, 'learning_logs/new_topic.html', context) @login_required def new_entry(request, topic_id): topic = Topic.objects.get(id=topic_id) if request.method != 'POST': form = EntryForm() else: form = EntryForm(data=request.POST) if form.is_valid(): new_entry = form.save(commit=False) new_entry.topic = topic new_entry.edit_able = request.POST.getlist("edit_able") new_entry.save() return HttpResponseRedirect(reverse('learning_logs:topic',args=[topic_id])) context = {'topic':topic, 'form': form, 'users':Help().users()} return render(request, 'learning_logs/new_entry.html', context) @login_required def edit_entry(request, entry_id): entry = Entry.objects.get(id=entry_id) topic = entry.topic if not Help().check_user(request.user,entry.edit_able) or not Help().check_user(request.user,topic.edit_able): raise Http404 if request.method != 'POST': form = EntryForm(instance=entry) else: form = EntryForm(instance=entry, data=request.POST) if form.is_valid(): edit_entry = form.save(commit=False) edit_entry.edit_able = request.POST.getlist("edit_able") edit_entry.save() return HttpResponseRedirect(reverse('learning_logs:topic',args=[topic.id])) context = {'entry': entry, 'topic': topic, 'form': form ,'users':Help().users()} return render(request, 'learning_logs/edit_entry.html', context) @login_required def roots(request): roots = Root.objects.order_by('date_added') context = {'roots': roots} return render(request, 'learning_logs/roots.html', context) def root(request, root_id): root = Root.objects.get(id=root_id) things = root.things.order_by('-date_added') context = {'root':root, 'things':things} return render(request, 'learning_logs/root.html', context) ``` help.py ``` from django.contrib.auth.models import User class Help(): def __init__(self): pass def choices(self): users=User.objects.all() choices=[] a=1 for user in users: choices.append((a,str(user))) a+=1 return choices def check_user(self,user,users): try: str(users).index(str(user)) except: return False else: return True def users(self): users=[] for user in User.objects.all(): users.append(str(user)) return users def test_list(self,list1): for item in list1: print(type(item)) def test_word(self,item): print(item,type(item)) ```
debian10.2安装phpstorm2019.3.1时出现了问题,求大佬解答
debian 10.2 phpstorm 2019.3.1 在设置完环境变量后,运行phpstorm与直接进入文件目录执行./phpstorm.sh出现的都是这个问题,求各位大佬给个解决方法,万分感谢 另外我实在是莫得币子了,知识无价,学海无涯,有任何解决办法我都会去尝试,谢谢大家了 OpenJDK 64-Bit Server VM warning: Option UseConcMarkSweepGC was deprecated in version 9.0 and will likely be removed in a future release. No protocol specified 2020-01-19 23:59:09,363 [ 2351] WARN - #com.intellij.idea.Main - java.awt.AWTError: Can't connect to X11 window server using ':0' as the value of the DISPLAY variable. java.util.concurrent.ExecutionException: java.awt.AWTError: Can't connect to X11 window server using ':0' as the value of the DISPLAY variable. at java.base/java.util.concurrent.CompletableFuture.reportGet(CompletableFuture.java:395) at java.base/java.util.concurrent.CompletableFuture.get(CompletableFuture.java:1999) at com.intellij.idea.StartupUtil.runInEdtAndWait(StartupUtil.java:678) at com.intellij.idea.StartupUtil.lambda$showUserAgreementAndConsentsIfNeeded$15(StartupUtil.java:673) at com.intellij.ui.AppUIUtil.showConsentsAgreementIfNeeded(AppUIUtil.java:332) at com.intellij.idea.StartupUtil.showUserAgreementAndConsentsIfNeeded(StartupUtil.java:673) at com.intellij.idea.StartupUtil.startApp(StartupUtil.java:231) at com.intellij.idea.StartupUtil.prepareApp(StartupUtil.java:213) at com.intellij.ide.plugins.MainRunner.lambda$start$0(MainRunner.java:39) at java.base/java.lang.Thread.run(Thread.java:834) Caused by: java.awt.AWTError: Can't connect to X11 window server using ':0' as the value of the DISPLAY variable. at java.desktop/sun.awt.X11GraphicsEnvironment.initDisplay(Native Method) at java.desktop/sun.awt.X11GraphicsEnvironment$1.run(X11GraphicsEnvironment.java:102) at java.base/java.security.AccessController.doPrivileged(Native Method) at java.desktop/sun.awt.X11GraphicsEnvironment.<clinit>(X11GraphicsEnvironment.java:61) at java.base/java.lang.Class.forName0(Native Method) at java.base/java.lang.Class.forName(Class.java:315) at java.desktop/java.awt.GraphicsEnvironment$LocalGE.createGE(GraphicsEnvironment.java:101) at java.desktop/java.awt.GraphicsEnvironment$LocalGE.<clinit>(GraphicsEnvironment.java:83) at java.desktop/java.awt.GraphicsEnvironment.getLocalGraphicsEnvironment(GraphicsEnvironment.java:129) at java.desktop/sun.awt.X11.XToolkit.<clinit>(XToolkit.java:232) at java.base/java.lang.Class.forName0(Native Method) at java.base/java.lang.Class.forName(Class.java:315) at java.desktop/java.awt.Toolkit$2.run(Toolkit.java:588) at java.desktop/java.awt.Toolkit$2.run(Toolkit.java:583) at java.base/java.security.AccessController.doPrivileged(Native Method) at java.desktop/java.awt.Toolkit.getDefaultToolkit(Toolkit.java:582) at java.desktop/java.awt.Toolkit.getEventQueue(Toolkit.java:1499) at java.desktop/java.awt.EventQueue.invokeLater(EventQueue.java:1318) at com.intellij.idea.StartupUtil.lambda$scheduleInitUi$9(StartupUtil.java:265) at java.base/java.util.concurrent.ThreadPoolExecutor.runWorker(ThreadPoolExecutor.java:1128) at java.base/java.util.concurrent.ThreadPoolExecutor$Worker.run(ThreadPoolExecutor.java:628) ... 1 more 2020-01-19 23:59:10,475 [ 3463] ERROR - tellij.diagnostic.LoadingState - Should be called at least in the state LAF_INITIALIZED, the current state is: BOOTSTRAP Current violators count: 1 java.lang.Throwable at com.intellij.diagnostic.LoadingState.logStateError(LoadingState.java:55) at com.intellij.diagnostic.LoadingState.checkOccurred(LoadingState.java:51) at com.intellij.util.ui.UIUtil.<clinit>(UIUtil.java:83) at com.intellij.ide.a.c.a.a(a.java:182) at com.intellij.ide.a.d.n.a(n.java:544) at com.intellij.ide.a.d.n.c(n.java:222) at com.intellij.ide.a.d.n.a(n.java:117) at java.base/jdk.internal.reflect.NativeMethodAccessorImpl.invoke0(Native Method) at java.base/jdk.internal.reflect.NativeMethodAccessorImpl.invoke(NativeMethodAccessorImpl.java:62) at java.base/jdk.internal.reflect.DelegatingMethodAccessorImpl.invoke(DelegatingMethodAccessorImpl.java:43) at java.base/java.lang.reflect.Method.invoke(Method.java:566) at com.intellij.idea.MainImpl.start(MainImpl.java:94) at com.intellij.idea.StartupUtil.lambda$startApp$5(StartupUtil.java:246) at com.intellij.util.ui.EdtInvocationManager.executeWithCustomManager(EdtInvocationManager.java:73) at com.intellij.idea.StartupUtil.startApp(StartupUtil.java:241) at com.intellij.idea.StartupUtil.prepareApp(StartupUtil.java:213) at com.intellij.ide.plugins.MainRunner.lambda$start$0(MainRunner.java:39) at java.base/java.lang.Thread.run(Thread.java:834) 2020-01-19 23:59:10,475 [ 3463] ERROR - tellij.diagnostic.LoadingState - PhpStorm 2019.3.1 Build #PS-193.5662.63 2020-01-19 23:59:10,476 [ 3464] ERROR - tellij.diagnostic.LoadingState - JDK: 11.0.5; VM: OpenJDK 64-Bit Server VM; Vendor: JetBrains s.r.o 2020-01-19 23:59:10,476 [ 3464] ERROR - tellij.diagnostic.LoadingState - OS: Linux 2020-01-19 23:59:10,485 [ 3473] ERROR - tellij.diagnostic.LoadingState - Should be called at least in the state LAF_INITIALIZED, the current state is: BOOTSTRAP Current violators count: 2 java.lang.Throwable at com.intellij.diagnostic.LoadingState.logStateError(LoadingState.java:55) at com.intellij.diagnostic.LoadingState.checkOccurred(LoadingState.java:51) at com.intellij.openapi.util.registry.Registry.is(Registry.java:52) at com.intellij.util.ui.UIUtil.<clinit>(UIUtil.java:90) at com.intellij.ide.a.c.a.a(a.java:182) at com.intellij.ide.a.d.n.a(n.java:544) at com.intellij.ide.a.d.n.c(n.java:222) at com.intellij.ide.a.d.n.a(n.java:117) at java.base/jdk.internal.reflect.NativeMethodAccessorImpl.invoke0(Native Method) at java.base/jdk.internal.reflect.NativeMethodAccessorImpl.invoke(NativeMethodAccessorImpl.java:62) at java.base/jdk.internal.reflect.DelegatingMethodAccessorImpl.invoke(DelegatingMethodAccessorImpl.java:43) at java.base/java.lang.reflect.Method.invoke(Method.java:566) at com.intellij.idea.MainImpl.start(MainImpl.java:94) at com.intellij.idea.StartupUtil.lambda$startApp$5(StartupUtil.java:246) at com.intellij.util.ui.EdtInvocationManager.executeWithCustomManager(EdtInvocationManager.java:73) at com.intellij.idea.StartupUtil.startApp(StartupUtil.java:241) at com.intellij.idea.StartupUtil.prepareApp(StartupUtil.java:213) at com.intellij.ide.plugins.MainRunner.lambda$start$0(MainRunner.java:39) at java.base/java.lang.Thread.run(Thread.java:834) 2020-01-19 23:59:10,486 [ 3474] ERROR - tellij.diagnostic.LoadingState - PhpStorm 2019.3.1 Build #PS-193.5662.63 2020-01-19 23:59:10,486 [ 3474] ERROR - tellij.diagnostic.LoadingState - JDK: 11.0.5; VM: OpenJDK 64-Bit Server VM; Vendor: JetBrains s.r.o 2020-01-19 23:59:10,486 [ 3474] ERROR - tellij.diagnostic.LoadingState - OS: Linux 2020-01-19 23:59:10,540 [ 3528] ERROR - llij.ide.plugins.PluginManager - Could not initialize class sun.awt.X11.XToolkit java.lang.NoClassDefFoundError: Could not initialize class sun.awt.X11.XToolkit at java.base/java.lang.Class.forName0(Native Method) at java.base/java.lang.Class.forName(Class.java:315) at java.desktop/java.awt.Toolkit$2.run(Toolkit.java:588) at java.desktop/java.awt.Toolkit$2.run(Toolkit.java:583) at java.base/java.security.AccessController.doPrivileged(Native Method) at java.desktop/java.awt.Toolkit.getDefaultToolkit(Toolkit.java:582) at java.desktop/sun.swing.SwingUtilities2.getSystemMnemonicKeyMask(SwingUtilities2.java:2210) at java.desktop/javax.swing.plaf.basic.BasicLookAndFeel.initComponentDefaults(BasicLookAndFeel.java:1096) at java.desktop/javax.swing.plaf.metal.MetalLookAndFeel.initComponentDefaults(MetalLookAndFeel.java:440) at java.desktop/javax.swing.plaf.basic.BasicLookAndFeel.getDefaults(BasicLookAndFeel.java:150) at java.desktop/javax.swing.plaf.metal.MetalLookAndFeel.getDefaults(MetalLookAndFeel.java:1560) at java.desktop/javax.swing.UIManager.setLookAndFeel(UIManager.java:592) at java.desktop/javax.swing.UIManager.setLookAndFeel(UIManager.java:634) at java.desktop/javax.swing.UIManager.initializeDefaultLAF(UIManager.java:1409) at java.desktop/javax.swing.UIManager.initialize(UIManager.java:1522) at java.desktop/javax.swing.UIManager.maybeInitialize(UIManager.java:1488) at java.desktop/javax.swing.UIManager.getDefaults(UIManager.java:714) at java.desktop/javax.swing.UIManager.getFont(UIManager.java:727) at com.intellij.ui.scale.JBUIScale.lambda$static$0(JBUIScale.java:47) at com.intellij.openapi.util.AtomicNotNullLazyValue$1.compute(AtomicNotNullLazyValue.java:59) at com.intellij.openapi.util.AtomicNotNullLazyValue.getValue(AtomicNotNullLazyValue.java:37) at com.intellij.ui.scale.JBUIScale.lambda$static$1(JBUIScale.java:152) at com.intellij.util.LazyInitializer$MutableNotNullValue.initialize(LazyInitializer.java:113) at com.intellij.util.LazyInitializer$NullableValue.get(LazyInitializer.java:41) at com.intellij.util.LazyInitializer$MutableNotNullValue.get(LazyInitializer.java:102) at com.intellij.ui.scale.JBUIScale.lambda$static$2(JBUIScale.java:170) at com.intellij.util.LazyInitializer$MutableNotNullValue.initialize(LazyInitializer.java:113) at com.intellij.util.LazyInitializer$NullableValue.get(LazyInitializer.java:41) at com.intellij.util.LazyInitializer$MutableNotNullValue.get(LazyInitializer.java:102) at com.intellij.ui.scale.JBUIScale.scale(JBUIScale.java:294) at com.intellij.util.ui.JBInsets.create(JBInsets.java:41) at com.intellij.util.ui.UIUtil.<clinit>(UIUtil.java:457) at com.intellij.ide.a.c.a.a(a.java:182) at com.intellij.ide.a.d.n.a(n.java:544) at com.intellij.ide.a.d.n.c(n.java:222) at com.intellij.ide.a.d.n.a(n.java:117) at java.base/jdk.internal.reflect.NativeMethodAccessorImpl.invoke0(Native Method) at java.base/jdk.internal.reflect.NativeMethodAccessorImpl.invoke(NativeMethodAccessorImpl.java:62) at java.base/jdk.internal.reflect.DelegatingMethodAccessorImpl.invoke(DelegatingMethodAccessorImpl.java:43) at java.base/java.lang.reflect.Method.invoke(Method.java:566) at com.intellij.idea.MainImpl.start(MainImpl.java:94) at com.intellij.idea.StartupUtil.lambda$startApp$5(StartupUtil.java:246) at com.intellij.util.ui.EdtInvocationManager.executeWithCustomManager(EdtInvocationManager.java:73) at com.intellij.idea.StartupUtil.startApp(StartupUtil.java:241) at com.intellij.idea.StartupUtil.prepareApp(StartupUtil.java:213) at com.intellij.ide.plugins.MainRunner.lambda$start$0(MainRunner.java:39) at java.base/java.lang.Thread.run(Thread.java:834) 2020-01-19 23:59:10,542 [ 3530] ERROR - llij.ide.plugins.PluginManager - PhpStorm 2019.3.1 Build #PS-193.5662.63 2020-01-19 23:59:10,543 [ 3531] ERROR - llij.ide.plugins.PluginManager - JDK: 11.0.5; VM: OpenJDK 64-Bit Server VM; Vendor: JetBrains s.r.o 2020-01-19 23:59:10,543 [ 3531] ERROR - llij.ide.plugins.PluginManager - OS: Linux Start Failed: Internal error. Please refer to http://jb.gg/ide/critical-startup-errors java.lang.NoClassDefFoundError: Could not initialize class sun.awt.X11.XToolkit at java.base/java.lang.Class.forName0(Native Method) at java.base/java.lang.Class.forName(Class.java:315) at java.desktop/java.awt.Toolkit$2.run(Toolkit.java:588) at java.desktop/java.awt.Toolkit$2.run(Toolkit.java:583) at java.base/java.security.AccessController.doPrivileged(Native Method) at java.desktop/java.awt.Toolkit.getDefaultToolkit(Toolkit.java:582) at java.desktop/sun.swing.SwingUtilities2.getSystemMnemonicKeyMask(SwingUtilities2.java:2210) at java.desktop/javax.swing.plaf.basic.BasicLookAndFeel.initComponentDefaults(BasicLookAndFeel.java:1096) at java.desktop/javax.swing.plaf.metal.MetalLookAndFeel.initComponentDefaults(MetalLookAndFeel.java:440) at java.desktop/javax.swing.plaf.basic.BasicLookAndFeel.getDefaults(BasicLookAndFeel.java:150) at java.desktop/javax.swing.plaf.metal.MetalLookAndFeel.getDefaults(MetalLookAndFeel.java:1560) at java.desktop/javax.swing.UIManager.setLookAndFeel(UIManager.java:592) at java.desktop/javax.swing.UIManager.setLookAndFeel(UIManager.java:634) at java.desktop/javax.swing.UIManager.initializeDefaultLAF(UIManager.java:1409) at java.desktop/javax.swing.UIManager.initialize(UIManager.java:1522) at java.desktop/javax.swing.UIManager.maybeInitialize(UIManager.java:1488) at java.desktop/javax.swing.UIManager.getDefaults(UIManager.java:714) at java.desktop/javax.swing.UIManager.getFont(UIManager.java:727) at com.intellij.ui.scale.JBUIScale.lambda$static$0(JBUIScale.java:47) at com.intellij.openapi.util.AtomicNotNullLazyValue$1.compute(AtomicNotNullLazyValue.java:59) at com.intellij.openapi.util.AtomicNotNullLazyValue.getValue(AtomicNotNullLazyValue.java:37) at com.intellij.ui.scale.JBUIScale.lambda$static$1(JBUIScale.java:152) at com.intellij.util.LazyInitializer$MutableNotNullValue.initialize(LazyInitializer.java:113) at com.intellij.util.LazyInitializer$NullableValue.get(LazyInitializer.java:41) at com.intellij.util.LazyInitializer$MutableNotNullValue.get(LazyInitializer.java:102) at com.intellij.ui.scale.JBUIScale.lambda$static$2(JBUIScale.java:170) at com.intellij.util.LazyInitializer$MutableNotNullValue.initialize(LazyInitializer.java:113) at com.intellij.util.LazyInitializer$NullableValue.get(LazyInitializer.java:41) at com.intellij.util.LazyInitializer$MutableNotNullValue.get(LazyInitializer.java:102) at com.intellij.ui.scale.JBUIScale.scale(JBUIScale.java:294) at com.intellij.util.ui.JBInsets.create(JBInsets.java:41) at com.intellij.util.ui.UIUtil.<clinit>(UIUtil.java:457) at com.intellij.ide.a.c.a.a(a.java:182) at com.intellij.ide.a.d.n.a(n.java:544) at com.intellij.ide.a.d.n.c(n.java:222) at com.intellij.ide.a.d.n.a(n.java:117) at java.base/jdk.internal.reflect.NativeMethodAccessorImpl.invoke0(Native Method) at java.base/jdk.internal.reflect.NativeMethodAccessorImpl.invoke(NativeMethodAccessorImpl.java:62) at java.base/jdk.internal.reflect.DelegatingMethodAccessorImpl.invoke(DelegatingMethodAccessorImpl.java:43) at java.base/java.lang.reflect.Method.invoke(Method.java:566) at com.intellij.idea.MainImpl.start(MainImpl.java:94) at com.intellij.idea.StartupUtil.lambda$startApp$5(StartupUtil.java:246) at com.intellij.util.ui.EdtInvocationManager.executeWithCustomManager(EdtInvocationManager.java:73) at com.intellij.idea.StartupUtil.startApp(StartupUtil.java:241) at com.intellij.idea.StartupUtil.prepareApp(StartupUtil.java:213) at com.intellij.ide.plugins.MainRunner.lambda$start$0(MainRunner.java:39) at java.base/java.lang.Thread.run(Thread.java:834) ----- JRE 11.0.5+10-b520.17 amd64 by JetBrains s.r.o /home/PhpStorm-193.5662.63/jbr Also, a UI exception occurred on an attempt to show the above message: java.lang.NoClassDefFoundError: Could not initialize class java.awt.GraphicsEnvironment$LocalGE at java.desktop/java.awt.GraphicsEnvironment.getLocalGraphicsEnvironment(GraphicsEnvironment.java:129) at java.desktop/javax.swing.RepaintManager.<clinit>(RepaintManager.java:243) at java.desktop/javax.swing.JComponent.repaint(JComponent.java:4835) at java.desktop/java.awt.Component.repaint(Component.java:3412) at java.desktop/javax.swing.text.JTextComponent.setEditable(JTextComponent.java:1818) at java.desktop/javax.swing.text.JTextComponent.<init>(JTextComponent.java:323) at java.desktop/javax.swing.JEditorPane.<init>(JEditorPane.java:198) at java.desktop/javax.swing.JTextPane.<init>(JTextPane.java:87) at com.intellij.idea.Main.showMessage(Main.java:212) at com.intellij.idea.Main.showMessage(Main.java:188) at com.intellij.ide.plugins.StartupAbortedException.processException(StartupAbortedException.java:78) at com.intellij.ide.plugins.MainRunner.lambda$start$0(MainRunner.java:42) at java.base/java.lang.Thread.run(Thread.java:834)
部署flask项目到heroku上时,出现psycopg2.errors.UndefinedTable: relation "question" does not exist问题,该怎么解决?
当我把flask项目部署到heroku上后,打开app时显示**Internal Server Error**. 报错为 ``` psycopg2.errors.UndefinedTable: relation "question" does not exist ``` 我google下,可能是由于migrations文件导致的,于是我就把该文件删掉了。但依然出现同样的问题。 求大神帮忙,现在踩在坑里有点出不去了。 这是我的config.py文件: ``` import os DEBUG = True SECRET_KEY = os.urandom(24) MAX_CONTENT_LENGTH = 1 * 1024 * 1024 SQLALCHEMY_DATABASE_URI = os.environ.get('DATABASE_URL') SQLALCHEMY_TRACK_MODIFICATIONS=False ``` 下面是heroku 的logs: ``` 2019-11-17T08:43:29.637889+00:00 app[web.1]: [2019-11-17 08:43:29 +0000] [11] [ERROR] Error handling request / 2019-11-17T08:43:29.637935+00:00 app[web.1]: Traceback (most recent call last): 2019-11-17T08:43:29.637940+00:00 app[web.1]: File "/app/.heroku/python/lib/python3.7/site-packages/sqlalchemy/engine/base.py", line 1249, in _execute_context 2019-11-17T08:43:29.637942+00:00 app[web.1]: cursor, statement, parameters, context 2019-11-17T08:43:29.637945+00:00 app[web.1]: File "/app/.heroku/python/lib/python3.7/site-packages/sqlalchemy/engine/default.py", line 580, in do_execute 2019-11-17T08:43:29.637947+00:00 app[web.1]: cursor.execute(statement, parameters) 2019-11-17T08:43:29.637949+00:00 app[web.1]: psycopg2.errors.UndefinedTable: relation "question" does not exist 2019-11-17T08:43:29.637952+00:00 app[web.1]: LINE 2: FROM question ORDER BY question.create_time DESC 2019-11-17T08:43:29.637955+00:00 app[web.1]: ^ 2019-11-17T08:43:29.637956+00:00 app[web.1]: 2019-11-17T08:43:29.637958+00:00 app[web.1]: 2019-11-17T08:43:29.637960+00:00 app[web.1]: The above exception was the direct cause of the following exception: 2019-11-17T08:43:29.637962+00:00 app[web.1]: 2019-11-17T08:43:29.637964+00:00 app[web.1]: Traceback (most recent call last): 2019-11-17T08:43:29.637966+00:00 app[web.1]: File "/app/.heroku/python/lib/python3.7/site-packages/gunicorn/workers/sync.py", line 134, in handle 2019-11-17T08:43:29.637968+00:00 app[web.1]: self.handle_request(listener, req, client, addr) 2019-11-17T08:43:29.637970+00:00 app[web.1]: File "/app/.heroku/python/lib/python3.7/site-packages/gunicorn/workers/sync.py", line 175, in handle_request 2019-11-17T08:43:29.637972+00:00 app[web.1]: respiter = self.wsgi(environ, resp.start_response) 2019-11-17T08:43:29.637984+00:00 app[web.1]: File "/app/.heroku/python/lib/python3.7/site-packages/flask/app.py", line 2463, in __call__ 2019-11-17T08:43:29.637986+00:00 app[web.1]: return self.wsgi_app(environ, start_response) 2019-11-17T08:43:29.637988+00:00 app[web.1]: File "/app/.heroku/python/lib/python3.7/site-packages/flask/app.py", line 2449, in wsgi_app 2019-11-17T08:43:29.637990+00:00 app[web.1]: response = self.handle_exception(e) 2019-11-17T08:43:29.637992+00:00 app[web.1]: File "/app/.heroku/python/lib/python3.7/site-packages/flask/app.py", line 1866, in handle_exception 2019-11-17T08:43:29.637993+00:00 app[web.1]: reraise(exc_type, exc_value, tb) 2019-11-17T08:43:29.637995+00:00 app[web.1]: File "/app/.heroku/python/lib/python3.7/site-packages/flask/_compat.py", line 39, in reraise 2019-11-17T08:43:29.637997+00:00 app[web.1]: raise value 2019-11-17T08:43:29.637999+00:00 app[web.1]: File "/app/.heroku/python/lib/python3.7/site-packages/flask/app.py", line 2446, in wsgi_app 2019-11-17T08:43:29.638000+00:00 app[web.1]: response = self.full_dispatch_request() 2019-11-17T08:43:29.638002+00:00 app[web.1]: File "/app/.heroku/python/lib/python3.7/site-packages/flask/app.py", line 1951, in full_dispatch_request 2019-11-17T08:43:29.638004+00:00 app[web.1]: rv = self.handle_user_exception(e) 2019-11-17T08:43:29.638006+00:00 app[web.1]: File "/app/.heroku/python/lib/python3.7/site-packages/flask/app.py", line 1820, in handle_user_exception 2019-11-17T08:43:29.638008+00:00 app[web.1]: reraise(exc_type, exc_value, tb) 2019-11-17T08:43:29.638010+00:00 app[web.1]: File "/app/.heroku/python/lib/python3.7/site-packages/flask/_compat.py", line 39, in reraise 2019-11-17T08:43:29.638011+00:00 app[web.1]: raise value 2019-11-17T08:43:29.638013+00:00 app[web.1]: File "/app/.heroku/python/lib/python3.7/site-packages/flask/app.py", line 1949, in full_dispatch_request 2019-11-17T08:43:29.638015+00:00 app[web.1]: rv = self.dispatch_request() 2019-11-17T08:43:29.638017+00:00 app[web.1]: File "/app/.heroku/python/lib/python3.7/site-packages/flask/app.py", line 1935, in dispatch_request 2019-11-17T08:43:29.638019+00:00 app[web.1]: return self.view_functions[rule.endpoint](**req.view_args) 2019-11-17T08:43:29.638021+00:00 app[web.1]: File "/app/project.py", line 27, in index 2019-11-17T08:43:29.638023+00:00 app[web.1]: 'questions': Questions.query.order_by(desc('create_time')).all() 2019-11-17T08:43:29.638025+00:00 app[web.1]: File "/app/.heroku/python/lib/python3.7/site-packages/sqlalchemy/orm/query.py", line 3186, in all 2019-11-17T08:43:29.638027+00:00 app[web.1]: return list(self) 2019-11-17T08:43:29.638029+00:00 app[web.1]: File "/app/.heroku/python/lib/python3.7/site-packages/sqlalchemy/orm/query.py", line 3342, in __iter__ 2019-11-17T08:43:29.638031+00:00 app[web.1]: return self._execute_and_instances(context) 2019-11-17T08:43:29.638033+00:00 app[web.1]: File "/app/.heroku/python/lib/python3.7/site-packages/sqlalchemy/orm/query.py", line 3367, in _execute_and_instances 2019-11-17T08:43:29.638035+00:00 app[web.1]: result = conn.execute(querycontext.statement, self._params) 2019-11-17T08:43:29.638037+00:00 app[web.1]: File "/app/.heroku/python/lib/python3.7/site-packages/sqlalchemy/engine/base.py", line 988, in execute 2019-11-17T08:43:29.638039+00:00 app[web.1]: return meth(self, multiparams, params) 2019-11-17T08:43:29.638041+00:00 app[web.1]: File "/app/.heroku/python/lib/python3.7/site-packages/sqlalchemy/sql/elements.py", line 287, in _execute_on_connection 2019-11-17T08:43:29.638043+00:00 app[web.1]: return connection._execute_clauseelement(self, multiparams, params) 2019-11-17T08:43:29.638045+00:00 app[web.1]: File "/app/.heroku/python/lib/python3.7/site-packages/sqlalchemy/engine/base.py", line 1107, in _execute_clauseelement 2019-11-17T08:43:29.638047+00:00 app[web.1]: distilled_params, 2019-11-17T08:43:29.638049+00:00 app[web.1]: File "/app/.heroku/python/lib/python3.7/site-packages/sqlalchemy/engine/base.py", line 1253, in _execute_context 2019-11-17T08:43:29.638051+00:00 app[web.1]: e, statement, parameters, cursor, context 2019-11-17T08:43:29.638053+00:00 app[web.1]: File "/app/.heroku/python/lib/python3.7/site-packages/sqlalchemy/engine/base.py", line 1473, in _handle_dbapi_exception 2019-11-17T08:43:29.638055+00:00 app[web.1]: util.raise_from_cause(sqlalchemy_exception, exc_info) 2019-11-17T08:43:29.638057+00:00 app[web.1]: File "/app/.heroku/python/lib/python3.7/site-packages/sqlalchemy/util/compat.py", line 398, in raise_from_cause 2019-11-17T08:43:29.638059+00:00 app[web.1]: reraise(type(exception), exception, tb=exc_tb, cause=cause) 2019-11-17T08:43:29.638061+00:00 app[web.1]: File "/app/.heroku/python/lib/python3.7/site-packages/sqlalchemy/util/compat.py", line 152, in reraise 2019-11-17T08:43:29.638063+00:00 app[web.1]: raise value.with_traceback(tb) 2019-11-17T08:43:29.638076+00:00 app[web.1]: File "/app/.heroku/python/lib/python3.7/site-packages/sqlalchemy/engine/base.py", line 1249, in _execute_context 2019-11-17T08:43:29.638079+00:00 app[web.1]: cursor, statement, parameters, context 2019-11-17T08:43:29.638081+00:00 app[web.1]: File "/app/.heroku/python/lib/python3.7/site-packages/sqlalchemy/engine/default.py", line 580, in do_execute 2019-11-17T08:43:29.638083+00:00 app[web.1]: cursor.execute(statement, parameters) 2019-11-17T08:43:29.638085+00:00 app[web.1]: sqlalchemy.exc.ProgrammingError: (psycopg2.errors.UndefinedTable) relation "question" does not exist 2019-11-17T08:43:29.638087+00:00 app[web.1]: LINE 2: FROM question ORDER BY question.create_time DESC 2019-11-17T08:43:29.638089+00:00 app[web.1]: ^ 2019-11-17T08:43:29.638091+00:00 app[web.1]: 2019-11-17T08:43:29.638095+00:00 app[web.1]: [SQL: SELECT question.id AS question_id, question.title AS question_title, question.content AS question_content, question.create_time AS question_create_time, question.author_id AS question_author_id 2019-11-17T08:43:29.638097+00:00 app[web.1]: FROM question ORDER BY question.create_time DESC] 2019-11-17T08:43:29.638099+00:00 app[web.1]: (Background on this error at: http://sqlalche.me/e/f405) 2019-11-17T08:43:29.638285+00:00 app[web.1]: 10.61.164.89 - - [17/Nov/2019:08:43:29 +0000] "GET / HTTP/1.1" 500 0 "-" "-" 2019-11-17T08:44:42.918911+00:00 app[web.1]: [2019-11-17 08:44:42 +0000] [11] [ERROR] Error handling request / 2019-11-17T08:44:42.918940+00:00 app[web.1]: Traceback (most recent call last): 2019-11-17T08:44:42.918944+00:00 app[web.1]: File "/app/.heroku/python/lib/python3.7/site-packages/sqlalchemy/engine/base.py", line 1249, in _execute_context 2019-11-17T08:44:42.918946+00:00 app[web.1]: cursor, statement, parameters, context 2019-11-17T08:44:42.918948+00:00 app[web.1]: File "/app/.heroku/python/lib/python3.7/site-packages/sqlalchemy/engine/default.py", line 580, in do_execute 2019-11-17T08:44:42.918950+00:00 app[web.1]: cursor.execute(statement, parameters) 2019-11-17T08:44:42.918952+00:00 app[web.1]: psycopg2.errors.UndefinedTable: relation "question" does not exist 2019-11-17T08:44:42.918955+00:00 app[web.1]: LINE 2: FROM question ORDER BY question.create_time DESC 2019-11-17T08:44:42.918957+00:00 app[web.1]: ^ 2019-11-17T08:44:42.918959+00:00 app[web.1]: 2019-11-17T08:44:42.918961+00:00 app[web.1]: 2019-11-17T08:44:42.918963+00:00 app[web.1]: The above exception was the direct cause of the following exception: 2019-11-17T08:44:42.918965+00:00 app[web.1]: 2019-11-17T08:44:42.918967+00:00 app[web.1]: Traceback (most recent call last): 2019-11-17T08:44:42.918969+00:00 app[web.1]: File "/app/.heroku/python/lib/python3.7/site-packages/gunicorn/workers/sync.py", line 134, in handle 2019-11-17T08:44:42.918971+00:00 app[web.1]: self.handle_request(listener, req, client, addr) 2019-11-17T08:44:42.918973+00:00 app[web.1]: File "/app/.heroku/python/lib/python3.7/site-packages/gunicorn/workers/sync.py", line 175, in handle_request 2019-11-17T08:44:42.918975+00:00 app[web.1]: respiter = self.wsgi(environ, resp.start_response) 2019-11-17T08:44:42.918977+00:00 app[web.1]: File "/app/.heroku/python/lib/python3.7/site-packages/flask/app.py", line 2463, in __call__ 2019-11-17T08:44:42.918979+00:00 app[web.1]: return self.wsgi_app(environ, start_response) 2019-11-17T08:44:42.918981+00:00 app[web.1]: File "/app/.heroku/python/lib/python3.7/site-packages/flask/app.py", line 2449, in wsgi_app 2019-11-17T08:44:42.918983+00:00 app[web.1]: response = self.handle_exception(e) 2019-11-17T08:44:42.918985+00:00 app[web.1]: File "/app/.heroku/python/lib/python3.7/site-packages/flask/app.py", line 1866, in handle_exception 2019-11-17T08:44:42.918988+00:00 app[web.1]: reraise(exc_type, exc_value, tb) 2019-11-17T08:44:42.918989+00:00 app[web.1]: File "/app/.heroku/python/lib/python3.7/site-packages/flask/_compat.py", line 39, in reraise 2019-11-17T08:44:42.918991+00:00 app[web.1]: raise value 2019-11-17T08:44:42.918994+00:00 app[web.1]: File "/app/.heroku/python/lib/python3.7/site-packages/flask/app.py", line 2446, in wsgi_app 2019-11-17T08:44:42.918996+00:00 app[web.1]: response = self.full_dispatch_request() 2019-11-17T08:44:42.918998+00:00 app[web.1]: File "/app/.heroku/python/lib/python3.7/site-packages/flask/app.py", line 1951, in full_dispatch_request 2019-11-17T08:44:42.919000+00:00 app[web.1]: rv = self.handle_user_exception(e) 2019-11-17T08:44:42.919002+00:00 app[web.1]: File "/app/.heroku/python/lib/python3.7/site-packages/flask/app.py", line 1820, in handle_user_exception 2019-11-17T08:44:42.919004+00:00 app[web.1]: reraise(exc_type, exc_value, tb) 2019-11-17T08:44:42.919006+00:00 app[web.1]: File "/app/.heroku/python/lib/python3.7/site-packages/flask/_compat.py", line 39, in reraise 2019-11-17T08:44:42.919008+00:00 app[web.1]: raise value 2019-11-17T08:44:42.919010+00:00 app[web.1]: File "/app/.heroku/python/lib/python3.7/site-packages/flask/app.py", line 1949, in full_dispatch_request 2019-11-17T08:44:42.919012+00:00 app[web.1]: rv = self.dispatch_request() 2019-11-17T08:44:42.919014+00:00 app[web.1]: File "/app/.heroku/python/lib/python3.7/site-packages/flask/app.py", line 1935, in dispatch_request 2019-11-17T08:44:42.919016+00:00 app[web.1]: return self.view_functions[rule.endpoint](**req.view_args) 2019-11-17T08:44:42.919018+00:00 app[web.1]: File "/app/project.py", line 27, in index 2019-11-17T08:44:42.919020+00:00 app[web.1]: 'questions': Questions.query.order_by(desc('create_time')).all() 2019-11-17T08:44:42.919022+00:00 app[web.1]: File "/app/.heroku/python/lib/python3.7/site-packages/sqlalchemy/orm/query.py", line 3186, in all 2019-11-17T08:44:42.919025+00:00 app[web.1]: return list(self) 2019-11-17T08:44:42.919027+00:00 app[web.1]: File "/app/.heroku/python/lib/python3.7/site-packages/sqlalchemy/orm/query.py", line 3342, in __iter__ 2019-11-17T08:44:42.919028+00:00 app[web.1]: return self._execute_and_instances(context) 2019-11-17T08:44:42.919031+00:00 app[web.1]: File "/app/.heroku/python/lib/python3.7/site-packages/sqlalchemy/orm/query.py", line 3367, in _execute_and_instances 2019-11-17T08:44:42.919033+00:00 app[web.1]: result = conn.execute(querycontext.statement, self._params) 2019-11-17T08:44:42.919035+00:00 app[web.1]: File "/app/.heroku/python/lib/python3.7/site-packages/sqlalchemy/engine/base.py", line 988, in execute 2019-11-17T08:44:42.919037+00:00 app[web.1]: return meth(self, multiparams, params) 2019-11-17T08:44:42.919039+00:00 app[web.1]: File "/app/.heroku/python/lib/python3.7/site-packages/sqlalchemy/sql/elements.py", line 287, in _execute_on_connection 2019-11-17T08:44:42.919041+00:00 app[web.1]: return connection._execute_clauseelement(self, multiparams, params) 2019-11-17T08:44:42.919043+00:00 app[web.1]: File "/app/.heroku/python/lib/python3.7/site-packages/sqlalchemy/engine/base.py", line 1107, in _execute_clauseelement 2019-11-17T08:44:42.919046+00:00 app[web.1]: distilled_params, 2019-11-17T08:44:42.919048+00:00 app[web.1]: File "/app/.heroku/python/lib/python3.7/site-packages/sqlalchemy/engine/base.py", line 1253, in _execute_context 2019-11-17T08:44:42.919050+00:00 app[web.1]: e, statement, parameters, cursor, context 2019-11-17T08:44:42.919052+00:00 app[web.1]: File "/app/.heroku/python/lib/python3.7/site-packages/sqlalchemy/engine/base.py", line 1473, in _handle_dbapi_exception 2019-11-17T08:44:42.919054+00:00 app[web.1]: util.raise_from_cause(sqlalchemy_exception, exc_info) 2019-11-17T08:44:42.919056+00:00 app[web.1]: File "/app/.heroku/python/lib/python3.7/site-packages/sqlalchemy/util/compat.py", line 398, in raise_from_cause 2019-11-17T08:44:42.919058+00:00 app[web.1]: reraise(type(exception), exception, tb=exc_tb, cause=cause) 2019-11-17T08:44:42.919060+00:00 app[web.1]: File "/app/.heroku/python/lib/python3.7/site-packages/sqlalchemy/util/compat.py", line 152, in reraise 2019-11-17T08:44:42.919063+00:00 app[web.1]: raise value.with_traceback(tb) 2019-11-17T08:44:42.919074+00:00 app[web.1]: File "/app/.heroku/python/lib/python3.7/site-packages/sqlalchemy/engine/base.py", line 1249, in _execute_context 2019-11-17T08:44:42.919077+00:00 app[web.1]: cursor, statement, parameters, context 2019-11-17T08:44:42.919079+00:00 app[web.1]: File "/app/.heroku/python/lib/python3.7/site-packages/sqlalchemy/engine/default.py", line 580, in do_execute 2019-11-17T08:44:42.919081+00:00 app[web.1]: cursor.execute(statement, parameters) 2019-11-17T08:44:42.919083+00:00 app[web.1]: sqlalchemy.exc.ProgrammingError: (psycopg2.errors.UndefinedTable) relation "question" does not exist 2019-11-17T08:44:42.919085+00:00 app[web.1]: LINE 2: FROM question ORDER BY question.create_time DESC 2019-11-17T08:44:42.919087+00:00 app[web.1]: ^ 2019-11-17T08:44:42.919088+00:00 app[web.1]: 2019-11-17T08:44:42.919091+00:00 app[web.1]: [SQL: SELECT question.id AS question_id, question.title AS question_title, question.content AS question_content, question.create_time AS question_create_time, question.author_id AS question_author_id 2019-11-17T08:44:42.919094+00:00 app[web.1]: FROM question ORDER BY question.create_time DESC] 2019-11-17T08:44:42.919096+00:00 app[web.1]: (Background on this error at: http://sqlalche.me/e/f405) 2019-11-17T08:44:42.919234+00:00 app[web.1]: 10.5.225.117 - - [17/Nov/2019:08:44:42 +0000] "GET / HTTP/1.1" 500 0 "-" "-" 2019-11-17T08:44:42.918749+00:00 heroku[router]: at=info method=GET path="/" host=tianliang-flask-app.herokuapp.com request_id=c195162e-6529-4fb0-9aac-1d9dd9a450e8 fwd="58.182.174.147" dyno=web.1 connect=1ms service=7ms status=500 bytes=244 protocol=https 2019-11-17T09:02:25.748890+00:00 app[web.1]: [2019-11-17 09:02:25 +0000] [12] [ERROR] Error handling request / 2019-11-17T09:02:25.748917+00:00 app[web.1]: Traceback (most recent call last): 2019-11-17T09:02:25.748921+00:00 app[web.1]: File "/app/.heroku/python/lib/python3.7/site-packages/sqlalchemy/engine/base.py", line 1249, in _execute_context 2019-11-17T09:02:25.748923+00:00 app[web.1]: cursor, statement, parameters, context 2019-11-17T09:02:25.748932+00:00 app[web.1]: File "/app/.heroku/python/lib/python3.7/site-packages/sqlalchemy/engine/default.py", line 580, in do_execute 2019-11-17T09:02:25.748934+00:00 app[web.1]: cursor.execute(statement, parameters) 2019-11-17T09:02:25.748936+00:00 app[web.1]: psycopg2.errors.UndefinedTable: relation "question" does not exist 2019-11-17T09:02:25.748939+00:00 app[web.1]: LINE 2: FROM question ORDER BY question.create_time DESC 2019-11-17T09:02:25.748943+00:00 app[web.1]: ^ 2019-11-17T09:02:25.748944+00:00 app[web.1]: 2019-11-17T09:02:25.748947+00:00 app[web.1]: 2019-11-17T09:02:25.748949+00:00 app[web.1]: The above exception was the direct cause of the following exception: 2019-11-17T09:02:25.748950+00:00 app[web.1]: 2019-11-17T09:02:25.748952+00:00 app[web.1]: Traceback (most recent call last): 2019-11-17T09:02:25.748953+00:00 app[web.1]: File "/app/.heroku/python/lib/python3.7/site-packages/gunicorn/workers/sync.py", line 134, in handle 2019-11-17T09:02:25.748955+00:00 app[web.1]: self.handle_request(listener, req, client, addr) 2019-11-17T09:02:25.748956+00:00 app[web.1]: File "/app/.heroku/python/lib/python3.7/site-packages/gunicorn/workers/sync.py", line 175, in handle_request 2019-11-17T09:02:25.748958+00:00 app[web.1]: respiter = self.wsgi(environ, resp.start_response) 2019-11-17T09:02:25.748991+00:00 app[web.1]: File "/app/.heroku/python/lib/python3.7/site-packages/flask/app.py", line 2463, in __call__ 2019-11-17T09:02:25.748994+00:00 app[web.1]: return self.wsgi_app(environ, start_response) 2019-11-17T09:02:25.748996+00:00 app[web.1]: File "/app/.heroku/python/lib/python3.7/site-packages/flask/app.py", line 2449, in wsgi_app 2019-11-17T09:02:25.748998+00:00 app[web.1]: response = self.handle_exception(e) 2019-11-17T09:02:25.749000+00:00 app[web.1]: File "/app/.heroku/python/lib/python3.7/site-packages/flask/app.py", line 1866, in handle_exception 2019-11-17T09:02:25.749002+00:00 app[web.1]: reraise(exc_type, exc_value, tb) 2019-11-17T09:02:25.749004+00:00 app[web.1]: File "/app/.heroku/python/lib/python3.7/site-packages/flask/_compat.py", line 39, in reraise 2019-11-17T09:02:25.749006+00:00 app[web.1]: raise value 2019-11-17T09:02:25.749008+00:00 app[web.1]: File "/app/.heroku/python/lib/python3.7/site-packages/flask/app.py", line 2446, in wsgi_app 2019-11-17T09:02:25.749010+00:00 app[web.1]: response = self.full_dispatch_request() 2019-11-17T09:02:25.749012+00:00 app[web.1]: File "/app/.heroku/python/lib/python3.7/site-packages/flask/app.py", line 1951, in full_dispatch_request 2019-11-17T09:02:25.749014+00:00 app[web.1]: rv = self.handle_user_exception(e) 2019-11-17T09:02:25.749016+00:00 app[web.1]: File "/app/.heroku/python/lib/python3.7/site-packages/flask/app.py", line 1820, in handle_user_exception 2019-11-17T09:02:25.749018+00:00 app[web.1]: reraise(exc_type, exc_value, tb) 2019-11-17T09:02:25.749020+00:00 app[web.1]: File "/app/.heroku/python/lib/python3.7/site-packages/flask/_compat.py", line 39, in reraise 2019-11-17T09:02:25.749023+00:00 app[web.1]: raise value 2019-11-17T09:02:25.749024+00:00 app[web.1]: File "/app/.heroku/python/lib/python3.7/site-packages/flask/app.py", line 1949, in full_dispatch_request 2019-11-17T09:02:25.749026+00:00 app[web.1]: rv = self.dispatch_request() 2019-11-17T09:02:25.749027+00:00 app[web.1]: File "/app/.heroku/python/lib/python3.7/site-packages/flask/app.py", line 1935, in dispatch_request 2019-11-17T09:02:25.749029+00:00 app[web.1]: return self.view_functions[rule.endpoint](**req.view_args) 2019-11-17T09:02:25.749030+00:00 app[web.1]: File "/app/project.py", line 27, in index 2019-11-17T09:02:25.749032+00:00 app[web.1]: 'questions': Questions.query.order_by(desc('create_time')).all() 2019-11-17T09:02:25.749033+00:00 app[web.1]: File "/app/.heroku/python/lib/python3.7/site-packages/sqlalchemy/orm/query.py", line 3186, in all 2019-11-17T09:02:25.749036+00:00 app[web.1]: return list(self) 2019-11-17T09:02:25.749038+00:00 app[web.1]: File "/app/.heroku/python/lib/python3.7/site-packages/sqlalchemy/orm/query.py", line 3342, in __iter__ 2019-11-17T09:02:25.749039+00:00 app[web.1]: return self._execute_and_instances(context) 2019-11-17T09:02:25.749041+00:00 app[web.1]: File "/app/.heroku/python/lib/python3.7/site-packages/sqlalchemy/orm/query.py", line 3367, in _execute_and_instances 2019-11-17T09:02:25.749042+00:00 app[web.1]: result = conn.execute(querycontext.statement, self._params) 2019-11-17T09:02:25.749044+00:00 app[web.1]: File "/app/.heroku/python/lib/python3.7/site-packages/sqlalchemy/engine/base.py", line 988, in execute 2019-11-17T09:02:25.749045+00:00 app[web.1]: return meth(self, multiparams, params) 2019-11-17T09:02:25.749047+00:00 app[web.1]: File "/app/.heroku/python/lib/python3.7/site-packages/sqlalchemy/sql/elements.py", line 287, in _execute_on_connection 2019-11-17T09:02:25.749048+00:00 app[web.1]: return connection._execute_clauseelement(self, multiparams, params) 2019-11-17T09:02:25.749050+00:00 app[web.1]: File "/app/.heroku/python/lib/python3.7/site-packages/sqlalchemy/engine/base.py", line 1107, in _execute_clauseelement 2019-11-17T09:02:25.749051+00:00 app[web.1]: distilled_params, 2019-11-17T09:02:25.749053+00:00 app[web.1]: File "/app/.heroku/python/lib/python3.7/site-packages/sqlalchemy/engine/base.py", line 1253, in _execute_context 2019-11-17T09:02:25.749054+00:00 app[web.1]: e, statement, parameters, cursor, context 2019-11-17T09:02:25.749056+00:00 app[web.1]: File "/app/.heroku/python/lib/python3.7/site-packages/sqlalchemy/engine/base.py", line 1473, in _handle_dbapi_exception 2019-11-17T09:02:25.749057+00:00 app[web.1]: util.raise_from_cause(sqlalchemy_exception, exc_info) 2019-11-17T09:02:25.749059+00:00 app[web.1]: File "/app/.heroku/python/lib/python3.7/site-packages/sqlalchemy/util/compat.py", line 398, in raise_from_cause 2019-11-17T09:02:25.749060+00:00 app[web.1]: reraise(type(exception), exception, tb=exc_tb, cause=cause) 2019-11-17T09:02:25.749062+00:00 app[web.1]: File "/app/.heroku/python/lib/python3.7/site-packages/sqlalchemy/util/compat.py", line 152, in reraise 2019-11-17T09:02:25.749063+00:00 app[web.1]: raise value.with_traceback(tb) 2019-11-17T09:02:25.749074+00:00 app[web.1]: File "/app/.heroku/python/lib/python3.7/site-packages/sqlalchemy/engine/base.py", line 1249, in _execute_context 2019-11-17T09:02:25.749076+00:00 app[web.1]: cursor, statement, parameters, context 2019-11-17T09:02:25.749078+00:00 app[web.1]: File "/app/.heroku/python/lib/python3.7/site-packages/sqlalchemy/engine/default.py", line 580, in do_execute 2019-11-17T09:02:25.749080+00:00 app[web.1]: cursor.execute(statement, parameters) 2019-11-17T09:02:25.749082+00:00 app[web.1]: sqlalchemy.exc.ProgrammingError: (psycopg2.errors.UndefinedTable) relation "question" does not exist 2019-11-17T09:02:25.749084+00:00 app[web.1]: LINE 2: FROM question ORDER BY question.create_time DESC 2019-11-17T09:02:25.749087+00:00 app[web.1]: ^ 2019-11-17T09:02:25.749089+00:00 app[web.1]: 2019-11-17T09:02:25.749092+00:00 app[web.1]: [SQL: SELECT question.id AS question_id, question.title AS question_title, question.content AS question_content, question.create_time AS question_create_time, question.author_id AS question_author_id 2019-11-17T09:02:25.749094+00:00 app[web.1]: FROM question ORDER BY question.create_time DESC] 2019-11-17T09:02:25.749096+00:00 app[web.1]: (Background on this error at: http://sqlalche.me/e/f405) 2019-11-17T09:02:25.749271+00:00 app[web.1]: 10.69.244.94 - - [17/Nov/2019:09:02:25 +0000] "GET / HTTP/1.1" 500 0 "-" "-" 2019-11-17T09:02:25.755053+00:00 heroku[router]: at=info method=GET path="/" host=tianliang-flask-app.herokuapp.com request_id=181975e4-7c78-4f7f-b131-4b1ddb544e02 fwd="58.182.174.147" dyno=web.1 connect=0ms service=92ms status=500 bytes=244 protocol=https 2019-11-17T09:06:00.663577+00:00 heroku[router]: at=info method=GET path="/" host=tianliang-flask-app.herokuapp.com request_id=571550f7-554b-42d0-b127-0a4837f6aae9 fwd="58.182.174.147" dyno=web.1 connect=1ms service=17ms status=500 bytes=244 protocol=https 2019-11-17T09:06:00.661593+00:00 app[web.1]: [2019-11-17 09:06:00 +0000] [11] [ERROR] Error handling request / 2019-11-17T09:06:00.661619+00:00 app[web.1]: Traceback (most recent call last): 2019-11-17T09:06:00.662439+00:00 app[web.1]: File "/app/.heroku/python/lib/python3.7/site-packages/sqlalchemy/engine/base.py", line 1249, in _execute_context 2019-11-17T09:06:00.662443+00:00 app[web.1]: cursor, statement, parameters, context 2019-11-17T09:06:00.662447+00:00 app[web.1]: File "/app/.heroku/python/lib/python3.7/site-packages/sqlalchemy/engine/default.py", line 580, in do_execute 2019-11-17T09:06:00.662449+00:00 app[web.1]: cursor.execute(statement, parameters) 2019-11-17T09:06:00.662452+00:00 app[web.1]: psycopg2.errors.UndefinedTable: relation "question" does not exist 2019-11-17T09:06:00.662455+00:00 app[web.1]: LINE 2: FROM question ORDER BY question.create_time DESC 2019-11-17T09:06:00.662457+00:00 app[web.1]: ^ 2019-11-17T09:06:00.662459+00:00 app[web.1]: 2019-11-17T09:06:00.662461+00:00 app[web.1]: 2019-11-17T09:06:00.662464+00:00 app[web.1]: The above exception was the direct cause of the following exception: 2019-11-17T09:06:00.662466+00:00 app[web.1]: 2019-11-17T09:06:00.662471+00:00 app[web.1]: Traceback (most recent call last): 2019-11-17T09:06:00.662473+00:00 app[web.1]: File "/app/.heroku/python/lib/python3.7/site-packages/gunicorn/workers/sync.py", line 134, in handle 2019-11-17T09:06:00.662476+00:00 app[web.1]: self.handle_request(listener, req, client, addr) 2019-11-17T09:06:00.662478+00:00 app[web.1]: File "/app/.heroku/python/lib/python3.7/site-packages/gunicorn/workers/sync.py", line 175, in handle_request 2019-11-17T09:06:00.662480+00:00 app[web.1]: respiter = self.wsgi(environ, resp.start_response) 2019-11-17T09:06:00.662483+00:00 app[web.1]: File "/app/.heroku/python/lib/python3.7/site-packages/flask/app.py", line 2463, in __call__ 2019-11-17T09:06:00.662486+00:00 app[web.1]: return self.wsgi_app(environ, start_response) 2019-11-17T09:06:00.662488+00:00 app[web.1]: File "/app/.heroku/python/lib/python3.7/site-packages/flask/app.py", line 2449, in wsgi_app 2019-11-17T09:06:00.662491+00:00 app[web.1]: response = self.handle_exception(e) 2019-11-17T09:06:00.662493+00:00 app[web.1]: File "/app/.heroku/python/lib/python3.7/site-packages/flask/app.py", line 1866, in handle_exception 2019-11-17T09:06:00.662495+00:00 app[web.1]: reraise(exc_type, exc_value, tb) 2019-11-17T09:06:00.662498+00:00 app[web.1]: File "/app/.heroku/python/lib/python3.7/site-packages/flask/_compat.py", line 39, in reraise 2019-11-17T09:06:00.662500+00:00 app[web.1]: raise value 2019-11-17T09:06:00.662502+00:00 app[web.1]: File "/app/.heroku/python/lib/python3.7/site-packages/flask/app.py", line 2446, in wsgi_app 2019-11-17T09:06:00.662505+00:00 app[web.1]: response = self.full_dispatch_request() 2019-11-17T09:06:00.662507+00:00 app[web.1]: File "/app/.heroku/python/lib/python3.7/site-packages/flask/app.py", line 1951, in full_dispatch_request 2019-11-17T09:06:00.662509+00:00 app[web.1]: rv = self.handle_user_exception(e) 2019-11-17T09:06:00.662511+00:00 app[web.1]: File "/app/.heroku/python/lib/python3.7/site-packages/flask/app.py", line 1820, in handle_user_exception 2019-11-17T09:06:00.662513+00:00 app[web.1]: reraise(exc_type, exc_value, tb) 2019-11-17T09:06:00.662515+00:00 app[web.1]: File "/app/.heroku/python/lib/python3.7/site-packages/flask/_compat.py", line 39, in reraise 2019-11-17T09:06:00.662517+00:00 app[web.1]: raise value 2019-11-17T09:06:00.662519+00:00 app[web.1]: File "/app/.heroku/python/lib/python3.7/site-packages/flask/app.py", line 1949, in full_dispatch_request 2019-11-17T09:06:00.662521+00:00 app[web.1]: rv = self.dispatch_request() 2019-11-17T09:06:00.662523+00:00 app[web.1]: File "/app/.heroku/python/lib/python3.7/site-packages/flask/app.py", line 1935, in dispatch_request 2019-11-17T09:06:00.662526+00:00 app[web.1]: return self.view_functions[rule.endpoint](**req.view_args) 2019-11-17T09:06:00.662528+00:00 app[web.1]: File "/app/project.py", line 27, in index 2019-11-17T09:06:00.662530+00:00 app[web.1]: 'questions': Questions.query.order_by(desc('create_time')).all() 2019-11-17T09:06:00.662532+00:00 app[web.1]: File "/app/.heroku/python/lib/python3.7/site-packages/sqlalchemy/orm/query.py", line 3186, in all 2019-11-17T09:06:00.662535+00:00 app[web.1]: return list(self) 2019-11-17T09:06:00.662537+00:00 app[web.1]: File "/app/.heroku/python/lib/python3.7/site-packages/sqlalchemy/orm/query.py", line 3342, in __iter__ 2019-11-17T09:06:00.662539+00:00 app[web.1]: return self._execute_and_instances(context) 2019-11-17T09:06:00.662541+00:00 app[web.1]: File "/app/.heroku/python/lib/python3.7/site-packages/sqlalchemy/orm/query.py", line 3367, in _execute_and_instances 2019-11-17T09:06:00.662544+00:00 app[web.1]: result = conn.execute(querycontext.statement, self._params) 2019-11-17T09:06:00.662546+00:00 app[web.1]: File "/app/.heroku/python/lib/python3.7/site-packages/sqlalchemy/engine/base.py", line 988, in execute 2019-11-17T09:06:00.662548+00:00 app[web.1]: return meth(self, multiparams, params) 2019-11-17T09:06:00.662550+00:00 app[web.1]: File "/app/.heroku/python/lib/python3.7/site-packages/sqlalchemy/sql/elements.py", line 287, in _execute_on_connection 2019-11-17T09:06:00.662552+00:00 app[web.1]: return connection._execute_clauseelement(self, multiparams, params) 2019-11-17T09:06:00.662555+00:00 app[web.1]: File "/app/.heroku/python/lib/python3.7/site-packages/sqlalchemy/engine/base.py", line 1107, in _execute_clauseelement 2019-11-17T09:06:00.662557+00:00 app[web.1]: distilled_params, 2019-11-17T09:06:00.662559+00:00 app[web.1]: File "/app/.heroku/python/lib/python3.7/site-packages/sqlalchemy/engine/base.py", line 1253, in _execute_context 2019-11-17T09:06:00.662562+00:00 app[web.1]: e, statement, parameters, cursor, context 2019-11-17T09:06:00.662564+00:00 app[web.1]: File "/app/.heroku/python/lib/python3.7/site-packages/sqlalchemy/engine/base.py", line 1473, in _handle_dbapi_exception 2019-11-17T09:06:00.662566+00:00 app[web.1]: util.raise_from_cause(sqlalchemy_exception, exc_info) 2019-11-17T09:06:00.662568+00:00 app[web.1]: File "/app/.heroku/python/lib/python3.7/site-packages/sqlalchemy/util/compat.py", line 398, in raise_from_cause 2019-11-17T09:06:00.662570+00:00 app[web.1]: reraise(type(exception), exception, tb=exc_tb, cause=cause) 2019-11-17T09:06:00.662573+00:00 app[web.1]: File "/app/.heroku/python/lib/python3.7/site-packages/sqlalchemy/util/compat.py", line 152, in reraise 2019-11-17T09:06:00.662575+00:00 app[web.1]: raise value.with_traceback(tb) 2019-11-17T09:06:00.662587+00:00 app[web.1]: File "/app/.heroku/python/lib/python3.7/site-packages/sqlalchemy/engine/base.py", line 1249, in _execute_context 2019-11-17T09:06:00.662590+00:00 app[web.1]: cursor, statement, parameters, context 2019-11-17T09:06:00.662592+00:00 app[web.1]: File "/app/.heroku/python/lib/python3.7/site-packages/sqlalchemy/engine/default.py", line 580, in do_execute 2019-11-17T09:06:00.662594+00:00 app[web.1]: cursor.execute(statement, parameters) 2019-11-17T09:06:00.662596+00:00 app[web.1]: sqlalchemy.exc.ProgrammingError: (psycopg2.errors.UndefinedTable) relation "question" does not exist 2019-11-17T09:06:00.662599+00:00 app[web.1]: LINE 2: FROM question ORDER BY question.create_time DESC 2019-11-17T09:06:00.662601+00:00 app[web.1]: ^ 2019-11-17T09:06:00.662603+00:00 app[web.1]: 2019-11-17T09:06:00.662607+00:00 app[web.1]: [SQL: SELECT question.id AS question_id, question.title AS question_title, question.content AS question_content, question.create_time AS question_create_time, question.author_id AS question_author_id 2019-11-17T09:06:00.662609+00:00 app[web.1]: FROM question ORDER BY question.create_time DESC] ```
在VC++6.0上编译运行没问题,在LintCode上编译出了问题,是哪里有问题?
``` //功能:输入两个整数,计算并输出它们的和 //语言:C++ #include<iostream> using namespace std; int main() { int a,b,sum; cin >> a >> b; //输入这两个数 sum = a + b; cout << sum << endl; //输出和 return 0; } ``` 上面的代码在Visual C++6.0上运行没有任何问题,但在LintCode上面会出现如下错误警告,但我看不懂。 ``` /code/Main.cpp: In function 'int main(int, char**)': /code/Main.cpp:29:32: error: conflicting declaration of C function 'int main(int, char**)' int main(int argc, char *argv[]) { ^ In file included from /code/Main.cpp:27:0: /code/Solution.cpp:5:5: note: previous declaration 'int main()' int main() ^ /code/Main.cpp:58:9: error: 'Solution' was not declared in this scope Solution solution; ^ /code/Main.cpp:60:15: error: 'solution' was not declared in this scope ans = solution.aplusb(a, b); ^ ``` 哪里有问题呢?
ElasticSearch6.3.1 jdbc连接提示Original type was [request [/_xpack/sql] contains unrecognized parameter: [mode]].
在maven pom文件中添加一下: ``` <dependency> <groupId>org.elasticsearch.plugin</groupId> <artifactId>jdbc</artifactId> <version>6.3.1</version> </dependency> ``` ``` <repositories> <repository> <id>elastic.co</id> <url>https://artifacts.elastic.co/maven</url> </repository> </repositories> ``` 同时也下载了jar: https://artifacts.elastic.co/maven/org/elasticsearch/plugin/jdbc/6.3.1/jdbc-6.3.1.jar 并放入maven相关位置。 接下来准备使用jdbc连接es,代码如下: 连接es: ``` public static void startPool(String driveName, String url, String sql) throws Exception { Class.forName(driveName); Connection connection = DriverManager.getConnection(url, connectionProperties); Statement statement = connection.createStatement(); ResultSet resultSet = statement.executeQuery(sql); int num = 0; while (resultSet.next()) { num = 1; } if (num == 1) { System.out.println("es可以连接"); } else { System.out.println("es不可以连接,请重试"); } } ``` 执行: ``` public void initDBSource() throws Exception { SQLUtil.startPool( "org.elasticsearch.xpack.sql.jdbc.jdbc.JdbcDriver",//ES jdbc驱动 "jdbc:es://http://192.168.38.12:9200",//es链接串 "SHOW tables like \\u0027data%\\u0027" //数据源连接校验sql ); } ``` 结果: ``` Exception in thread "main" java.sql.SQLException: Server sent bad type [illegal_argument_exception]. Original type was [request [/_xpack/sql] contains unrecognized parameter: [mode]]. [java.lang.IllegalArgumentException: request [/_xpack/sql] contains unrecognized parameter: [mode] at org.elasticsearch.rest.BaseRestHandler.handleRequest(BaseRestHandler.java:103) at org.elasticsearch.xpack.security.rest.SecurityRestFilter.handleRequest(SecurityRestFilter.java:87) at org.elasticsearch.rest.RestController.dispatchRequest(RestController.java:240) at org.elasticsearch.rest.RestController.tryAllHandlers(RestController.java:336) at org.elasticsearch.rest.RestController.dispatchRequest(RestController.java:174) at org.elasticsearch.http.netty4.Netty4HttpServerTransport.dispatchRequest(Netty4HttpServerTransport.java:551) at org.elasticsearch.http.netty4.Netty4HttpRequestHandler.channelRead0(Netty4HttpRequestHandler.java:137) at io.netty.channel.SimpleChannelInboundHandler.channelRead(SimpleChannelInboundHandler.java:105) at io.netty.channel.AbstractChannelHandlerContext.invokeChannelRead(AbstractChannelHandlerContext.java:362) at io.netty.channel.AbstractChannelHandlerContext.invokeChannelRead(AbstractChannelHandlerContext.java:348) at io.netty.channel.AbstractChannelHandlerContext.fireChannelRead(AbstractChannelHandlerContext.java:340) at org.elasticsearch.http.netty4.pipelining.HttpPipeliningHandler.channelRead(HttpPipeliningHandler.java:68) at io.netty.channel.AbstractChannelHandlerContext.invokeChannelRead(AbstractChannelHandlerContext.java:362) at io.netty.channel.AbstractChannelHandlerContext.invokeChannelRead(AbstractChannelHandlerContext.java:348) at io.netty.channel.AbstractChannelHandlerContext.fireChannelRead(AbstractChannelHandlerContext.java:340) at org.elasticsearch.http.netty4.cors.Netty4CorsHandler.channelRead(Netty4CorsHandler.java:86) at io.netty.channel.AbstractChannelHandlerContext.invokeChannelRead(AbstractChannelHandlerContext.java:362) at io.netty.channel.AbstractChannelHandlerContext.invokeChannelRead(AbstractChannelHandlerContext.java:348) at io.netty.channel.AbstractChannelHandlerContext.fireChannelRead(AbstractChannelHandlerContext.java:340) at io.netty.handler.codec.MessageToMessageDecoder.channelRead(MessageToMessageDecoder.java:102) at io.netty.handler.codec.MessageToMessageCodec.channelRead(MessageToMessageCodec.java:111) at io.netty.channel.AbstractChannelHandlerContext.invokeChannelRead(AbstractChannelHandlerContext.java:362) at io.netty.channel.AbstractChannelHandlerContext.invokeChannelRead(AbstractChannelHandlerContext.java:348) at io.netty.channel.AbstractChannelHandlerContext.fireChannelRead(AbstractChannelHandlerContext.java:340) at io.netty.handler.codec.MessageToMessageDecoder.channelRead(MessageToMessageDecoder.java:102) at io.netty.channel.AbstractChannelHandlerContext.invokeChannelRead(AbstractChannelHandlerContext.java:362) at io.netty.channel.AbstractChannelHandlerContext.invokeChannelRead(AbstractChannelHandlerContext.java:348) at io.netty.channel.AbstractChannelHandlerContext.fireChannelRead(AbstractChannelHandlerContext.java:340) at io.netty.handler.codec.MessageToMessageDecoder.channelRead(MessageToMessageDecoder.java:102) at io.netty.channel.AbstractChannelHandlerContext.invokeChannelRead(AbstractChannelHandlerContext.java:362) at io.netty.channel.AbstractChannelHandlerContext.invokeChannelRead(AbstractChannelHandlerContext.java:348) at io.netty.channel.AbstractChannelHandlerContext.fireChannelRead(AbstractChannelHandlerContext.java:340) at io.netty.handler.codec.ByteToMessageDecoder.fireChannelRead(ByteToMessageDecoder.java:323) at io.netty.handler.codec.ByteToMessageDecoder.channelRead(ByteToMessageDecoder.java:297) at io.netty.channel.AbstractChannelHandlerContext.invokeChannelRead(AbstractChannelHandlerContext.java:362) at io.netty.channel.AbstractChannelHandlerContext.invokeChannelRead(AbstractChannelHandlerContext.java:348) at io.netty.channel.AbstractChannelHandlerContext.fireChannelRead(AbstractChannelHandlerContext.java:340) at io.netty.handler.timeout.IdleStateHandler.channelRead(IdleStateHandler.java:286) at io.netty.channel.AbstractChannelHandlerContext.invokeChannelRead(AbstractChannelHandlerContext.java:362) at io.netty.channel.AbstractChannelHandlerContext.invokeChannelRead(AbstractChannelHandlerContext.java:348) at io.netty.channel.AbstractChannelHandlerContext.fireChannelRead(AbstractChannelHandlerContext.java:340) at io.netty.channel.ChannelInboundHandlerAdapter.channelRead(ChannelInboundHandlerAdapter.java:86) at io.netty.channel.AbstractChannelHandlerContext.invokeChannelRead(AbstractChannelHandlerContext.java:362) at io.netty.channel.AbstractChannelHandlerContext.invokeChannelRead(AbstractChannelHandlerContext.java:348) at io.netty.channel.AbstractChannelHandlerContext.fireChannelRead(AbstractChannelHandlerContext.java:340) at io.netty.channel.DefaultChannelPipeline$HeadContext.channelRead(DefaultChannelPipeline.java:1434) at io.netty.channel.AbstractChannelHandlerContext.invokeChannelRead(AbstractChannelHandlerContext.java:362) at io.netty.channel.AbstractChannelHandlerContext.invokeChannelRead(AbstractChannelHandlerContext.java:348) at io.netty.channel.DefaultChannelPipeline.fireChannelRead(DefaultChannelPipeline.java:965) at io.netty.channel.nio.AbstractNioByteChannel$NioByteUnsafe.read(AbstractNioByteChannel.java:163) at io.netty.channel.nio.NioEventLoop.processSelectedKey(NioEventLoop.java:656) at io.netty.channel.nio.NioEventLoop.processSelectedKeysPlain(NioEventLoop.java:556) at io.netty.channel.nio.NioEventLoop.processSelectedKeys(NioEventLoop.java:510) at io.netty.channel.nio.NioEventLoop.run(NioEventLoop.java:470) at io.netty.util.concurrent.SingleThreadEventExecutor$5.run(SingleThreadEventExecutor.java:909) at java.lang.Thread.run(Thread.java:748) ] at org.elasticsearch.xpack.sql.client.shared.JreHttpUrlConnection.parserError(JreHttpUrlConnection.java:181) at org.elasticsearch.xpack.sql.client.shared.JreHttpUrlConnection.request(JreHttpUrlConnection.java:158) at org.elasticsearch.xpack.sql.client.HttpClient.lambda$post$0(HttpClient.java:101) at org.elasticsearch.xpack.sql.client.shared.JreHttpUrlConnection.http(JreHttpUrlConnection.java:62) at org.elasticsearch.xpack.sql.client.HttpClient.lambda$post$1(HttpClient.java:100) at java.security.AccessController.doPrivileged(Native Method) at org.elasticsearch.xpack.sql.client.HttpClient.post(HttpClient.java:99) at org.elasticsearch.xpack.sql.client.HttpClient.query(HttpClient.java:77) at org.elasticsearch.xpack.sql.jdbc.net.client.JdbcHttpClient.query(JdbcHttpClient.java:51) at org.elasticsearch.xpack.sql.jdbc.jdbc.JdbcStatement.initResultSet(JdbcStatement.java:162) at org.elasticsearch.xpack.sql.jdbc.jdbc.JdbcStatement.execute(JdbcStatement.java:153) at org.elasticsearch.xpack.sql.jdbc.jdbc.JdbcStatement.executeQuery(JdbcStatement.java:42) at com.rh.dome.util.ESJDBCTest2.main(ESJDBCTest2.java:32) Process finished with exit code 1 ``` 不知道出现什么问题,在百度上官网上都查不到此类错误 经过一番努力,终于发现问题所在,原因是:JDBC的驱动包跟服务器上的es版本不一致。 一定要一致,哪怕版本很接近,也会出现驱动包兼容问题!!!
Linux环境安装oracle11g出现下述错误信息。
``` [FATAL] [INS-32012] Unable to create directory. CAUSE: Either proper permissions were not granted to create the directory or there was no space left in the volume. ACTION: Check your permission on the selected directory or choose another directory. A log of this session is currently saved as: /tmp/OraInstall2020-01-20_06-06-49AM/installActions2020-01-20_06-06-49AM.log. Oracle recommends that if you want to keep this log, you should move it from the temporary location to a more permanent location. ```
求助帖!!!ubuntu18.04 安装opencv4.0.0源码无限次出现如下问题
./src/image_opencv.cpp: In function ‘IplImage* image_to_ipl(image)’: ./src/image_opencv.cpp:16:5: error: ‘IPlImage’ was not declared in this scope IPlImage *disp = cvCreateImage(cvSize(im.w,im.h), IPL_DEPTH_8U, im.c); ^~~~~~~~ compilation terminated due to -Wfatal-errors. Makefile:86: recipe for target 'obj/image_opencv.o' failed make: *** [obj/image_opencv.o] Error 1 make: *** Waiting for unfinished jobs.... 但我在src文件夹中的image_opencv.cpp中也引入了#include "opencv2/imgproc/imgproc_c.h" 求助实在不知道怎么办了
Genghis Khan the Conqueror 征服的问题
Problem Description Genghis Khan(成吉思汗)(1162-1227), also known by his birth name Temujin(铁木真) and temple name Taizu(元太祖), was the founder of the Mongol Empire and the greatest conqueror in Chinese history. After uniting many of the nomadic tribes on the Mongolian steppe, Genghis Khan founded a strong cavalry equipped by irony discipline, sabers and powder, and he became to the most fearsome conqueror in the history. He stretched the empire that resulted in the conquest of most of Eurasia. The following figure (origin: Wikipedia) shows the territory of Mongol Empire at that time. Our story is about Jebei Noyan(哲别), who was one of the most famous generals in Genghis Khan’s cavalry. Once his led the advance troop to invade a country named Pushtuar. The knights rolled up all the cities in Pushtuar rapidly. As Jebei Noyan’s advance troop did not have enough soldiers, the conquest was temporary and vulnerable and he was waiting for the Genghis Khan’s reinforce. At the meantime, Jebei Noyan needed to set up many guarders on the road of the country in order to guarantee that his troop in each city can send and receive messages safely and promptly through those roads. There were N cities in Pushtuar and there were bidirectional roads connecting cities. If Jebei set up guarders on a road, it was totally safe to deliver messages between the two cities connected by the road. However setting up guarders on different road took different cost based on the distance, road condition and the residual armed power nearby. Jebei had known the cost of setting up guarders on each road. He wanted to guarantee that each two cities can safely deliver messages either directly or indirectly and the total cost was minimal. Things will always get a little bit harder. As a sophisticated general, Jebei predicted that there would be one uprising happening in the country sooner or later which might increase the cost (setting up guarders) on exactly ONE road. Nevertheless he did not know which road would be affected, but only got the information of some suspicious road cost changes. We assumed that the probability of each suspicious case was the same. Since that after the uprising happened, the plan of guarder setting should be rearranged to achieve the minimal cost, Jebei Noyan wanted to know the new expected minimal total cost immediately based on current information. Input There are no more than 20 test cases in the input. For each test case, the first line contains two integers N and M (1<=N<=3000, 0<=M<=N×N), demonstrating the number of cities and roads in Pushtuar. Cities are numbered from 0 to N-1. In the each of the following M lines, there are three integers xi, yi and ci(ci<=107), showing that there is a bidirectional road between xi and yi, while the cost of setting up guarders on this road is ci. We guarantee that the graph is connected. The total cost of the graph is less or equal to 109. The next line contains an integer Q (1<=Q<=10000) representing the number of suspicious road cost changes. In the following Q lines, each line contains three integers Xi, Yi and Ci showing that the cost of road (Xi, Yi) may change to Ci (Ci<=107). We guarantee that the road always exists and Ci is larger than the original cost (we guarantee that there is at most one road connecting two cities directly). Please note that the probability of each suspicious road cost change is the same. Output For each test case, output a real number demonstrating the expected minimal total cost. The result should be rounded to 4 digits after decimal point. Sample Input 3 3 0 1 3 0 2 2 1 2 5 3 0 2 3 1 2 6 0 1 6 0 0 Sample Output 6.0000
Crank 的问题
Problem Description Chev Chelios had his heart stolen from him, by the boss of the most dangerous gang in the city. His heart has been replaced with an artificial chargeable one! Chelios was on mission of locating the boss of the gang to get his heart back since then without luck! Now the artificial heart’s battery lifetime is about to expire! Fortunately, he finally located the target but he needs your help to get there before his artificial heart stops beating! Chelios decided to attack the boss building from the roof because all gates are heavily protected by gangsters. Chelios has the map of the gang block which shows the heights of all buildings within the block. The plan is that a helicopter will drop Chelios on the roof of one of the buildings on the boundary of the block during night. Then Chelios will get to the boss building by moving to adjacent buildings, vertically or horizontally. Chelios can only move to a building which has the same or smaller height as the current building (going up severely affects his damaged heart). Given the gang building block map which shows the heights of all buildings in the block along with the boss building, write a program to help Chev Chelios determine the number of buildings on the boundary of the block he can be dropped by the helicopter at so that he would be able to reach the boss’s building without climbing! Input The first line of input contains an integer T, the number of test cases. T test cases follow, the first line of each test case contains two integers (1 <= R,C <= 10) the height and width of the building block. The second line contains two integers (1 <= A <= R), and (1 <= B <= C), the coordinates of the boss building on the map. R lines follows; each line consists of C space separated integers representing the heights of all buildings. A height H of a building satisfies (1 <= H <= 1000). Output For each test case, print the number of buildings on the boundary of the block Chev Chelios can be dropped by the helicopter at so that he would be able to reach the boss’s building without climbing up! Follow the output format below. Sample Input 2 3 3 2 2 1 7 3 2 6 3 3 5 4 2 2 2 1 2 7 2 6 Sample Output Case #1: 1 Case #2: 4
从同事能运行的eclipse导入到IDEA的项目配置过tomcat后报严重 [RMI TCP Connection(3)-127.0.0.1] 错误
"C:\Program Files\Apache Software Foundation\Tomcat 8.0\bin\catalina.bat" run [2020-01-04 01:22:07,300] Artifact susong:war exploded: Waiting for server connection to start artifact deployment... Using CATALINA_BASE: "C:\Users\cd\.IntelliJIdea2018.1\system\tomcat\Unnamed_wuranyuan" Using CATALINA_HOME: "C:\Program Files\Apache Software Foundation\Tomcat 8.0" Using CATALINA_TMPDIR: "C:\Program Files\Apache Software Foundation\Tomcat 8.0\temp" Using JRE_HOME: "C:\Program Files\Java\jdk1.7.0_80" Using CLASSPATH: "C:\Program Files\Apache Software Foundation\Tomcat 8.0\bin\bootstrap.jar;C:\Program Files\Apache Software Foundation\Tomcat 8.0\bin\tomcat-juli.jar" 04-Jan-2020 13:22:13.122 信息 [main] org.apache.catalina.startup.VersionLoggerListener.log Server version: Apache Tomcat/8.0.47 04-Jan-2020 13:22:13.125 信息 [main] org.apache.catalina.startup.VersionLoggerListener.log Server built: Sep 29 2017 13:46:41 UTC 04-Jan-2020 13:22:13.125 信息 [main] org.apache.catalina.startup.VersionLoggerListener.log Server number: 8.0.47.0 04-Jan-2020 13:22:13.125 信息 [main] org.apache.catalina.startup.VersionLoggerListener.log OS Name: Windows 7 04-Jan-2020 13:22:13.125 信息 [main] org.apache.catalina.startup.VersionLoggerListener.log OS Version: 6.1 04-Jan-2020 13:22:13.125 信息 [main] org.apache.catalina.startup.VersionLoggerListener.log Architecture: amd64 04-Jan-2020 13:22:13.125 信息 [main] org.apache.catalina.startup.VersionLoggerListener.log Java Home: C:\Program Files\Java\jdk1.7.0_80\jre 04-Jan-2020 13:22:13.125 信息 [main] org.apache.catalina.startup.VersionLoggerListener.log JVM Version: 1.7.0_80-b15 04-Jan-2020 13:22:13.125 信息 [main] org.apache.catalina.startup.VersionLoggerListener.log JVM Vendor: Oracle Corporation 04-Jan-2020 13:22:13.125 信息 [main] org.apache.catalina.startup.VersionLoggerListener.log CATALINA_BASE: C:\Users\cd\.IntelliJIdea2018.1\system\tomcat\Unnamed_wuranyuan 04-Jan-2020 13:22:13.125 信息 [main] org.apache.catalina.startup.VersionLoggerListener.log CATALINA_HOME: C:\Program Files\Apache Software Foundation\Tomcat 8.0 04-Jan-2020 13:22:13.126 信息 [main] org.apache.catalina.startup.VersionLoggerListener.log Command line argument: -Djava.util.logging.config.file=C:\Users\cd\.IntelliJIdea2018.1\system\tomcat\Unnamed_wuranyuan\conf\logging.properties 04-Jan-2020 13:22:13.126 信息 [main] org.apache.catalina.startup.VersionLoggerListener.log Command line argument: -Djava.util.logging.manager=org.apache.juli.ClassLoaderLogManager 04-Jan-2020 13:22:13.126 信息 [main] org.apache.catalina.startup.VersionLoggerListener.log Command line argument: -Dcom.sun.management.jmxremote= 04-Jan-2020 13:22:13.126 信息 [main] org.apache.catalina.startup.VersionLoggerListener.log Command line argument: -Dcom.sun.management.jmxremote.port=1099 04-Jan-2020 13:22:13.126 信息 [main] org.apache.catalina.startup.VersionLoggerListener.log Command line argument: -Dcom.sun.management.jmxremote.ssl=false 04-Jan-2020 13:22:13.126 信息 [main] org.apache.catalina.startup.VersionLoggerListener.log Command line argument: -Dcom.sun.management.jmxremote.authenticate=false 04-Jan-2020 13:22:13.126 信息 [main] org.apache.catalina.startup.VersionLoggerListener.log Command line argument: -Djava.rmi.server.hostname=127.0.0.1 04-Jan-2020 13:22:13.126 信息 [main] org.apache.catalina.startup.VersionLoggerListener.log Command line argument: -Djdk.tls.ephemeralDHKeySize=2048 04-Jan-2020 13:22:13.126 信息 [main] org.apache.catalina.startup.VersionLoggerListener.log Command line argument: -Djava.protocol.handler.pkgs=org.apache.catalina.webresources 04-Jan-2020 13:22:13.126 信息 [main] org.apache.catalina.startup.VersionLoggerListener.log Command line argument: -Djava.endorsed.dirs=C:\Program Files\Apache Software Foundation\Tomcat 8.0\endorsed 04-Jan-2020 13:22:13.126 信息 [main] org.apache.catalina.startup.VersionLoggerListener.log Command line argument: -Dcatalina.base=C:\Users\cd\.IntelliJIdea2018.1\system\tomcat\Unnamed_wuranyuan 04-Jan-2020 13:22:13.126 信息 [main] org.apache.catalina.startup.VersionLoggerListener.log Command line argument: -Dcatalina.home=C:\Program Files\Apache Software Foundation\Tomcat 8.0 04-Jan-2020 13:22:13.126 信息 [main] org.apache.catalina.startup.VersionLoggerListener.log Command line argument: -Djava.io.tmpdir=C:\Program Files\Apache Software Foundation\Tomcat 8.0\temp 04-Jan-2020 13:22:13.126 信息 [main] org.apache.catalina.core.AprLifecycleListener.lifecycleEvent The APR based Apache Tomcat Native library which allows optimal performance in production environments was not found on the java.library.path: C:\Program Files\Java\jdk1.7.0_80\bin;C:\WINDOWS\Sun\Java\bin;C:\WINDOWS\system32;C:\WINDOWS;C:\ProgramData\Oracle\Java\javapath;C:\Program Files (x86)\Intel\Intel(R) Management Engine Components\iCLS\;C:\Program Files\Intel\Intel(R) Management Engine Components\iCLS\;C:\Windows\system32;C:\Windows;C:\Windows\System32\Wbem;C:\Windows\System32\WindowsPowerShell\v1.0\;C:\Program Files (x86)\NVIDIA Corporation\PhysX\Common;C:\Program Files (x86)\Intel\Intel(R) Management Engine Components\DAL;C:\Program Files\Intel\Intel(R) Management Engine Components\DAL;C:\Program Files (x86)\Intel\Intel(R) Management Engine Components\IPT;C:\Program Files\Intel\Intel(R) Management Engine Components\IPT;C:\Program Files\Intel\WiFi\bin\;C:\Program Files\Common Files\Intel\WirelessCommon\;D:\Program Files (x86)\Microsoft SQL Server\100\Tools\Binn\;D:\Program Files\Microsoft SQL Server\100\Tools\Binn\;D:\Program Files\Microsoft SQL Server\100\DTS\Binn\;D:\Program Files (x86)\Microsoft SQL Server\100\Tools\Binn\VSShell\Common7\IDE\;D:\Program Files (x86)\Microsoft SQL Server\100\DTS\Binn\;C:\Program Files (x86)\Windows Kits\8.1\Windows Performance Toolkit\;C:\Program Files\Microsoft SQL Server\110\Tools\Binn\;C:\Program Files (x86)\SMART Technologies\Education Software\;C:\WINDOWS\system32;C:\WINDOWS;C:\WINDOWS\System32\Wbem;C:\WINDOWS\System32\WindowsPowerShell\v1.0\;C:\WINDOWS\System32\OpenSSH\;C:\Program Files\TortoiseSVN\bin;C:\Program Files (x86)\CADSeePlus;F:\software\ANDROID\android-sdk-windows\platform-tools;E:\opencv\opencv\build\x64\vc12\bin;E:\opencv\opencv\build\x86\vc12\bin;C:\Program Files (x86)\税务证书应用客户端;.\Library;.\Security\BiSafe;.\Security\Koal;C:\Users\cd\AppData\Local\Microsoft\WindowsApps;C:\Program Files\Java\jdk1.8.0_131\bin;D:\Program Files\Apache\maven\bin;. 04-Jan-2020 13:22:13.227 信息 [main] org.apache.coyote.AbstractProtocol.init Initializing ProtocolHandler ["http-nio-8080"] 04-Jan-2020 13:22:13.256 信息 [main] org.apache.tomcat.util.net.NioSelectorPool.getSharedSelector Using a shared selector for servlet write/read 04-Jan-2020 13:22:13.259 信息 [main] org.apache.coyote.AbstractProtocol.init Initializing ProtocolHandler ["ajp-nio-8009"] 04-Jan-2020 13:22:13.270 信息 [main] org.apache.tomcat.util.net.NioSelectorPool.getSharedSelector Using a shared selector for servlet write/read 04-Jan-2020 13:22:13.270 信息 [main] org.apache.catalina.startup.Catalina.load Initialization processed in 439 ms 04-Jan-2020 13:22:13.296 信息 [main] org.apache.catalina.core.StandardService.startInternal Starting service Catalina 04-Jan-2020 13:22:13.296 信息 [main] org.apache.catalina.core.StandardEngine.startInternal Starting Servlet Engine: Apache Tomcat/8.0.47 04-Jan-2020 13:22:13.306 信息 [main] org.apache.coyote.AbstractProtocol.start Starting ProtocolHandler ["http-nio-8080"] 04-Jan-2020 13:22:13.327 信息 [main] org.apache.coyote.AbstractProtocol.start Starting ProtocolHandler ["ajp-nio-8009"] 04-Jan-2020 13:22:13.343 信息 [main] org.apache.catalina.startup.Catalina.start Server startup in 72 ms Connected to server [2020-01-04 01:22:13,389] Artifact susong:war exploded: Artifact is being deployed, please wait... 04-Jan-2020 13:22:17.320 严重 [RMI TCP Connection(3)-127.0.0.1] org.apache.catalina.core.ContainerBase.addChildInternal ContainerBase.addChild: start: org.apache.catalina.LifecycleException: Failed to start component [StandardEngine[Catalina].StandardHost[localhost].StandardContext[]] at org.apache.catalina.util.LifecycleBase.start(LifecycleBase.java:162) at org.apache.catalina.core.ContainerBase.addChildInternal(ContainerBase.java:753) at org.apache.catalina.core.ContainerBase.addChild(ContainerBase.java:729) at org.apache.catalina.core.StandardHost.addChild(StandardHost.java:717) at org.apache.catalina.startup.HostConfig.manageApp(HostConfig.java:1733) at sun.reflect.NativeMethodAccessorImpl.invoke0(Native Method) at sun.reflect.NativeMethodAccessorImpl.invoke(NativeMethodAccessorImpl.java:57) at sun.reflect.DelegatingMethodAccessorImpl.invoke(DelegatingMethodAccessorImpl.java:43) at java.lang.reflect.Method.invoke(Method.java:606) at org.apache.tomcat.util.modeler.BaseModelMBean.invoke(BaseModelMBean.java:300) at com.sun.jmx.interceptor.DefaultMBeanServerInterceptor.invoke(DefaultMBeanServerInterceptor.java:819) at com.sun.jmx.mbeanserver.JmxMBeanServer.invoke(JmxMBeanServer.java:801) at org.apache.catalina.mbeans.MBeanFactory.createStandardContext(MBeanFactory.java:484) at org.apache.catalina.mbeans.MBeanFactory.createStandardContext(MBeanFactory.java:433) at sun.reflect.NativeMethodAccessorImpl.invoke0(Native Method) at sun.reflect.NativeMethodAccessorImpl.invoke(NativeMethodAccessorImpl.java:57) at sun.reflect.DelegatingMethodAccessorImpl.invoke(DelegatingMethodAccessorImpl.java:43) at java.lang.reflect.Method.invoke(Method.java:606) at org.apache.tomcat.util.modeler.BaseModelMBean.invoke(BaseModelMBean.java:300) at com.sun.jmx.interceptor.DefaultMBeanServerInterceptor.invoke(DefaultMBeanServerInterceptor.java:819) at com.sun.jmx.mbeanserver.JmxMBeanServer.invoke(JmxMBeanServer.java:801) at javax.management.remote.rmi.RMIConnectionImpl.doOperation(RMIConnectionImpl.java:1487) at javax.management.remote.rmi.RMIConnectionImpl.access$300(RMIConnectionImpl.java:97) at javax.management.remote.rmi.RMIConnectionImpl$PrivilegedOperation.run(RMIConnectionImpl.java:1328) at javax.management.remote.rmi.RMIConnectionImpl.doPrivilegedOperation(RMIConnectionImpl.java:1420) at javax.management.remote.rmi.RMIConnectionImpl.invoke(RMIConnectionImpl.java:848) at sun.reflect.NativeMethodAccessorImpl.invoke0(Native Method) at sun.reflect.NativeMethodAccessorImpl.invoke(NativeMethodAccessorImpl.java:57) at sun.reflect.DelegatingMethodAccessorImpl.invoke(DelegatingMethodAccessorImpl.java:43) at java.lang.reflect.Method.invoke(Method.java:606) at sun.rmi.server.UnicastServerRef.dispatch(UnicastServerRef.java:322) at sun.rmi.transport.Transport$2.run(Transport.java:202) at sun.rmi.transport.Transport$2.run(Transport.java:199) at java.security.AccessController.doPrivileged(Native Method) at sun.rmi.transport.Transport.serviceCall(Transport.java:198) at sun.rmi.transport.tcp.TCPTransport.handleMessages(TCPTransport.java:567) at sun.rmi.transport.tcp.TCPTransport$ConnectionHandler.run0(TCPTransport.java:828) at sun.rmi.transport.tcp.TCPTransport$ConnectionHandler.access$400(TCPTransport.java:619) at sun.rmi.transport.tcp.TCPTransport$ConnectionHandler$1.run(TCPTransport.java:684) at sun.rmi.transport.tcp.TCPTransport$ConnectionHandler$1.run(TCPTransport.java:681) at java.security.AccessController.doPrivileged(Native Method) at sun.rmi.transport.tcp.TCPTransport$ConnectionHandler.run(TCPTransport.java:681) at java.util.concurrent.ThreadPoolExecutor.runWorker(ThreadPoolExecutor.java:1145) at java.util.concurrent.ThreadPoolExecutor$Worker.run(ThreadPoolExecutor.java:615) at java.lang.Thread.run(Thread.java:745) Caused by: java.lang.NoClassDefFoundError: org/apache/commons/configuration/ConfigurationException at java.lang.Class.getDeclaredFields0(Native Method) at java.lang.Class.privateGetDeclaredFields(Class.java:2509) at java.lang.Class.getDeclaredFields(Class.java:1819) at org.apache.catalina.util.Introspection.getDeclaredFields(Introspection.java:106) at org.apache.catalina.startup.WebAnnotationSet.loadFieldsAnnotation(WebAnnotationSet.java:256) at org.apache.catalina.startup.WebAnnotationSet.loadApplicationListenerAnnotations(WebAnnotationSet.java:86) at org.apache.catalina.startup.WebAnnotationSet.loadApplicationAnnotations(WebAnnotationSet.java:63) at org.apache.catalina.startup.ContextConfig.applicationAnnotationsConfig(ContextConfig.java:336) at org.apache.catalina.startup.ContextConfig.configureStart(ContextConfig.java:786) at org.apache.catalina.startup.ContextConfig.lifecycleEvent(ContextConfig.java:307) at org.apache.catalina.util.LifecycleSupport.fireLifecycleEvent(LifecycleSupport.java:95) at org.apache.catalina.util.LifecycleBase.fireLifecycleEvent(LifecycleBase.java:90) at org.apache.catalina.core.StandardContext.startInternal(StandardContext.java:5213) at org.apache.catalina.util.LifecycleBase.start(LifecycleBase.java:145) ... 44 more Caused by: java.lang.ClassNotFoundException: org.apache.commons.configuration.ConfigurationException at org.apache.catalina.loader.WebappClassLoaderBase.loadClass(WebappClassLoaderBase.java:1339) at org.apache.catalina.loader.WebappClassLoaderBase.loadClass(WebappClassLoaderBase.java:1167) ... 58 more 04-Jan-2020 13:22:17.327 严重 [RMI TCP Connection(3)-127.0.0.1] org.apache.tomcat.util.modeler.BaseModelMBean.invoke Exception invoking method manageApp java.lang.IllegalStateException: ContainerBase.addChild: start: org.apache.catalina.LifecycleException: Failed to start component [StandardEngine[Catalina].StandardHost[localhost].StandardContext[]] at org.apache.catalina.core.ContainerBase.addChildInternal(ContainerBase.java:757) at org.apache.catalina.core.ContainerBase.addChild(ContainerBase.java:729) at org.apache.catalina.core.StandardHost.addChild(StandardHost.java:717) at org.apache.catalina.startup.HostConfig.manageApp(HostConfig.java:1733) at sun.reflect.NativeMethodAccessorImpl.invoke0(Native Method) at sun.reflect.NativeMethodAccessorImpl.invoke(NativeMethodAccessorImpl.java:57) at sun.reflect.DelegatingMethodAccessorImpl.invoke(DelegatingMethodAccessorImpl.java:43) at java.lang.reflect.Method.invoke(Method.java:606) at org.apache.tomcat.util.modeler.BaseModelMBean.invoke(BaseModelMBean.java:300) at com.sun.jmx.interceptor.DefaultMBeanServerInterceptor.invoke(DefaultMBeanServerInterceptor.java:819) at com.sun.jmx.mbeanserver.JmxMBeanServer.invoke(JmxMBeanServer.java:801) [2020-01-04 01:22:17,378] Artifact susong:war exploded: Error during artifact deployment. See server log for details. at org.apache.catalina.mbeans.MBeanFactory.createStandardContext(MBeanFactory.java:484) at org.apache.catalina.mbeans.MBeanFactory.createStandardContext(MBeanFactory.java:433) at sun.reflect.NativeMethodAccessorImpl.invoke0(Native Method) at sun.reflect.NativeMethodAccessorImpl.invoke(NativeMethodAccessorImpl.java:57) at sun.reflect.DelegatingMethodAccessorImpl.invoke(DelegatingMethodAccessorImpl.java:43) at java.lang.reflect.Method.invoke(Method.java:606) at org.apache.tomcat.util.modeler.BaseModelMBean.invoke(BaseModelMBean.java:300) at com.sun.jmx.interceptor.DefaultMBeanServerInterceptor.invoke(DefaultMBeanServerInterceptor.java:819) at com.sun.jmx.mbeanserver.JmxMBeanServer.invoke(JmxMBeanServer.java:801) at javax.management.remote.rmi.RMIConnectionImpl.doOperation(RMIConnectionImpl.java:1487) at javax.management.remote.rmi.RMIConnectionImpl.access$300(RMIConnectionImpl.java:97) at javax.management.remote.rmi.RMIConnectionImpl$PrivilegedOperation.run(RMIConnectionImpl.java:1328) at javax.management.remote.rmi.RMIConnectionImpl.doPrivilegedOperation(RMIConnectionImpl.java:1420) at javax.management.remote.rmi.RMIConnectionImpl.invoke(RMIConnectionImpl.java:848) at sun.reflect.NativeMethodAccessorImpl.invoke0(Native Method) at sun.reflect.NativeMethodAccessorImpl.invoke(NativeMethodAccessorImpl.java:57) at sun.reflect.DelegatingMethodAccessorImpl.invoke(DelegatingMethodAccessorImpl.java:43) at java.lang.reflect.Method.invoke(Method.java:606) at sun.rmi.server.UnicastServerRef.dispatch(UnicastServerRef.java:322) at sun.rmi.transport.Transport$2.run(Transport.java:202) at sun.rmi.transport.Transport$2.run(Transport.java:199) at java.security.AccessController.doPrivileged(Native Method) at sun.rmi.transport.Transport.serviceCall(Transport.java:198) at sun.rmi.transport.tcp.TCPTransport.handleMessages(TCPTransport.java:567) at sun.rmi.transport.tcp.TCPTransport$ConnectionHandler.run0(TCPTransport.java:828) at sun.rmi.transport.tcp.TCPTransport$ConnectionHandler.access$400(TCPTransport.java:619) at sun.rmi.transport.tcp.TCPTransport$ConnectionHandler$1.run(TCPTransport.java:684) at sun.rmi.transport.tcp.TCPTransport$ConnectionHandler$1.run(TCPTransport.java:681) at java.security.AccessController.doPrivileged(Native Method) at sun.rmi.transport.tcp.TCPTransport$ConnectionHandler.run(TCPTransport.java:681) at java.util.concurrent.ThreadPoolExecutor.runWorker(ThreadPoolExecutor.java:1145) at java.util.concurrent.ThreadPoolExecutor$Worker.run(ThreadPoolExecutor.java:615) at java.lang.Thread.run(Thread.java:745) 04-Jan-2020 13:22:17.328 严重 [RMI TCP Connection(3)-127.0.0.1] org.apache.tomcat.util.modeler.BaseModelMBean.invoke Exception invoking method createStandardContext javax.management.RuntimeOperationsException: Exception invoking method manageApp at org.apache.tomcat.util.modeler.BaseModelMBean.invoke(BaseModelMBean.java:308) at com.sun.jmx.interceptor.DefaultMBeanServerInterceptor.invoke(DefaultMBeanServerInterceptor.java:819) at com.sun.jmx.mbeanserver.JmxMBeanServer.invoke(JmxMBeanServer.java:801) at org.apache.catalina.mbeans.MBeanFactory.createStandardContext(MBeanFactory.java:484) at org.apache.catalina.mbeans.MBeanFactory.createStandardContext(MBeanFactory.java:433) at sun.reflect.NativeMethodAccessorImpl.invoke0(Native Method) at sun.reflect.NativeMethodAccessorImpl.invoke(NativeMethodAccessorImpl.java:57) at sun.reflect.DelegatingMethodAccessorImpl.invoke(DelegatingMethodAccessorImpl.java:43) at java.lang.reflect.Method.invoke(Method.java:606) at org.apache.tomcat.util.modeler.BaseModelMBean.invoke(BaseModelMBean.java:300) at com.sun.jmx.interceptor.DefaultMBeanServerInterceptor.invoke(DefaultMBeanServerInterceptor.java:819) at com.sun.jmx.mbeanserver.JmxMBeanServer.invoke(JmxMBeanServer.java:801) at javax.management.remote.rmi.RMIConnectionImpl.doOperation(RMIConnectionImpl.java:1487) at javax.management.remote.rmi.RMIConnectionImpl.access$300(RMIConnectionImpl.java:97) at javax.management.remote.rmi.RMIConnectionImpl$PrivilegedOperation.run(RMIConnectionImpl.java:1328) at javax.management.remote.rmi.RMIConnectionImpl.doPrivilegedOperation(RMIConnectionImpl.java:1420) at javax.management.remote.rmi.RMIConnectionImpl.invoke(RMIConnectionImpl.java:848) at sun.reflect.NativeMethodAccessorImpl.invoke0(Native Method) at sun.reflect.NativeMethodAccessorImpl.invoke(NativeMethodAccessorImpl.java:57) at sun.reflect.DelegatingMethodAccessorImpl.invoke(DelegatingMethodAccessorImpl.java:43) at java.lang.reflect.Method.invoke(Method.java:606) at sun.rmi.server.UnicastServerRef.dispatch(UnicastServerRef.java:322) at sun.rmi.transport.Transport$2.run(Transport.java:202) at sun.rmi.transport.Transport$2.run(Transport.java:199) at java.security.AccessController.doPrivileged(Native Method) at sun.rmi.transport.Transport.serviceCall(Transport.java:198) at sun.rmi.transport.tcp.TCPTransport.handleMessages(TCPTransport.java:567) at sun.rmi.transport.tcp.TCPTransport$ConnectionHandler.run0(TCPTransport.java:828) at sun.rmi.transport.tcp.TCPTransport$ConnectionHandler.access$400(TCPTransport.java:619) at sun.rmi.transport.tcp.TCPTransport$ConnectionHandler$1.run(TCPTransport.java:684) at sun.rmi.transport.tcp.TCPTransport$ConnectionHandler$1.run(TCPTransport.java:681) at java.security.AccessController.doPrivileged(Native Method) at sun.rmi.transport.tcp.TCPTransport$ConnectionHandler.run(TCPTransport.java:681) at java.util.concurrent.ThreadPoolExecutor.runWorker(ThreadPoolExecutor.java:1145) at java.util.concurrent.ThreadPoolExecutor$Worker.run(ThreadPoolExecutor.java:615) at java.lang.Thread.run(Thread.java:745) Caused by: java.lang.IllegalStateException: ContainerBase.addChild: start: org.apache.catalina.LifecycleException: Failed to start component [StandardEngine[Catalina].StandardHost[localhost].StandardContext[]] at org.apache.catalina.core.ContainerBase.addChildInternal(ContainerBase.java:757) at org.apache.catalina.core.ContainerBase.addChild(ContainerBase.java:729) at org.apache.catalina.core.StandardHost.addChild(StandardHost.java:717) at org.apache.catalina.startup.HostConfig.manageApp(HostConfig.java:1733) at sun.reflect.NativeMethodAccessorImpl.invoke0(Native Method) at sun.reflect.NativeMethodAccessorImpl.invoke(NativeMethodAccessorImpl.java:57) at sun.reflect.DelegatingMethodAccessorImpl.invoke(DelegatingMethodAccessorImpl.java:43) at java.lang.reflect.Method.invoke(Method.java:606) at org.apache.tomcat.util.modeler.BaseModelMBean.invoke(BaseModelMBean.java:300) ... 35 more 04-Jan-2020 13:22:23.307 信息 [localhost-startStop-1] org.apache.catalina.startup.HostConfig.deployDirectory Deploying web application directory C:\Program Files\Apache Software Foundation\Tomcat 8.0\webapps\manager 04-Jan-2020 13:22:23.405 信息 [localhost-startStop-1] org.apache.catalina.startup.HostConfig.deployDirectory Deployment of web application directory C:\Program Files\Apache Software Foundation\Tomcat 8.0\webapps\manager has finished in 98 ms "C:\Program Files\Apache Software Foundation\Tomcat 8.0\bin\catalina.bat" stop Using CATALINA_BASE: "C:\Users\cd\.IntelliJIdea2018.1\system\tomcat\Unnamed_wuranyuan" Using CATALINA_HOME: "C:\Program Files\Apache Software Foundation\Tomcat 8.0" Using CATALINA_TMPDIR: "C:\Program Files\Apache Software Foundation\Tomcat 8.0\temp" Using JRE_HOME: "C:\Program Files\Java\jdk1.7.0_80" Using CLASSPATH: "C:\Program Files\Apache Software Foundation\Tomcat 8.0\bin\bootstrap.jar;C:\Program Files\Apache Software Foundation\Tomcat 8.0\bin\tomcat-juli.jar" 04-Jan-2020 13:26:09.457 信息 [main] org.apache.catalina.core.StandardServer.await A valid shutdown command was received via the shutdown port. Stopping the Server instance. 04-Jan-2020 13:26:09.458 信息 [main] org.apache.coyote.AbstractProtocol.pause Pausing ProtocolHandler ["http-nio-8080"] 04-Jan-2020 13:26:09.515 信息 [main] org.apache.coyote.AbstractProtocol.pause Pausing ProtocolHandler ["ajp-nio-8009"] 04-Jan-2020 13:26:09.567 信息 [main] org.apache.catalina.core.StandardService.stopInternal Stopping service Catalina 04-Jan-2020 13:26:09.578 信息 [main] org.apache.coyote.AbstractProtocol.stop Stopping ProtocolHandler ["http-nio-8080"] 04-Jan-2020 13:26:09.580 信息 [main] org.apache.coyote.AbstractProtocol.stop Stopping ProtocolHandler ["ajp-nio-8009"] 04-Jan-2020 13:26:09.581 信息 [main] org.apache.coyote.AbstractProtocol.destroy Destroying ProtocolHandler ["http-nio-8080"] 04-Jan-2020 13:26:09.581 信息 [main] org.apache.coyote.AbstractProtocol.destroy Destroying ProtocolHandler ["ajp-nio-8009"] Disconnected from server
WorstWeather Ever
Problem Description "Man, this year has the worst weather ever!", David said as he sat crouched in the small cave where we had sought shelter from yet another sudden rainstorm. "Nuh-uh!", Diana immediately replied in her traditional know-it-all manner. "Is too!", David countered cunningly. Terrific. Not only were we stuck in this cave, now we would have to listen to those two nagging for at least an hour. It was time to cut this discussion short. "Big nuh-uh. In fact, 93 years ago it had already rained five times as much by this time of year." "Duh", David capitulated, "so it's the worst weather in 93 years then." "Nuh-uh, this is actually the worst weather in 23 years.", Diana again broke in. "Yeah, well, whatever", David sighed, "Who cares anyway?". Well, dear contestants, you care, don't you? Your task is to, given information about the amount of rain during different years in the history of the universe, and a series of statements in the form "Year X had the most rain since year Y", determine whether these are true, might be true, or are false. We say that such a statement is true if: The amount of rain during these two years and all years between them is known. It rained at most as much during year X as it did during year Y. For every year Z satisfying Y < Z < X, the amount of rain during year Z was less than the amount of rain during year X. We say that such a statement might be true if there is an assignment of amounts of rain to years for which there is no information, such that the statement becomes true. We say that the statement is false otherwise. Input The input will consist of several test cases, each consisting of two parts. The first part begins with an integer 1 <= n <= 50000, indicating the number of different years for which there is information. Next follow n lines. The ith of these contains two integers -109 <= yi <= 109 and 1 <= ri <= 109 indicating that there was ri millilitres of rain during year yi (note that the amount of rain during a year can be any nonnegative integer, the limitation on ri is just a limitation on the input). You may assume that yi < yi+1 for 1 <= i < n. The second part of a test case starts with an integer 1 <= m <= 10000, indicating the number of queries to process. The following m lines each contain two integers -109 <= Y < X <= 109 indicating two years. There is a blank line between test cases. The input is terminated by a case where n = 0 and m = 0. This case should not be processed. Technical note: Due to the size of the input, the use of cin/cout in C++ might be too slow in this problem. Use scanf/printf instead. In Java, make sure that both input and output is buffered. Output There should be m lines of output for each test case, corresponding to the m queries. Queries should be answered with "true" if the statement is true, "maybe" if the statement might be true, and "false" if the statement is false. Separate the output of two different test cases by a blank line. Sample Input 4 2002 4920 2003 5901 2004 2832 2005 3890 2 2002 2005 2003 2005 3 1985 5782 1995 3048 2005 4890 2 1985 2005 2005 2015 0 0 Sample Output false true maybe maybe
Treasure Map 是如何实现的
Problem Description "Take 147 steps due north, turn 63 degrees clockwise, take 82 steps, ...". Most people don't realize how important accuracy is when following the directions on a pirate's treasure map. If you're even a tiny bit off at the start, you'll end up far away from the correct location at the end. Pirates therefore use very exact definitions. One step, for instance, has been defined by the 1670 Pirate Convention to be exactly two times the size of the wooden leg of Long John Silver, or 1.183 m in metricunits. Captain Borbassa was thus not at all worried when he set sail to the treasure island, having a rope with knots in it, exactly one step apart, for accurately measuring distances. Of course he also brought his good old geotriangle, once given to him by his father when he was six years old. However, on closer inspection of the map, he got an unpleasant surprise. The map was made by the famous captain Jack Magpie, who was notorious for including little gems into his directions.In this case, there were distances listed such as sqrt(33) steps. How do you measure that accurately? Fortunately, his first mate Pythagor came to the rescue. After puzzling for a few hours, he came up with the following solution: let pirate A go 4 steps into the perpendicular direction, and hold one end of the measuring rope there. Then pirate B goes into the desired direction while letting the rope slide through his fingers, until he is exactly 7 steps away from pirate A. Pythagor worked out a formula that states that pirate B has then traveled exactly sqrt(33) steps. Captain Borbassa was impressed, but he revealed that there were more such distances on the map. Paranoid as he is, he refuses to let Pythagor see the map, or even tell him what other distances there are on it. They are all square roots of integers, that's all he gets to know. Only on the island itself will the captain reveal the numbers, and then he expects Pyhtagor to quickly work out the smallest two integer numbers of steps that can combine to create the desired distance, using the method described above. Pythagor knows this is not easy, so he has asked your help. Can you help him by writing a program that can determine these two integers quickly? By the way, he did ask the captain how large the numbers inside the square root could get, and the captain replied "one billion". He was probably exaggerating, but you'd better make sure the program works. If you can successfully help the pirates, you'll get a share of the treasure. It might be gold, it might be silver, or it might even be... a treasure map! Input The first line of the input contains a single number: the number of test cases to follow. Each test case has the following format: 1.One line with one integer N, satisfying 1 <= N <= 10^9. Output For every test case in the input, the output should contain two nonnegative integers, separated by a space, on a single line: the distance pirate A needs to head in the perpendicular direction, and the final distance between pirate A and B, such that pirate B has traveled sqrt(N) steps. If there are multiple solutions, give the one with the smallest numbers. If there are no solutions, the output should be "IMPOSSIBLE" (without the quotation marks) on a single line. Sample Input 4 33 16 50 101 Sample Output 4 7 0 4 IMPOSSIBLE 50 51
The Embarrassed Cryptographer 的程序的设计
Problem Description The young and very promising cryptographer Odd Even has implemented the security module of a large system with thousands of users, which is now in use in his company. The cryptographic keys are created from the product of two primes, and are believed to be secure because there is no known method for factoring such a product effectively. What Odd Even did not think of, was that both factors in a key should be large, not just their product. It is now possible that some of the users of the system have weak keys. In a desperate attempt not to be fired, Odd Even secretly goes through all the users keys, to check if they are strong enough. He uses his very poweful Atari, and is especially careful when checking his boss' key. Input The input consists of no more than 20 test cases. Each test case is a line with the integers 4 <= K <= 10100 and 2 <= L <= 106. K is the key itself, a product of two primes. L is the wanted minimum size of the factors in the key. The input set is terminated by a case where K = 0 and L = 0. Output For each number K, if one of its factors are strictly less than the required L, your program should output "BAD p", where p is the smallest factor in K. Otherwise, it should output "GOOD". Cases should be separated by a line-break. Sample Input 143 10 143 20 667 20 667 30 2573 30 2573 40 0 0 Sample Output GOOD BAD 11 GOOD BAD 23 GOOD BAD 31
Disney's FastPass 程序的实现
Problem Description Disney's FastPass is a virtual queuing system created by the Walt Disney Company. First introduced in 1999 (thugh the idea of a ride reservation system was first introduced in world fairs), Fast-Pass allows guests to avoid long lines at the attractions on which the system is installed, freeing them to enjoy other attractions during their wait. The service is available at no additional charge to all park guests. --- wikipedia Disneyland is a large theme park with plenties of entertainment facilities, also with a large number of tourists. Normally, you need to wait for a long time before geting the chance to enjoy any of the attractions. The FastPass is a system allowing you to pick up FastPass-tickets in some specific position, and use them at the corresponding facility to avoid long lines. With the help of the FastPass System, one can arrange his/her trip more efficiently. You are given the map of the whole park, and there are some attractions that you are interested in. How to visit all the interested attractions within the shortest time? Input The first line contains an integer T(1<=T<=25), indicating the number of test cases. Each test case contains several lines. The first line contains three integers N,M,K(1 <= N <= 50; 0 <= M <= N(N - 1)/2; 0 <= K <= 8), indicating the number of locations(starting with 1, and 1 is the only gate of the park where the trip must be started and ended), the number of roads and the number of interested attractions. The following M lines each contains three integers A,B,D(1 <= A,B <= N; 0 <= D <= 10^4) which means it takes D minutes to travel between location A and location B. The following K lines each contains several integers Pi, Ti, FTi,Ni, Fi,1, Fi,2 ... Fi,Ni-1, FiNi ,(1 <= Pi,Ni, Fi,j <=N, 0 <= FTi <= Ti <= 10^4), which means the ith interested araction is placed at location Pi and there are Ni locations Fi,1; Fi,2 ... Fi,Ni where you can get the FastPass for the ith attraction. If you come to the ith attraction with its FastPass, you need to wait for only FTi minutes, otherwise you need to wait for Ti minutes. You can assume that all the locations are connected and there is at most one road between any two locations. Note that there might be several attrractions at one location. Output For each test case in the input, print one line: "Case #X: Y", where X is the test case number (starting with 1) and Y is the minimum time of the trip. Sample Input 2 4 5 2 1 2 8 2 3 4 3 4 19 4 1 6 2 4 7 2 25 18 1 3 4 12 6 1 3 4 6 2 1 2 5 1 4 4 3 1 1 3 2 1 3 4 1 2 4 10 2 8 3 1 4 4 8 3 1 2 Sample Output Case #1: 53 Case #2: 14
Zjnu Stadium 怎么编写程序的
Problem Description In 12th Zhejiang College Students Games 2007, there was a new stadium built in Zhejiang Normal University. It was a modern stadium which could hold thousands of people. The audience Seats made a circle. The total number of columns were 300 numbered 1--300, counted clockwise, we assume the number of rows were infinite. These days, Busoniya want to hold a large-scale theatrical performance in this stadium. There will be N people go there numbered 1--N. Busoniya has Reserved several seats. To make it funny, he makes M requests for these seats: A B X, which means people numbered B must seat clockwise X distance from people numbered A. For example: A is in column 4th and X is 2, then B must in column 6th (6=4+2). Now your task is to judge weather the request is correct or not. The rule of your judgement is easy: when a new request has conflicts against the foregoing ones then we define it as incorrect, otherwise it is correct. Please find out all the incorrect requests and count them as R. Input There are many test cases: For every case: The first line has two integer N(1<=N<=50,000), M(0<=M<=100,000),separated by a space. Then M lines follow, each line has 3 integer A(1<=A<=N), B(1<=B<=N), X(0<=X<300) (A!=B), separated by a space. Output For every case: Output R, represents the number of incorrect request. Sample Input 10 10 1 2 150 3 4 200 1 5 270 2 6 200 6 5 80 4 7 150 8 9 100 4 8 50 1 7 100 9 2 100 Sample Output 2
Java学习的正确打开方式
在博主认为,对于入门级学习java的最佳学习方法莫过于视频+博客+书籍+总结,前三者博主将淋漓尽致地挥毫于这篇博客文章中,至于总结在于个人,实际上越到后面你会发现学习的最好方式就是阅读参考官方文档其次就是国内的书籍,博客次之,这又是一个层次了,这里暂时不提后面再谈。博主将为各位入门java保驾护航,各位只管冲鸭!!!上天是公平的,只要不辜负时间,时间自然不会辜负你。 何谓学习?博主所理解的学习,它是一个过程,是一个不断累积、不断沉淀、不断总结、善于传达自己的个人见解以及乐于分享的过程。
程序员必须掌握的核心算法有哪些?
由于我之前一直强调数据结构以及算法学习的重要性,所以就有一些读者经常问我,数据结构与算法应该要学习到哪个程度呢?,说实话,这个问题我不知道要怎么回答你,主要取决于你想学习到哪些程度,不过针对这个问题,我稍微总结一下我学过的算法知识点,以及我觉得值得学习的算法。这些算法与数据结构的学习大多数是零散的,并没有一本把他们全部覆盖的书籍。下面是我觉得值得学习的一些算法以及数据结构,当然,我也会整理一些看过...
大学四年自学走来,这些私藏的实用工具/学习网站我贡献出来了
大学四年,看课本是不可能一直看课本的了,对于学习,特别是自学,善于搜索网上的一些资源来辅助,还是非常有必要的,下面我就把这几年私藏的各种资源,网站贡献出来给你们。主要有:电子书搜索、实用工具、在线视频学习网站、非视频学习网站、软件下载、面试/求职必备网站。 注意:文中提到的所有资源,文末我都给你整理好了,你们只管拿去,如果觉得不错,转发、分享就是最大的支持了。 一、电子书搜索 对于大部分程序员...
linux系列之常用运维命令整理笔录
本博客记录工作中需要的linux运维命令,大学时候开始接触linux,会一些基本操作,可是都没有整理起来,加上是做开发,不做运维,有些命令忘记了,所以现在整理成博客,当然vi,文件操作等就不介绍了,慢慢积累一些其它拓展的命令,博客不定时更新 free -m 其中:m表示兆,也可以用g,注意都要小写 Men:表示物理内存统计 total:表示物理内存总数(total=used+free) use...
比特币原理详解
一、什么是比特币 比特币是一种电子货币,是一种基于密码学的货币,在2008年11月1日由中本聪发表比特币白皮书,文中提出了一种去中心化的电子记账系统,我们平时的电子现金是银行来记账,因为银行的背后是国家信用。去中心化电子记账系统是参与者共同记账。比特币可以防止主权危机、信用风险。其好处不多做赘述,这一层面介绍的文章很多,本文主要从更深层的技术原理角度进行介绍。 二、问题引入 假设现有4个人...
程序员接私活怎样防止做完了不给钱?
首先跟大家说明一点,我们做 IT 类的外包开发,是非标品开发,所以很有可能在开发过程中会有这样那样的需求修改,而这种需求修改很容易造成扯皮,进而影响到费用支付,甚至出现做完了项目收不到钱的情况。 那么,怎么保证自己的薪酬安全呢? 我们在开工前,一定要做好一些证据方面的准备(也就是“讨薪”的理论依据),这其中最重要的就是需求文档和验收标准。一定要让需求方提供这两个文档资料作为开发的基础。之后开发...
网页实现一个简单的音乐播放器(大佬别看。(⊙﹏⊙))
今天闲着无事,就想写点东西。然后听了下歌,就打算写个播放器。 于是乎用h5 audio的加上js简单的播放器完工了。 演示地点演示 html代码如下` music 这个年纪 七月的风 音乐 ` 然后就是css`*{ margin: 0; padding: 0; text-decoration: none; list-...
Python十大装B语法
Python 是一种代表简单思想的语言,其语法相对简单,很容易上手。不过,如果就此小视 Python 语法的精妙和深邃,那就大错特错了。本文精心筛选了最能展现 Python 语法之精妙的十个知识点,并附上详细的实例代码。如能在实战中融会贯通、灵活使用,必将使代码更为精炼、高效,同时也会极大提升代码B格,使之看上去更老练,读起来更优雅。
数据库优化 - SQL优化
以实际SQL入手,带你一步一步走上SQL优化之路!
通俗易懂地给女朋友讲:线程池的内部原理
餐盘在灯光的照耀下格外晶莹洁白,女朋友拿起红酒杯轻轻地抿了一小口,对我说:“经常听你说线程池,到底线程池到底是个什么原理?”
经典算法(5)杨辉三角
杨辉三角 是经典算法,这篇博客对它的算法思想进行了讲解,并有完整的代码实现。
使用 Docker 部署 Spring Boot 项目
Docker 技术发展为微服务落地提供了更加便利的环境,使用 Docker 部署 Spring Boot 其实非常简单,这篇文章我们就来简单学习下。首先构建一个简单的 S...
英特尔不为人知的 B 面
从 PC 时代至今,众人只知在 CPU、GPU、XPU、制程、工艺等战场中,英特尔在与同行硬件芯片制造商们的竞争中杀出重围,且在不断的成长进化中,成为全球知名的半导体公司。殊不知,在「刚硬」的背后,英特尔「柔性」的软件早已经做到了全方位的支持与支撑,并持续发挥独特的生态价值,推动产业合作共赢。 而对于这一不知人知的 B 面,很多人将其称之为英特尔隐形的翅膀,虽低调,但是影响力却不容小觑。 那么,在...
面试官:你连RESTful都不知道我怎么敢要你?
干货,2019 RESTful最贱实践
刷了几千道算法题,这些我私藏的刷题网站都在这里了!
遥想当年,机缘巧合入了 ACM 的坑,周边巨擘林立,从此过上了"天天被虐似死狗"的生活… 然而我是谁,我可是死狗中的战斗鸡,智力不够那刷题来凑,开始了夜以继日哼哧哼哧刷题的日子,从此"读题与提交齐飞, AC 与 WA 一色 ",我惊喜的发现被题虐既刺激又有快感,那一刻我泪流满面。这么好的事儿作为一个正直的人绝不能自己独享,经过激烈的颅内斗争,我决定把我私藏的十几个 T 的,阿不,十几个刷题网...
白话阿里巴巴Java开发手册高级篇
不久前,阿里巴巴发布了《阿里巴巴Java开发手册》,总结了阿里巴巴内部实际项目开发过程中开发人员应该遵守的研发流程规范,这些流程规范在一定程度上能够保证最终的项目交付质量,通过在时间中总结模式,并推广给广大开发人员,来避免研发人员在实践中容易犯的错误,确保最终在大规模协作的项目中达成既定目标。 无独有偶,笔者去年在公司里负责升级和制定研发流程、设计模板、设计标准、代码标准等规范,并在实际工作中进行...
SQL-小白最佳入门sql查询一
不要偷偷的查询我的个人资料,即使你再喜欢我,也不要这样,真的不好;
redis分布式锁,面试官请随便问,我都会
文章有点长并且绕,先来个图片缓冲下! 前言 现在的业务场景越来越复杂,使用的架构也就越来越复杂,分布式、高并发已经是业务要求的常态。像腾讯系的不少服务,还有CDN优化、异地多备份等处理。 说到分布式,就必然涉及到分布式锁的概念,如何保证不同机器不同线程的分布式锁同步呢? 实现要点 互斥性,同一时刻,智能有一个客户端持有锁。 防止死锁发生,如果持有锁的客户端崩溃没有主动释放锁,也要保证锁可以正常释...
项目中的if else太多了,该怎么重构?
介绍 最近跟着公司的大佬开发了一款IM系统,类似QQ和微信哈,就是聊天软件。我们有一部分业务逻辑是这样的 if (msgType = "文本") { // dosomething } else if(msgType = "图片") { // doshomething } else if(msgType = "视频") { // doshomething } else { // doshom...
Nginx 原理和架构
Nginx 是一个免费的,开源的,高性能的 HTTP 服务器和反向代理,以及 IMAP / POP3 代理服务器。Nginx 以其高性能,稳定性,丰富的功能,简单的配置和低资源消耗而闻名。 Nginx 的整体架构 Nginx 里有一个 master 进程和多个 worker 进程。master 进程并不处理网络请求,主要负责调度工作进程:加载配置、启动工作进程及非停升级。worker 进程负责处...
“狗屁不通文章生成器”登顶GitHub热榜,分分钟写出万字形式主义大作
一、垃圾文字生成器介绍 最近在浏览GitHub的时候,发现了这样一个骨骼清奇的雷人项目,而且热度还特别高。 项目中文名:狗屁不通文章生成器 项目英文名:BullshitGenerator 根据作者的介绍,他是偶尔需要一些中文文字用于GUI开发时测试文本渲染,因此开发了这个废话生成器。但由于生成的废话实在是太过富于哲理,所以最近已经被小伙伴们给玩坏了。 他的文风可能是这样的: 你发现,...
程序员:我终于知道post和get的区别
是一个老生常谈的话题,然而随着不断的学习,对于以前的认识有很多误区,所以还是需要不断地总结的,学而时习之,不亦说乎
《程序人生》系列-这个程序员只用了20行代码就拿了冠军
你知道的越多,你不知道的越多 点赞再看,养成习惯GitHub上已经开源https://github.com/JavaFamily,有一线大厂面试点脑图,欢迎Star和完善 前言 这一期不算《吊打面试官》系列的,所有没前言我直接开始。 絮叨 本来应该是没有这期的,看过我上期的小伙伴应该是知道的嘛,双十一比较忙嘛,要值班又要去帮忙拍摄年会的视频素材,还得搞个程序员一天的Vlog,还要写BU...
加快推动区块链技术和产业创新发展,2019可信区块链峰会在京召开
11月8日,由中国信息通信研究院、中国通信标准化协会、中国互联网协会、可信区块链推进计划联合主办,科技行者协办的2019可信区块链峰会将在北京悠唐皇冠假日酒店开幕。   区块链技术被认为是继蒸汽机、电力、互联网之后,下一代颠覆性的核心技术。如果说蒸汽机释放了人类的生产力,电力解决了人类基本的生活需求,互联网彻底改变了信息传递的方式,区块链作为构造信任的技术有重要的价值。   1...
Java世界最常用的工具类库
Apache Commons Apache Commons有很多子项目 Google Guava 参考博客
程序员把地府后台管理系统做出来了,还有3.0版本!12月7号最新消息:已在开发中有github地址
第一幕:缘起 听说阎王爷要做个生死簿后台管理系统,我们派去了一个程序员…… 996程序员做的梦: 第一场:团队招募 为了应对地府管理危机,阎王打算找“人”开发一套地府后台管理系统,于是就在地府总经办群中发了项目需求。 话说还是中国电信的信号好,地府都是满格,哈哈!!! 经常会有外行朋友问:看某网站做的不错,功能也简单,你帮忙做一下? 而这次,面对这样的需求,这个程序员...
网易云6亿用户音乐推荐算法
网易云音乐是音乐爱好者的集聚地,云音乐推荐系统致力于通过 AI 算法的落地,实现用户千人千面的个性化推荐,为用户带来不一样的听歌体验。 本次分享重点介绍 AI 算法在音乐推荐中的应用实践,以及在算法落地过程中遇到的挑战和解决方案。 将从如下两个部分展开: AI算法在音乐推荐中的应用 音乐场景下的 AI 思考 从 2013 年 4 月正式上线至今,网易云音乐平台持续提供着:乐屏社区、UGC...
【技巧总结】位运算装逼指南
位算法的效率有多快我就不说,不信你可以去用 10 亿个数据模拟一下,今天给大家讲一讲位运算的一些经典例子。不过,最重要的不是看懂了这些例子就好,而是要在以后多去运用位运算这些技巧,当然,采用位运算,也是可以装逼的,不信,你往下看。我会从最简单的讲起,一道比一道难度递增,不过居然是讲技巧,那么也不会太难,相信你分分钟看懂。 判断奇偶数 判断一个数是基于还是偶数,相信很多人都做过,一般的做法的代码如下...
为什么要学数据结构?
一、前言 在可视化化程序设计的今天,借助于集成开发环境可以很快地生成程序,程序设计不再是计算机专业人员的专利。很多人认为,只要掌握几种开发工具就可以成为编程高手,其实,这是一种误解。要想成为一个专业的开发人员,至少需要以下三个条件: 1) 能够熟练地选择和设计各种数据结构和算法 2) 至少要能够熟练地掌握一门程序设计语言 3) 熟知所涉及的相关应用领域的知识 其中,后两个条件比较容易实现,而第一个...
Android 9.0 init 启动流程
阅读五分钟,每日十点,和您一起终身学习,这里是程序员Android本篇文章主要介绍Android开发中的部分知识点,通过阅读本篇文章,您将收获以下内容:一、启动流程概述一、 启动流程概述Android启动流程跟Linux启动类似,大致分为如下五个阶段。1.开机上电,加载固化的ROM。2.加载BootLoader,拉起Android OS。3.加载Uboot,初始外设,引导Kernel启动等。...
8年经验面试官详解 Java 面试秘诀
作者 |胡书敏 责编 | 刘静 出品 | CSDN(ID:CSDNnews) 本人目前在一家知名外企担任架构师,而且最近八年来,在多家外企和互联网公司担任Java技术面试官,前后累计面试了有两三百位候选人。在本文里,就将结合本人的面试经验,针对Java初学者、Java初级开发和Java开发,给出若干准备简历和准备面试的建议。 Java程序员准备和投递简历的实...
面试官如何考察你的思维方式?
1.两种思维方式在求职面试中,经常会考察这种问题:北京有多少量特斯拉汽车?某胡同口的煎饼摊一年能卖出多少个煎饼?深圳有多少个产品经理?一辆公交车里能装下多少个乒乓球?一个正常成年人有多少根头发?这类估算问题,被称为费米问题,是以科学家费米命名的。为什么面试会问这种问题呢?这类问题能把两类人清楚地区分出来。一类是具有文科思维的人,擅长赞叹和模糊想象,它主要依靠的是人的第一反应和直觉,比如小孩...
相关热词 c# 输入ip c# 乱码 报表 c#选择结构应用基本算法 c# 收到udp包后回包 c#oracle 头文件 c# 序列化对象 自定义 c# tcp 心跳 c# ice连接服务端 c# md5 解密 c# 文字导航控件
立即提问

相似问题

2
将项目发布到was上 发现监听过滤的时候 request.getServletPath()为空 请问是什么问题引起的?
1
spring boot 整合swagger项目放到tomcat的webapps目录下启动的时候报空指针警告有谁知道原因么.
1
为什么有时候cin.getline() 不能用而cin.get()可以用啊
1
thinkPHP 5 本地访问报The requested URL / was not found on this server.
0
Tomcat启动报错:More than one fragment with the name [javamelody] was found.
4
No public static field named [productName] was found on class jspservlet.product.product
5
Exception in thread "Thread-12" java.lang.RuntimeException: java.lang.NullPointerException
1
git 拉取代码 出现错误 退出码1
3
tomcat启动失败 org.apache.catalina.core.ContainerBase startInternal 严重: 子容器启动失败
2
sonarqube.bat启动后自动关闭
1
在做一个淘淘商城的项目,出现了子项目pom.xml报错的问题
7
关于ideal2019版本配置maven问题
3
实例化合约报错:chaincode registration failed
2
maven项目创建失败,有IDEA错误日志但还是找不到问题根源
1
maven配置私服打包报错Failed to execute goal org.apache.maven.plugins:maven-compiler-plugin:3.5:compile
0
Linux+pytorch下运行报错RuntimeError: PyTorch was compiled without NumPy support
0
为什么登录openfire服务器的时候偶现登录不上?
2
jinja2.exceptions.TemplateNotFound: bootstrap/base.html的错误wen'ti
1
ElasticSearch6.3.1 jdbc连接提示Original type was [request [/_xpack/sql] contains unrecognized parameter: [mode]].