error: command 'x86_64-linux-gnu-gcc' failed with exit status 1

在安装Openstack时,提示如下错误:

 In file included from /usr/include/openssl/cms.h:16:0,
2018-11-22 16:33:22.028 |                      from build/temp.linux-x86_64-2.7/_openssl.c:485:
2018-11-22 16:33:22.028 |     /usr/include/openssl/x509.h:552:6: note: expected 'const X509_ALGOR ** {aka const struct X509_algor_st **}' but argument is of type 'X509_ALGOR ** {aka struct X509_algor_st **}'
2018-11-22 16:33:22.028 |      void X509_get0_signature(const ASN1_BIT_STRING **psig,
2018-11-22 16:33:22.028 |           ^~~~~~~~~~~~~~~~~~~
2018-11-22 16:33:22.028 |     At top level:
2018-11-22 16:33:22.029 |     build/temp.linux-x86_64-2.7/_openssl.c:3492:13: warning: '_ssl_thread_locking_function' defined but not used [-Wunused-function]
2018-11-22 16:33:22.029 |      static void ssl_thread_locking_function(int mode, int n, const char *file,
2018-11-22 16:33:22.029 |                  ^~~~~~~~~~~~~~~~~~~~~~~~~~~~
2018-11-22 16:33:22.029 |     error: command 'x86_64-linux-gnu-gcc' failed with exit status 1
2018-11-22 16:33:22.029 |
2018-11-22 16:33:22.029 |     ----------------------------------------
2018-11-22 16:33:22.070 | Command "/usr/bin/python -u -c "import setuptools, tokenize;
_file__='/tmp/pip-build-dDyHZi/cryptography/setup.py';f=getattr(tokenize, 'open', open)(__file__);code=f.read().replace('\r\n', '\n');f.close();exec(compile(code, file, 'exec'))" install --record /tmp/pip-VeABSz-record/install-record.txt --single-version-externally-managed --compile" failed with error code 1 in /tmp/pip-build-dDyHZi/cryptography/
2018-11-22 16:33:22.097 | You are using pip version 9.0.3, however version 18.1 is available.
2018-11-22 16:33:22.097 | You should consider upgrading via the 'pip install --upgrade pip' command.

请大神帮忙看看哪里的问题,卡了好几天了,谢谢!

0

1个回答

0
Csdn user default icon
上传中...
上传图片
插入图片
抄袭、复制答案,以达到刷声望分或其他目的的行为,在CSDN问答是严格禁止的。是时候展现真正的技术了!
其他相关推荐
ubuntu安装scrapy错误的解决方案
x86_64-linux-gnu-gcc -pthread -DNDEBUG -g -fwrapv -O2 -Wall -Wstrict-prototypes -fno-strict-aliasing -D_FORTIFY_SOURCE=2 -g -fstack-protector-strong -Wformat -Werror=format-security -fPIC -I/usr/inclu
centos 安装 matplotlib失败如何解决
本人使用python2.7版本,未安装anaconda集成环境,所以代码中用到matplotlib仍需要导入。但是使用pip install 指令报如下错误:Failed building wheel for subprocess32以及error: command 'gcc' failed with exit status 1 尝试先安装pip install subprocess32 ,然后
记一次Linux下安装pyspider的过程
首先执行pip install pyspider此时系统提示Command "python setup.py egg_info" failed with error code 1 in /tmp/pip-build-Lau0Qp/pycurl/ You are using pip version 9.0.1, however version 9.0.3 is available. You shou...
安装scrapy遇到问题
pip install cryptography 出现 error: command 'gcc' failed with exit status 1  单独下载 cryptography 安装出现一下错误 cffi.ffiplatform.VerificationError: CompileError: command 'gcc' failed with exit statu
安装talib过程中遇到的坑和解决方法
我的环境: Linux 64 Anaconda2 和 anaconda3 共存 共存方法:https://www.cnblogs.com/zle1992/p/6720425.html 遇到的坑和解决办法 坑主要是py3的,py2的直接就安装成功了 conda install 由于依赖python版本和我的系统版本不兼容,因此不考虑anaconda.org/Quantopian/ta...
python 安装模块报错
环境: ubuntu 17.04 安装模块:M2Crypto 错误:error: command 'x86_64-linux-gnu-gcc' failed with exit status 1 猜想:这可能是 linux 的 gcc(c++)的问题 尝试:sudo apt-get install c++ sudo apt-get install gc++ 重新...
如何在Golang中运行exec.Command时调试“exit status 1”错误
当我运行下面的代码: cmd := exec.Command("find", "/", "-maxdepth", "1", "-exec", "wc", "-c", "{}", "\\") var out bytes.Buffer cmd.Stdout = &out err := cmd.Run() if err != nil { fmt.Println(err) return
安装TA-lib过程问题
安装TA-lib过程问题的解决 描述:版本ubuntu16 没有装conda 建立个虚拟环境 专门放量化操作的包 建议:结合readme一起看 第一步: pip install TA-Lib 第二步:正常情况第一步都不会装好 这里选择一个版本下载:https://pypi.org/project/TA-Lib/0.4.16/#history 。下载好之后解压, ta...
windows下安装与配置scrapy
windows下安装scrapy的过程
在阿里云centos6.5系统上用docker搭建php环境的失败过程
最后的决定:换centos成为ubuntu系统。明天继续努力再搭建看看。 请教各位朋友:如何能在centos上搭建一个成功的docker环境,在容器里用netstat也不能用。多谢:)
HP-UX磁带备份错误收集
磁带备份命令: make_tape_recovery -Av  默认备份至/dev/rmt/0mn。 如果有多个磁带机,那么需要使用下面命令 make_tape_recovery -Av -a /dev/rmt/1mn lsdb#[/tmp]ioscan  -fnC tape  ----扫描磁带机 lsdb#[/tmp]make_tape_recovery -Av -a /dev/rmt
mac安装pymssql报错
报错信息如下:     _mssql.c:314:10: fatal error: 'sqlfront.h' file not found          #include "sqlfront.h"                   ^          1 error generated.          error: command 'cc' failed with
Python找不到cl.exe等
Cython扩展Python的MSVC编译环境设置,解决找不到cl.exe,找不到*.h,找不到*.lib,无法运行RC.exe
pyltp安装过程中遇到的缺少cl.exe问题的解决
  python3.6安装哈工大PYLTP包时遇到的问题:error: command 'C:\\Program Files (x86)\\Microsoft Visual Studio 14.0\\VC\\BIN\\x86_amd64\\cl.exe' failed with exit status 2安装过程中遇到了如上的问题,根据网址:https://blog.csdn.net/laoyao...
centOS下安装hue
一、下载hue https://github.com/cloudera/hue 二、编译 进入目录下make apps进行编译  出现如下错误: 在包含自 _mysql.c:36 的文件中:/usr/include/mysql/my_config.h:1062:1: 警告:“HAVE_WCSCOLL”重定义在包含自 /usr/local/include/python2
AutoTools 疑难解决方法
2011-03-25 20:48 AutoTools 简单入门 [转] 学习GNU/LINUX 开发的编程人员,上手之后不久就会在编译开源软件的时候碰到configure脚本,过段时间还会知道configure脚本是autoconf生成的; 但是真正想用起来autoconf,却是要弄明白config.h,configure.in,Makfile.am等一大堆的文件,这可能要花些功夫。
Ceph搭建过程中遇到的各种问题
人们在选择存储系统的时候,往往会考虑到它的存储能力、容错冗余机制、负载均衡等等。Ceph是一个非常好的分布式存储系统,可以无限制的扩展你的集群,并且它是一个块存储、对象存储和文件系统统一的分布式文件系统。所以很多公司都会选择ceph作为存储系统。   那么我们在进行ceph快速搭建的时候往往会遇到很多问题,我这边把我所遇到的问题总结了一下,请大家多多指教!   安装过程 #ceph-de
说一下我安装ceph中遇到Error的解决办法
注意:仅供参考,这里是我解决成功的错误,下面的ceph2是我的用户名,官网上说不能用ceph当用户名。 1、Error:软件包与预期下载的不符。建议:运行 yum --enablerepo=centos-ceph-hammer clean metadata。当这种错误出现时,解决办法有两个:       重启机器,reboot。       换一个下载源,目标文件/etc/yum.repos...
关于安装mysql-python报错的问题总结
关于安装mysql-python报缺少config_win.h文件的解决方法
window下使用Mingw编译python扩展库ujson
放一个我编译好的http://download.csdn.net/detail/toontong/4372898 关于ujson,请看:http://simple-is-better.com/news/458 安装MinGW, 我使用mingw-get-inst-20120426.exe安装,网络安装,有时没法安装完整,下载总不稳定。 过了两天跑才下载到gcc.exe。 pyt
xcodebuild自动化打包失败,返回65
/usr/bin/codesign --force --sign 9FE9DD14E6144DF12DC9F2E27033A932D6C7CE6F --entitlements /Users/dev/jenkins/workspace/iOSTeacher_Custom/build/Build/Intermediates/QQing.build/Release-iphoneos/teacher.b
Python 安装bcrypt包 在64 Windows上 产生错误的解决方法
1.  error: Unable to find vcvarsall.bat 安装vs2008
linux(ubuntu)下编译安装cx_Freeze失败解决方法
今天准备把写好的程序打包,结果折腾了一天。先是用pyinstaller,发现打包出来运行不了,应该是在处理import出问题。于是考虑用cx freeze代替,结果在安装的时候就报错,后来找到了解决办法。先是从http://sourceforge.net/projects/cx-freeze/files/上下载cx_Freeze(版本4.3.3)的包 解压,执行:sudo python setup
node 编译遇到 Exit status 137问题解决
问题描述在虚拟机执行npm run build执行打包文件时候一直失败,然而在windows上就没有这个问题解决途径 加上管理员权限 sudo npm run build google找到两篇解决方案(npm ERR! weird error 137, npm install fails on Digital Ocean Ubuntu)其中关键引用: ① I’m getting this now
【REACT NATIVE 系列教程之十】真机运行报错COMMAND /BIN/SH FAILED WITH EXIT CODE 1 的解决方法
本站文章均为 李华明Himi 原创,转载务必在明显处注明: 转载自【黑米GameDev街区】 原文链接: http://www.himigame.com/react-native/2315.htmlHimi最近在真机运行遇到  Command /bin/sh failed with exit code 1  的错误, 模拟器运行没有任何问题。此问题已解决,这里分享下解决方案。先来看下错误日志,如下
Ubuntu下ceph快速安装(QUICK)
http://bbs.ceph.org.cn/article/831. 构成与预检————————————————————————————————————————————————构成      节点名称 │ 用户名 │  OS版本  │ 机器类型      管理节点  bees    Ubuntu14.04   Physical      monitor1  bees    Ubuntu14.04...
python模块MySQLdb安装失败解决方法
问题1: error: Microsoft Visual C++ 9.0 is required (Unable to find vcvarsall.bat). Get it from http://aka.ms/vcpython27 解决办法: 按上面提示到http://aka.ms/vcpython27下载安装后执行VCForPython27.msi。 问题2: _mys
基于centos6.7的Ceph分布式文件系统安装指南
Ceph是加州大学Santa Cruz分校的Sage Weil(DreamHost的联合创始人)专为博士论文设计的新一代自由软件分布式文件系统。自2007年毕业之后,Sage开始全职投入到Ceph开 发之中,使其能适用于生产环境。Ceph的主要目标是设计成基于POSIX的没有单点故障的分布式文件系统,使数据能容错和无缝的复制。2010年3 月,Linus Torvalds将Ceph clien
友盟登录微信第三方登录报错解决linker command failed with exit code 1
:错误Undefined symbols for architecture x86_64: “OBJC_CLASS$_UMSocialUtils”, referenced from: objc-class-ref in libSocialWechat.a(UMSocialWechatHandler.o) ld: symbol(s) not found for architect
iOS 打包提示 Command/usr/bin/codesign failed with exit code 1 并且钥匙串中证书全部无效的解决方案
一、问题描述 由于苹果的根证书失效打企业包时发现提示报错 1akis25FC97FA851693DEEB23A01AD91B2D0ro09: no identity found Command /usr/bin/codesign failed with exit code 1 查看相关的证书配置并没有错误,打开钥匙串发现里面的证书都爆红显示此证书的颁发者无效。 不使用签名强行
一个签名错误的解决——codesign failed with exit code 1
前日,Macbook的硬盘不幸挂了,于是将开发环境迁移到Mac Mini下。大家知道,对于Xcode来说,最麻烦的就是各种证书、ProvisioningProfile的配置问题。将原来的各种开发证书和.p12证书导入到mini上,接下来就碰到了各种莫名其妙的问题。先是无法deve
libstdc++.6.tbd libstdc++.6.0.9.tbd
用于Xcode10升级后报错 ld:library not found for -lstdc++.6.0.9 clang:error:linker command failed with exit code 1 (use -v to see invocation) ld: library not found for -lstdc++.6 clang: error: linker command failed with exit code 1 (use -v to see invocation)
Ubuntu 15.04 安装TensorFlow(源码编译) 及测试梵高作画
介绍Google的TensorFlow机器学习开源库,在UbuntuKylin上的安装和和源码编译。 原始官方文档参见:http://www.tensorflow.org.TensorFlow学习资源推荐tensorflow中文入门教程-含视频 tensorflow入门视频教程-含互动tensorflow中文社区TensorFlow 官方文档中文版TensorFlow在图像识别中的应用本文是在安
Ceph删除/添加故障OSD(ceph-deploy)
今天有个osd起不来,发现是
Ubuntu16.04安装pycurl出错及解决方案
使用pip3安装pycurl出错:    出错信息如下:Running setup.py bdist_wheel for pycurl ... error Complete output from command /usr/bin/python3 -u -c "import setuptools, tokenize;__file__='/tmp/pip-build-848764ps/pycur...
ns3的click又编译失败了
[1501/2551] Compiling src/config-store/model/config-store.cc [1502/2551] Compiling src/click/examples/nsclick-defines.cc [1503/2551] Compiling src/click/examples/nsclick-udp-client-server-wifi.cc [1
IOS开发笔记:编译时出现的错误
1、"std::ios_base::Init::~Init()", referenced from 出现这样的编译问题,是需要再加进libstdc++.dylib和libstdc++.6.dylib(为6.1使用) 2、apple Mach-o Linker error通常是因为compile source中有相同的.m文件  3、如果在真机中进行测试时出现failed to
django-wiki与ldap的认证的安装问题
版本:ubuntu16.04, python3.5安装包如下:pip install Pillow安装django:pip intsall django==1.11安装wiki: pip install git+git://github.com/django-wiki/django-wiki.git使用mysql数据库,需安装:pip install pymysql(在django根__init_...
机器学习mxnet mac下编译问题
机器学习库mxnet,这个库是c++编写的,需要先编译再使用,步骤稍微多些 1.下载代码先 git clone --recursive https://github.com/dmlc/mxnet 2.依赖库编译 brew update brew tap homebrew/science brew install opencv brew install openblas 3.配置
导入ffmpeg 遇到的问题
拖进包含ffmpeg 的库所添加的处理的信息 要在 user head search head 添加头文件 $(PROJECT_DIR)/TWIPCSDK/FFmpeg/include 然后要添加这几个库 libiconv.tbd libz.tbd libbz2.1.0.tbd 这三个库文件 bitcode 要设置为NO10 duplicate symbols for archite