android studio 安装调试时出现cannot find kernel file 错误

图片说明
请大神帮帮忙!

Csdn user default icon
上传中...
上传图片
插入图片
抄袭、复制答案,以达到刷声望分或其他目的的行为,在CSDN问答是严格禁止的,一经发现立刻封号。是时候展现真正的技术了!
其他相关推荐
关于Android Studio 导入项目时出现cannot find settings.jar错误的解决办法
使用android studio3导入项目时,出现cannot find settings.jar的错误,百思不得其解。后来偶然点到file—new才发现,原来import project在这里,直接点file出现的是import setting。再后来发现还有很多人跟我犯一样的错误。。。以上就是解决办法!...
解决方法:Cannot find the class file for java.lang.Object错误!
今天下载了一个spring版的宠物店,导入Eclipse出现错误:Description Resource Path Location TypernThe project was not built since its build path is incomplete. Cannot find the class file for java.lang.Object. Fix the build path then try building this project jpetstore-project Unknown Java Problemrn,经过网上查找资料及实践认证,以下方法可以解决该问题:rn点击project----->propertys------>Java Build Path -----> Libraries---->Add Libraries----->rnrnJRE System Library------>选第一个workspace default jre-------->finish,这样就OK了!rnrn希望对别的童鞋有帮助,O(∩_∩)O谢谢!rn
Cannot find or open the PDB file?
Cannot find or open the PDB file?rn程序代码:rn#include rnrnLRESULT CALLBACK WndProc(HWND, UINT, WPARAM, LPARAM);rnrnint WINAPI WinMain(HINSTANCE hInstance, HINSTANCE hPrevInstance, PSTR iCmdLine, int iCmdShow)rnrn static TCHAR szAppName[] = TEXT("Draw a point!");rn HWND hwnd;rn MSG msg;rn WNDCLASS wndclass;rnrn wndclass.style = CS_HREDRAW | CS_VREDRAW;rn wndclass.lpfnWndProc = WndProc;rn wndclass.cbClsExtra = 0;rn wndclass.cbWndExtra = 0;rn wndclass.hbrBackground = (HBRUSH)GetStockObject(WHITE_BRUSH);rn wndclass.hInstance = hInstance;rn wndclass.hCursor = LoadCursor(NULL, IDC_ARROW);rn wndclass.hIcon = LoadIcon(NULL, IDI_APPLICATION);rn wndclass.lpszClassName = szAppName;rn wndclass.lpszMenuName = NULL;rnrn if (!RegisterClass(&wndclass))rn rn MessageBox(NULL, TEXT("This program requires windows NT!"), szAppName, MB_ICONERROR);rn return 0;rn rnrn hwnd = CreateWindow (szAppName, TEXT("One Point"), WS_OVERLAPPEDWINDOW, CW_USEDEFAULT,rn CW_USEDEFAULT, CW_USEDEFAULT, CW_USEDEFAULT, NULL, NULL, hInstance, NULL);rnrn if(hwnd == NULL)rn rn MessageBox(NULL, TEXT("No more memory for CreateWindow!"), szAppName, MB_ICONERROR);rn return 0;rn rnrn ShowWindow(hwnd, iCmdShow);rn UpdateWindow(hwnd);rnrn while (GetMessage(&msg, NULL, 0, 0))rn rn TranslateMessage(&msg);rn DispatchMessage(&msg);rn rnrn return msg.wParam;rnrnrnLRESULT CALLBACK WndProc(HWND hwnd, UINT message, WPARAM wParam, LPARAM lParam)rnrn static int cxClient, cyClient;rn HDC hdc;rn PAINTSTRUCT ps;rn int i;rnrn switch (message)rn rn case WM_CREATE:rn cxClient = LOWORD(lParam);rn cyClient = HIWORD(lParam);rn return 0;rn case WM_PAINT:rn hdc = BeginPaint(hwnd, &ps);rn MoveToEx(hdc, 0, cyClient/2, NULL);rn LineTo(hdc,cxClient, cyClient/2);rn MoveToEx(hdc, cxClient/2, 0, NULL);rn LineTo(hdc, cxClient/2, cyClient);rn EndPaint(hwnd,&ps);rn case WM_DESTROY:rn PostQuitMessage(0);rn return 0;rn rn return DefWindowProc(hwnd, message, wParam, lParam);rnrnrn这个是画个十字交叉的两条直线的程序,运行后屏幕一闪而过?rn“画点004.exe”: 已加载“D:\project\C++\画点004\Debug\画点004.exe”,已加载符号。rn“画点004.exe”: 已加载“C:\WINDOWS\system32\ntdll.dll”,Cannot find or open the PDB filern“画点004.exe”: 已加载“C:\WINDOWS\system32\kernel32.dll”,Cannot find or open the PDB filern“画点004.exe”: 已加载“C:\WINDOWS\system32\user32.dll”,Cannot find or open the PDB filern“画点004.exe”: 已加载“C:\WINDOWS\system32\gdi32.dll”,Cannot find or open the PDB filern“画点004.exe”: 已加载“C:\WINDOWS\system32\msvcr100d.dll”,已加载符号。rn“画点004.exe”: 已加载“C:\WINDOWS\system32\imm32.dll”,Cannot find or open the PDB filern“画点004.exe”: 已加载“C:\WINDOWS\system32\advapi32.dll”,Cannot find or open the PDB filern“画点004.exe”: 已加载“C:\WINDOWS\system32\rpcrt4.dll”,Cannot find or open the PDB filern“画点004.exe”: 已加载“C:\WINDOWS\system32\secur32.dll”,Cannot find or open the PDB filern“画点004.exe”: 已加载“C:\WINDOWS\system32\lpk.dll”,Cannot find or open the PDB filern“画点004.exe”: 已加载“C:\WINDOWS\system32\usp10.dll”,Cannot find or open the PDB filern“画点004.exe”: 已加载“C:\WINDOWS\system32\uxtheme.dll”,Cannot find or open the PDB filern“画点004.exe”: 已加载“C:\WINDOWS\system32\msvcrt.dll”,Cannot find or open the PDB filern“画点004.exe”: 已加载“C:\Program Files\360\360Safe\safemon\safemon.dll”,Cannot find or open the PDB filern“画点004.exe”: 已加载“C:\WINDOWS\system32\shell32.dll”,Cannot find or open the PDB filern“画点004.exe”: 已加载“C:\WINDOWS\system32\shlwapi.dll”,Cannot find or open the PDB filern“画点004.exe”: 已加载“C:\WINDOWS\system32\ole32.dll”,Cannot find or open the PDB filern“画点004.exe”: 已加载“C:\WINDOWS\system32\oleaut32.dll”,Cannot find or open the PDB filern“画点004.exe”: 已加载“C:\WINDOWS\system32\msvcp60.dll”,Cannot find or open the PDB filern“画点004.exe”: 已加载“C:\WINDOWS\system32\wininet.dll”,Cannot find or open the PDB filern“画点004.exe”: 已加载“C:\WINDOWS\system32\crypt32.dll”,Cannot find or open the PDB filern“画点004.exe”: 已加载“C:\WINDOWS\system32\msasn1.dll”,Cannot find or open the PDB filern“画点004.exe”: 已加载“C:\WINDOWS\system32\psapi.dll”,Cannot find or open the PDB filern“画点004.exe”: 已加载“C:\WINDOWS\system32\ws2_32.dll”,Cannot find or open the PDB filern“画点004.exe”: 已加载“C:\WINDOWS\system32\ws2help.dll”,Cannot find or open the PDB filern“画点004.exe”: 已加载“C:\WINDOWS\system32\version.dll”,Cannot find or open the PDB filern“画点004.exe”: 已加载“C:\WINDOWS\WinSxS\x86_Microsoft.Windows.Common-Controls_6595b64144ccf1df_6.0.2600.6028_x-ww_61e65202\comctl32.dll”,Cannot find or open the PDB filern“画点004.exe”: 已加载“C:\WINDOWS\system32\comctl32.dll”,Cannot find or open the PDB filern“画点004.exe”: 已加载“C:\WINDOWS\system32\MSCTF.dll”,Cannot find or open the PDB filern“画点004.exe”: 已加载“C:\WINDOWS\system32\msctfime.ime”,Cannot find or open the PDB filern程序“[3320] 画点004.exe: 本机”已退出,返回值为 0 (0x0)。rn什么原因,怎么弄。
the system cannot find the file specified
文件上传到服务器,提示成功,但去删除的时候却提示:the system cannot find the file specified。rn我的ftp权限是最高权限。
交叉编译出现错误cannot find -lpcap
libpcap这个库我是安装了的,并且在各个lib目录下都链接了这个库,但是仍然有这个问题rnlibtool: link: mips64-octeon-linux-gnu-gcc -g -O2 -o .libs/OpenDPI_demo OpenDPI_demo.o -L/lib ../../../src/lib/.libs/libopendpi.so -lpcaprn/usr/local/OCTEON-SDK/tools-gcc-4.1/bin/../lib/gcc/mips64-octeon-linux-gnu/4.1.2/../../../../mips64-octeon-linux-gnu/bin/ld: skipping incompatible /lib/libpcap.so when searching for -lpcaprn/usr/local/OCTEON-SDK/tools-gcc-4.1/bin/../lib/gcc/mips64-octeon-linux-gnu/4.1.2/../../../../mips64-octeon-linux-gnu/bin/ld: skipping incompatible /lib/libpcap.a when searching for -lpcaprn/usr/local/OCTEON-SDK/tools-gcc-4.1/bin/../lib/gcc/mips64-octeon-linux-gnu/4.1.2/../../../../mips64-octeon-linux-gnu/bin/ld: skipping incompatible /usr/local/OCTEON-SDK/tools-gcc-4.1/bin/../lib/gcc/mips64-octeon-linux-gnu/4.1.2/libpcap.so when searching for -lpcaprn/usr/local/OCTEON-SDK/tools-gcc-4.1/bin/../lib/gcc/mips64-octeon-linux-gnu/4.1.2/../../../../mips64-octeon-linux-gnu/bin/ld: skipping incompatible /usr/local/OCTEON-SDK/tools-gcc-4.1/bin/../lib/gcc/mips64-octeon-linux-gnu/4.1.2/libpcap.a when searching for -lpcaprn/usr/local/OCTEON-SDK/tools-gcc-4.1/bin/../lib/gcc/mips64-octeon-linux-gnu/4.1.2/../../../../mips64-octeon-linux-gnu/bin/ld: skipping incompatible /usr/local/OCTEON-SDK/tools-gcc-4.1/bin/../mips64-octeon-linux-gnu/sys-root/lib/libpcap.so when searching for -lpcaprn/usr/local/OCTEON-SDK/tools-gcc-4.1/bin/../lib/gcc/mips64-octeon-linux-gnu/4.1.2/../../../../mips64-octeon-linux-gnu/bin/ld: cannot find -lpcaprncollect2: ld returned 1 exit statusrnmake[1]: *** [OpenDPI_demo] Error 1rnmake[1]: Leaving directory `/home/mengxh/download/opendpi/src/examples/OpenDPI_demo'rnmake: *** [all-recursive] Error 1rn[root@localhost opendpi]# cd -rn/usr/local/OCTEON-SDK/tools/mips64-octeon-linux-gnu/sys-root/librn[root@localhost lib]# rn真心求解释
运行QT程序时出现错误:cannot find -IGL
在centos7下运行QT程序: 出现错误: cannot find -IGL collect2:error:ld returned 1 exit status 解决方法:安装libGL库 rpm -qa | grep GL 或者 yum install libGL mesa-libGL-devel.x86_64
android studio出现的错误
新手上路,求大神指教n应该怎样修改![图片说明](http://forum.csdn.net/PointForum/ui/scripts/csdn/Plugin/001/face/1.gif),下图有错误的那个地方,n搞了很久都没搞好,帮帮忙!!!![图片](https://img-ask.csdn.net/upload/201703/03/1488470523_843570.jpg)
Android Studio 出现错误
![图片说明](https://img-ask.csdn.net/upload/201510/09/1444352584_996428.png)Error:failed to find Build Tools revision 19.1.0
编译出现cannot open file "mfc42ud.lib"的错误!
这是个什么错误啊,mfc42ud.dll好象是MFC自带的啊
安装Android studio时出现下图错误
安装Android studio时出现下图错误,为什么会这样?rn[img=https://img-bbs.csdn.net/upload/201809/24/1537797235_419184.png][/img]
Android Studio导入工程时出现的几种错误
Android Studio Failure[INSTALL_FAILED_OLDER_SDK]
VS2010里的"Cannot find or open the PDB file"错误 opencv
'1test.exe': Loaded 'C:\Users\Administrator\Documents\Visual Studio 2010\Projects\1test\Debug\1test.exe', Symbols loaded.rn'1test.exe': Loaded 'C:\Windows\SysWOW64\ntdll.dll', Symbols loaded (source information stripped).rn'1test.exe': Loaded 'C:\Windows\SysWOW64\kernel32.dll', Symbols loaded (source information stripped).rn'1test.exe': Loaded 'C:\Windows\SysWOW64\KernelBase.dll', Symbols loaded (source information stripped).rn'1test.exe': Loaded 'D:\opencv\build\x86\vc10\bin\opencv_core249d.dll', Cannot find or open the PDB filern'1test.exe': Loaded 'C:\Windows\SysWOW64\msvcp100d.dll', Symbols loaded.rn'1test.exe': Loaded 'C:\Windows\SysWOW64\msvcr100d.dll', Symbols loaded.rn'1test.exe': Loaded 'D:\opencv\build\x86\vc10\bin\opencv_highgui249d.dll', Cannot find or open the PDB filern'1test.exe': Loaded 'C:\Windows\SysWOW64\user32.dll', Symbols loaded (source information stripped).rn'1test.exe': Loaded 'C:\Windows\SysWOW64\gdi32.dll', Symbols loaded (source information stripped).rn'1test.exe': Loaded 'C:\Windows\SysWOW64\lpk.dll', Symbols loaded (source information stripped).rn'1test.exe': Loaded 'C:\Windows\SysWOW64\usp10.dll', Symbols loaded (source information stripped).rn'1test.exe': Loaded 'C:\Windows\SysWOW64\msvcrt.dll', Symbols loaded (source information stripped).rn'1test.exe': Loaded 'C:\Windows\SysWOW64\advapi32.dll', Symbols loaded (source information stripped).rn'1test.exe': Loaded 'C:\Windows\SysWOW64\sechost.dll', Symbols loaded (source information stripped).rn'1test.exe': Loaded 'C:\Windows\SysWOW64\rpcrt4.dll', Symbols loaded (source information stripped).rn'1test.exe': Loaded 'C:\Windows\SysWOW64\sspicli.dll', Symbols loaded (source information stripped).rn'1test.exe': Loaded 'C:\Windows\SysWOW64\cryptbase.dll', Symbols loaded (source information stripped).rn'1test.exe': Loaded 'C:\Windows\SysWOW64\ole32.dll', Symbols loaded.rn'1test.exe': Loaded 'C:\Windows\SysWOW64\oleaut32.dll', Symbols loaded (source information stripped).rn'1test.exe': Loaded 'C:\Windows\winsxs\x86_microsoft.windows.common-controls_6595b64144ccf1df_5.82.7601.18837_none_ec86b8d6858ec0bc\comctl32.dll', Symbols loaded (source information stripped).rn'1test.exe': Loaded 'C:\Windows\SysWOW64\avifil32.dll', Symbols loaded (source information stripped).rn'1test.exe': Loaded 'C:\Windows\SysWOW64\winmm.dll', Symbols loaded (source information stripped).rn'1test.exe': Loaded 'C:\Windows\SysWOW64\msacm32.dll', Symbols loaded (source information stripped).rn'1test.exe': Loaded 'C:\Windows\SysWOW64\msvfw32.dll', Symbols loaded (source information stripped).rn'1test.exe': Loaded 'C:\Windows\SysWOW64\shell32.dll', Symbols loaded (source information stripped).rn'1test.exe': Loaded 'C:\Windows\SysWOW64\shlwapi.dll', Symbols loaded (source information stripped).rn'1test.exe': Loaded 'C:\Windows\SysWOW64\avicap32.dll', Symbols loaded (source information stripped).rn'1test.exe': Loaded 'C:\Windows\SysWOW64\version.dll', Symbols loaded (source information stripped).rn'1test.exe': Loaded 'C:\Windows\SysWOW64\imm32.dll', Symbols loaded (source information stripped).rn'1test.exe': Loaded 'C:\Windows\SysWOW64\msctf.dll', Symbols loaded (source information stripped).rn'1test.exe': Loaded 'C:\Windows\SysWOW64\uxtheme.dll', Symbols loaded (source information stripped).rn'1test.exe': Loaded 'C:\Windows\SysWOW64\apphelp.dll', Symbols loaded (source information stripped).rn'1test.exe': Loaded 'C:\Windows\SysWOW64\GooglePinyin2.ime', Cannot find or open the PDB filern'1test.exe': Unloaded 'C:\Windows\SysWOW64\GooglePinyin2.ime'rn'1test.exe': Loaded 'C:\Windows\SysWOW64\GooglePinyin2.ime', Cannot find or open the PDB filern'1test.exe': Loaded 'C:\Windows\SysWOW64\crypt32.dll', Symbols loaded (source information stripped).rn'1test.exe': Loaded 'C:\Windows\SysWOW64\msasn1.dll', Symbols loaded (source information stripped).rn'1test.exe': Loaded 'C:\Windows\SysWOW64\wintrust.dll', Symbols loaded (source information stripped).rn'1test.exe': Loaded 'C:\Windows\SysWOW64\msimg32.dll', Symbols loaded (source information stripped).rn'1test.exe': Loaded 'C:\Windows\winsxs\x86_microsoft.windows.gdiplus_6595b64144ccf1df_1.1.7601.18834_none_72d38c5186679d48\GdiPlus.dll', Symbols loaded (source information stripped).rn'1test.exe': Loaded 'C:\Windows\SysWOW64\dbghelp.dll', Symbols loaded (source information stripped).rn'1test.exe': Loaded 'C:\Windows\SysWOW64\wininet.dll', Symbols loaded (source information stripped).rn'1test.exe': Loaded 'C:\Windows\SysWOW64\api-ms-win-downlevel-user32-l1-1-0.dll', Symbols loaded (source information stripped).rn'1test.exe': Loaded 'C:\Windows\SysWOW64\api-ms-win-downlevel-shlwapi-l1-1-0.dll', Symbols loaded (source information stripped).rn'1test.exe': Loaded 'C:\Windows\SysWOW64\api-ms-win-downlevel-version-l1-1-0.dll', Symbols loaded (source information stripped).rn'1test.exe': Loaded 'C:\Windows\SysWOW64\api-ms-win-downlevel-normaliz-l1-1-0.dll', Symbols loaded (source information stripped).rn'1test.exe': Loaded 'C:\Windows\SysWOW64\normaliz.dll', Symbols loaded (source information stripped).rn'1test.exe': Loaded 'C:\Windows\SysWOW64\iertutil.dll', Symbols loaded (source information stripped).rn'1test.exe': Loaded 'C:\Windows\SysWOW64\api-ms-win-downlevel-advapi32-l1-1-0.dll', Symbols loaded (source information stripped).rn'1test.exe': Loaded 'C:\Windows\SysWOW64\userenv.dll', Symbols loaded (source information stripped).rn'1test.exe': Loaded 'C:\Windows\SysWOW64\profapi.dll', Symbols loaded (source information stripped).rn'1test.exe': Loaded 'C:\Windows\SysWOW64\dwmapi.dll', Symbols loaded (source information stripped).rn'1test.exe': Loaded 'C:\Windows\SysWOW64\ntmarta.dll', Symbols loaded (source information stripped).rn'1test.exe': Loaded 'C:\Windows\SysWOW64\Wldap32.dll', Symbols loaded (source information stripped).rn'1test.exe': Loaded 'C:\Windows\SysWOW64\ieframe.dll', Symbols loaded (source information stripped).rn'1test.exe': Loaded 'C:\Windows\SysWOW64\api-ms-win-downlevel-shell32-l1-1-0.dll', Symbols loaded (source information stripped).rn'1test.exe': Loaded 'C:\Windows\winsxs\x86_microsoft.windows.common-controls_6595b64144ccf1df_6.0.7601.18837_none_41e855142bd5705d\comctl32.dll', Symbols loaded (source information stripped).rn'1test.exe': Unloaded 'C:\Windows\SysWOW64\ieframe.dll'rn'1test.exe': Unloaded 'C:\Windows\SysWOW64\api-ms-win-downlevel-shell32-l1-1-0.dll'rn'1test.exe': Loaded 'C:\Windows\SysWOW64\clbcatq.dll', Symbols loaded (source information stripped).rn'1test.exe': Loaded 'C:\Windows\SysWOW64\msxml3.dll', Symbols loaded (source information stripped).rn'1test.exe': Loaded 'C:\Windows\SysWOW64\WindowsCodecs.dll', Symbols loaded (source information stripped).rnFirst-chance exception at 0x758fc42d (KernelBase.dll) in 1test.exe: Microsoft C++ exception: cv::Exception at memory location 0x002ff968..rnUnhandled exception at 0x758fc42d (KernelBase.dll) in 1test.exe: Microsoft C++ exception: cv::Exception at memory location 0x002ff968..rnFirst-chance exception at 0x758fc42d (KernelBase.dll) in 1test.exe: Microsoft C++ exception: cv::Exception at memory location 0x002fea50..rnUnhandled exception at 0x758fc42d (KernelBase.dll) in 1test.exe: Microsoft C++ exception: cv::Exception at memory location 0x002fea50..rn
VS2010里的"Cannot find or open the PDB file"错误
以下是我的程序:rn#include "highgui.h"rnrnint main()rnrn IplImage* img = cvLoadImage("D:\Documents\Pictures\wolfsrain0.png");rn cvNamedWindow("Example1", CV_WINDOW_AUTOSIZE);rn cvShowImage("Example1", img);rn cvWaitKey(0);rn cvReleaseImage(&img);rn cvDestroyWindow("Example1");rnrn这段程序是抄的《learning opencv》里的,用于从磁盘加载并在屏幕上显示一幅图像。rn但我运行之后显示出来的图像是一片灰白,在下方的output里有如下报错信息:rnrn'test.exe': Loaded 'D:\Documents\Visual Studio 2010\Projects\test\Debug\test.exe', Symbols loaded.rn'test.exe': Loaded 'C:\Windows\System32\ntdll.dll', Cannot find or open the PDB filern'test.exe': Loaded 'C:\Windows\System32\kernel32.dll', Cannot find or open the PDB filern'test.exe': Loaded 'C:\Windows\System32\KernelBase.dll', Cannot find or open the PDB filern'test.exe': Loaded 'D:\OpenCV\opencv\build\x86\vc10\bin\opencv_highgui231d.dll', Cannot find or open the PDB filern'test.exe': Loaded 'C:\Windows\System32\user32.dll', Cannot find or open the PDB filern'test.exe': Loaded 'C:\Windows\System32\gdi32.dll', Cannot find or open the PDB filern'test.exe': Loaded 'C:\Windows\System32\lpk.dll', Cannot find or open the PDB filern'test.exe': Loaded 'C:\Windows\System32\usp10.dll', Cannot find or open the PDB filern'test.exe': Loaded 'C:\Windows\System32\msvcrt.dll', Cannot find or open the PDB filern'test.exe': Loaded 'C:\Windows\System32\ole32.dll', Cannot find or open the PDB filern'test.exe': Loaded 'C:\Windows\System32\rpcrt4.dll', Cannot find or open the PDB filern'test.exe': Loaded 'C:\Windows\System32\oleaut32.dll', Cannot find or open the PDB filern'test.exe': Loaded 'C:\Windows\System32\advapi32.dll', Cannot find or open the PDB filern'test.exe': Loaded 'C:\Windows\System32\sechost.dll', Cannot find or open the PDB filern'test.exe': Loaded 'D:\OpenCV\opencv\build\x86\vc10\bin\opencv_core231d.dll', Cannot find or open the PDB filern'test.exe': Loaded 'C:\Windows\System32\msvcp100d.dll', Symbols loaded.rn'test.exe': Loaded 'C:\Windows\System32\msvcr100d.dll', Symbols loaded.rn'test.exe': Loaded 'C:\Windows\winsxs\x86_microsoft.windows.common-controls_6595b64144ccf1df_5.82.7601.17514_none_ec83dffa859149af\comctl32.dll', Cannot find or open the PDB filern'test.exe': Loaded 'C:\Windows\System32\avifil32.dll', Cannot find or open the PDB filern'test.exe': Loaded 'C:\Windows\System32\winmm.dll', Cannot find or open the PDB filern'test.exe': Loaded 'C:\Windows\System32\msacm32.dll', Cannot find or open the PDB filern'test.exe': Loaded 'C:\Windows\System32\msvfw32.dll', Cannot find or open the PDB filern'test.exe': Loaded 'C:\Windows\System32\shell32.dll', Cannot find or open the PDB filern'test.exe': Loaded 'C:\Windows\System32\shlwapi.dll', Cannot find or open the PDB filern'test.exe': Loaded 'C:\Windows\System32\avicap32.dll', Cannot find or open the PDB filern'test.exe': Loaded 'C:\Windows\System32\version.dll', Cannot find or open the PDB filern'test.exe': Loaded 'C:\Windows\System32\imm32.dll', Cannot find or open the PDB filern'test.exe': Loaded 'C:\Windows\System32\msctf.dll', Cannot find or open the PDB filern'test.exe': Loaded 'C:\Windows\System32\cryptbase.dll', Cannot find or open the PDB filern'test.exe': Loaded 'C:\Windows\System32\uxtheme.dll', Cannot find or open the PDB filern'test.exe': Loaded 'D:\360\360Safe\safemon\safemon.dll', Cannot find or open the PDB filern'test.exe': Loaded 'C:\Windows\System32\psapi.dll', Cannot find or open the PDB filern'test.exe': Loaded 'C:\Windows\System32\wininet.dll', Cannot find or open the PDB filern'test.exe': Loaded 'C:\Windows\System32\normaliz.dll', Cannot find or open the PDB filern'test.exe': Loaded 'C:\Windows\System32\iertutil.dll', Cannot find or open the PDB filern'test.exe': Loaded 'C:\Windows\System32\urlmon.dll', Cannot find or open the PDB filern'test.exe': Loaded 'C:\Windows\System32\ws2_32.dll', Cannot find or open the PDB filern'test.exe': Loaded 'C:\Windows\System32\nsi.dll', Cannot find or open the PDB filern'test.exe': Loaded 'C:\Windows\System32\dwmapi.dll', Cannot find or open the PDB filern'test.exe': Loaded 'C:\Windows\System32\clbcatq.dll', Cannot find or open the PDB filernThe thread 'Win32 Thread' (0x1fc8) has exited with code -1073741510 (0xc000013a).rnThe program '[7400] test.exe: Native' has exited with code -1073741510 (0xc000013a).rnrn请问错误在哪里?
Android studio出现了Could not find method estImplementation()
Could not find method estImplementation() for arguments [junit:junit:4.12] on object of type org.gradle.api.internal.artifacts.dsl.dependencies.DefaultDependencyHandler.[img=https://img-bbs.csdn.net/upload/201904/21/1555776535_535887.png][/img][img=https://img-bbs.csdn.net/upload/201904/21/1555776547_995414.png][/img]
Cannot find a Player for :file 如何解决
今天做了一个java播放器 但老是报错Cannot find a Player for :file 我应当如何让解决如何解决
关于Ftp的the system cannot find the file specified
提示错误:the system cannot find the file specifiedrn[code=Delphi(Pascal)]rn //附件双击rnVarrn Name, Line: String;rn IsDirectory: Boolean;rnbeginrn Line:='D:\Temp';rn CreateDirectory(Line,nil);rn if DataSetBroker5.DataSet.RecordCount=0 then Exit;rn if not IdFTP1.Connected then exit;rn Name:=DataSetBroker5.DataSet.FieldByName('FWQWJM').AsString;rn if IsDirectory then beginrn IdFTP1.ChangeDir(Name);rn IdFTP1.TransferType :=TIdFTPTransferType.ftASCII;rn endrn else beginrn tryrn Line :=Line+'\'+Name;rn IdFTP1.TransferType :=TIdFTPTransferType.ftBinary;rn BytesToTransfer := IdFTP1.Size(Name);rn [color=#FF0000]IdFTP1.Get(Name,Line, true);[/color]rn Exceptrn end;rn end;rnrn ShellExecute(Handle, 'open', PChar(Line), '', '', SW_SHOW);rnrnend;rn[/code]rnName的值是7095619A-19A4-4D29-A752-7C36A47C6DEC.pdfrnrn我用别人写的程序打开的话是能打开的(FTP服务器是别人的,我复制它们的表的数据,自己在做个FTP链接使用他们的FTP服务器)rnrn自己写的上面代码,就出现了那问题,何解?rn
config.status: error: cannot find input file: Makefile.in
除了可能是configure.in文件格式的问题(set ff=unix),另一种方法也许可以解决这个问题:rn在Makefile.am里添加一行: AUTOMAKE_OPTIONS=foreignrn
主页提示the system cannot find the special file
主页提示the system cannot find the special file,主页上的图片也无法显示,都是红叉,但是我取得它的连接在新的IE上输入却能看到图片。请教!rn 网站是在windows 2000 server上建立,上面也有域用户管理。
carbide.c++ The system cannot find the file specified
在用carbide,helloworld生成之后报错The system cannot find the file specified,只有这一行,别的什么都没有我现在已经把所有的东西改成默认路径了,哪位大大帮着解决下啊
[CDT4]"The system cannot find the file specified"
各位大侠:rnrn小弟在xp下搭建了eclipse+cdt4+cygwin的平台,make,gcc,g++等应用程序在cygwin\bin目录下均有,我也Window得环境变量PATH里设置了:C:\App\Cygwin\bin;也在eclipse里的变量里将PATH引入了,但仍不能编译,报错:rnrn"**** Build of configuration Debug for project HelloWorld ****rnrnrn(Exec error:The system cannot find the file specified.rn)rn"rnrn能知道我是哪里可能还没配好么?rnrn谢谢先
config.status: error: cannot find input file: config.h.in
[root@localhost ntop-3.2]# makerncd . && /bin/sh ./missing --run echornrncd && /bin/sh /ntop-3.2/config.status config.hrnconfig.status: creating config.hrnconfig.status: error: cannot find input file: config.h.inrnmake: *** [stamp-h1] 错误 1rnrnrn 新手,出现如下错误! 麻烦给指教!!!
VS2010下Cannot find or open the PDB file
这是一个网络通讯的服务器程序,运行几个小时候就不知怎么的接收数据的线程收不到数据退出了。然后报类似下面的这种错误,程序也并没有退出,但就是没法正常收发数据了。请大家指点,谢谢啦。rnrn“TCPSrv.exe”: 已加载“C:\Windows\System32\ws2_32.dll”,Cannot find or open the PDB filern“TCPSrv.exe”: 已加载“C:\Windows\System32\msvcrt.dll”,Cannot find or open the PDB filern“TCPSrv.exe”: 已加载“C:\Windows\System32\rpcrt4.dll”,Cannot find or open the PDB filern“TCPSrv.exe”: 已加载“C:\Windows\System32\nsi.dll”,Cannot find or open the PDB filern“TCPSrv.exe”: 已加载“C:\Windows\System32\mswsock.dll”,Cannot find or open the PDB filern“TCPSrv.exe”: 已加载“C:\Windows\System32\user32.dll”,Cannot find or open the PDB filern“TCPSrv.exe”: 已加载“C:\Windows\System32\gdi32.dll”,Cannot find or open the PDB filern“TCPSrv.exe”: 已加载“C:\Windows\System32\lpk.dll”,Cannot find or open the PDB filern“TCPSrv.exe”: 已加载“C:\Windows\System32\usp10.dll”,Cannot find or open the PDB filern“TCPSrv.exe”: 已加载“C:\Windows\System32\imm32.dll”,Cannot find or open the PDB filern“TCPSrv.exe”: 已加载“C:\Windows\System32\msctf.dll”,Cannot find or open the PDB file
cannot find or open PDB file 如何破?
[img=https://img-bbs.csdn.net/upload/201311/11/1384138947_29875.png][/img]rn如上图所示提示错误,控制台输出如下:rn“testUA.exe”: 已加载“E:\C++workplace\lccl02\resip\resip\recon\test\Win32\Debug\testUA.exe”,Cannot find or open the PDB filern“testUA.exe”: 已加载“C:\Windows\System32\ntdll.dll”,Cannot find or open the PDB filern“testUA.exe”: 已加载“C:\Windows\System32\kernel32.dll”,Cannot find or open the PDB filern“testUA.exe”: 已加载“C:\Windows\System32\KernelBase.dll”,Cannot find or open the PDB filern“testUA.exe”: 已加载“C:\Windows\System32\ws2_32.dll”,Cannot find or open the PDB filern“testUA.exe”: 已加载“C:\Windows\System32\msvcrt.dll”,Cannot find or open the PDB filern“testUA.exe”: 已加载“C:\Windows\System32\rpcrt4.dll”,Cannot find or open the PDB filern“testUA.exe”: 已加载“C:\Windows\System32\nsi.dll”,Cannot find or open the PDB filern“testUA.exe”: 已加载“C:\Windows\System32\libeay32.dll”,已加载符号。rn“testUA.exe”: 已加载“C:\Windows\System32\gdi32.dll”,Cannot find or open the PDB filern“testUA.exe”: 已加载“C:\Windows\System32\user32.dll”,Cannot find or open the PDB filern“testUA.exe”: 已加载“C:\Windows\System32\lpk.dll”,Cannot find or open the PDB filern“testUA.exe”: 已加载“C:\Windows\System32\usp10.dll”,Cannot find or open the PDB filern“testUA.exe”: 已加载“C:\Windows\System32\advapi32.dll”,Cannot find or open the PDB filern“testUA.exe”: 已加载“C:\Windows\System32\sechost.dll”,Cannot find or open the PDB filern“testUA.exe”: 已加载“C:\Windows\System32\msvcr100.dll”,Cannot find or open the PDB filern“testUA.exe”: 已加载“C:\Windows\System32\ssleay32.dll”,已加载符号。rn“testUA.exe”: 已加载“C:\Windows\System32\msvcp100d.dll”,已加载符号。rn“testUA.exe”: 已加载“C:\Windows\System32\msvcr100d.dll”,已加载符号。rn“testUA.exe”: 已加载“C:\Windows\System32\winmm.dll”,Cannot find or open the PDB filern“testUA.exe”: 已加载“C:\Windows\System32\imm32.dll”,Cannot find or open the PDB filern程序“[4560] testUA.exe: 本机”已退出,返回值为 0 (0x0)。rn网上修改 [b]调试->符号[/b] 不好使。rnCtrl+F5可以,但是,我需要的是可以调试的,可以加断点的。(加断点的方法也不好使)rn希望能得到一个好使的办法。rn除此之外,我的项目只能通过SSL-Debug调试,Debug报错,可让我也很头疼。rn求帮忙....
Android studio查看源码时出现“cannot resolve symbol”怎么解决
如题:Android studio查看源码时出现“cannot resolve symbol”怎么解决
(急! ! !)读取Excel文件时遇到The System cannot find the file specified
读取Excel文件时有时候遇到The System cannot find the file specified,不知道为什么?请高手指教
【Andoid Studio升级】Android Studio打包时出现一堆错误
错误如下: To run dex in process, the Gradle daemon needs a larger heap. It currently has approximately 910 MB. For faster builds, increase the maximum heap size for the Gradle daemon to more than
解决交叉编译应用程序出现的错误“ld: cannot find crtend_so.o: No such file or directory”错误
版权声明:本文为博主(宽简厚重,Yuesichiu)原创文章,未经博主允许不得转载。 http://blog.csdn.net/yuesichiu/article/details/77600124 最近在编译安卓环境下的Linux应用程序(C代码),编译C代码应用工具时报错“ld: cannot find crtend_so.o: No such file or directory”。
Android studio中,出现错误
找不到符号 变量NumberFormat![图片说明](https://img-ask.csdn.net/upload/201604/17/1460880381_665244.png)
Android Studio打包签名出现错误
忽略 某些错误 解决办法,在build.gradle里面添加如下代码,放在Android下面 lintOptions { checkReleaseBuilds false abortOnError false }
android studio 打包出现的错误
Error: Suspicious namespace and prefix combination [NamespaceTypo] when I try create Signed APK解决办法: 也就是说改一下布局文件的xmlns:app="http://schemas.android.com/tools" with this: 改成 xmlns:app="http://schemas.and
android studio 启动出现错误
java.lang.RuntimeException: java.lang.IllegalArgumentException: Argument for @NotNull parameter 'name' of com/android/tools/idea/welcome/Platform. must not be nullrn at com.intellij.idea.IdeaApplication.run(IdeaApplication.java:178)rn at com.intellij.idea.MainImpl$1$1$1.run(MainImpl.java:52)rn at java.awt.event.InvocationEvent.dispatch(InvocationEvent.java:311)rn at java.awt.EventQueue.dispatchEventImpl(EventQueue.java:744)rn at java.awt.EventQueue.access$400(EventQueue.java:97)rn at java.awt.EventQueue$3.run(EventQueue.java:697)rn at java.awt.EventQueue$3.run(EventQueue.java:691)rn at java.security.AccessController.doPrivileged(Native Method)rn at java.security.ProtectionDomain$1.doIntersectionPrivilege(ProtectionDomain.java:75)rn at java.awt.EventQueue.dispatchEvent(EventQueue.java:714)rn at com.intellij.ide.IdeEventQueue.dispatchEvent(IdeEventQueue.java:362)rn at java.awt.EventDispatchThread.pumpOneEventForFilters(EventDispatchThread.java:201)rn at java.awt.EventDispatchThread.pumpEventsForFilter(EventDispatchThread.java:116)rn at java.awt.EventDispatchThread.pumpEventsForHierarchy(EventDispatchThread.java:105)rn at java.awt.EventDispatchThread.pumpEvents(EventDispatchThread.java:101)rn at java.awt.EventDispatchThread.pumpEvents(EventDispatchThread.java:93)rn at java.awt.EventDispatchThread.run(EventDispatchThread.java:82)rnCaused by: java.lang.IllegalArgumentException: Argument for @NotNull parameter 'name' of com/android/tools/idea/welcome/Platform. must not be nullrn at com.android.tools.idea.welcome.Platform.(Platform.java)rn at com.android.tools.idea.welcome.Platform.getLatestPlatform(Platform.java:72)rn at com.android.tools.idea.welcome.Platform.createSubtree(Platform.java:89)rn at com.android.tools.idea.welcome.InstallComponentsPath.createComponentTree(InstallComponentsPath.java:81)rn at com.android.tools.idea.welcome.InstallComponentsPath.init(InstallComponentsPath.java:215)rn at com.android.tools.idea.wizard.DynamicWizardPath.attachToWizard(DynamicWizardPath.java:97)rn at com.android.tools.idea.wizard.DynamicWizard.addPath(DynamicWizard.java:233)rn at com.android.tools.idea.welcome.FirstRunWizard.init(FirstRunWizard.java:75)rn at com.android.tools.idea.welcome.FirstRunWizardHost.setupWizard(FirstRunWizardHost.java:100)rn at com.android.tools.idea.welcome.FirstRunWizardHost.getWelcomePanel(FirstRunWizardHost.java:92)rn at com.intellij.openapi.wm.impl.welcomeScreen.WelcomeFrame.(WelcomeFrame.java:68)rn at com.intellij.openapi.wm.impl.welcomeScreen.WelcomeFrame.showNow(WelcomeFrame.java:173)rn at com.intellij.idea.IdeaApplication$IdeStarter.main(IdeaApplication.java:302)rn at com.intellij.idea.IdeaApplication.run(IdeaApplication.java:172)rn ... 16 morernrn这个问题应该怎么解决?
Android studio 导入工程 出现错误
对于刚开始使用Android studio 并且以前不了解gradle,IDE之类的工具的人,导入个工程都是很大的问题。本人也是费了很大的力气才搞定。 github上有关Android studio的项目,通常两种形式 第一种:完整的Android studio工程,那么只需要File->New->import project  选中你要导入的工程即可
cannot find -llzo2和cannot find -luuid
如题,我在新装的ubuntu12.04 LST(amd64)上配置android编译环境进行编译后,出现如题的错误提示:cannot find -llzo2和cannot find -luuid,我在网上找了很多解决方法,都没有解决。总结网上的解决方法,我的相应现状是:rnrn1.执行过sudo apt-get install uuid-dev和sudo apt-get install liblzo2-dev,得到相应的库rn2.查看相应的软链接,发现在/usr/lib/x86_64-linux-gnu目录下都已经存在:rn libuuid.so -> /lib/x86_64-linux-gnu/libuuid.so.1.3.0rn liblzo2.so -> liblzo2.so.2.0.0rn3.查看库文件路径,vi /etc/ld.so.conf.d/x86_64-linux-gnu.conf,内容是:rn # Multiarch supportrn /lib/x86_64-linux-gnurn /usr/lib/x86_64-linux-gnurn查看后uuid和lzo2的库就分别安装在着两个路径下,因此也没问题rn4.我也执行过sudo ldconfig,没效果!rnrn以上问题,请教各位大牛,不知可有解决方法?!
cannot open file ntdll.lib 错误
VC6编译的时候 提示 rnLinking...rnLINK : fatal error LNK1104: cannot open file "ntdll.lib"rn执行 link.exe 时出错.rnrn请问有谁知道这个咋回事吗?
CList中用Find时出现的错误
struct BranchAdminrnrnCString Branch;rnCString Admin;rn;rnrnCList BranchAdminList;rn........................//往BranchAdminList里面添加了很多项rnrnBranchAdmin brAdm;rnbrAdm.Branch = "A";rnbrAdm.Adm = "B";rnBranchAdminList.Find(brAdm); //这里就出现了错误。rnrnd:\program files\microsoft visual studio\vc98\mfc\include\afxtempl.h(122) : error C2678: binary '==' : no operator defined which takes a left-hand operand of type 'const struct BranchAdmin' (or there is no acceptable conversion)rnrnd:\program files\microsoft visual studio\vc98\mfc\include\afxtempl.h(1036) : see reference to function template instantiation 'int __stdcall CompareElements(const struct BranchAdmin *,const struct BranchAdmin *)' being compiledrnError executing cl.exe.rnrn出错的地方到了这里rntemplaternBOOL AFXAPI CompareElements(const TYPE* pElement1, const ARG_TYPE* pElement2)rnrn ASSERT(AfxIsValidAddress(pElement1, sizeof(TYPE), FALSE));rn ASSERT(AfxIsValidAddress(pElement2, sizeof(ARG_TYPE), FALSE));rnrn return *pElement1 == *pElement2;rn
利用find()时出现了一些未知错误
我是想从CSV文件中提取Email Addressrn我的思路是首先找到@的位置,然后再向前找"和向后找"取得位置,再提取出来rn[code=C/C++]rn#includern#includern#includernusing namespace std;rnint main()rnrn vector st;rn vector st_save;rn ifstream inFile;rn inFile.open ("test.txt");rn if (!inFile.is_open())rn rn cout<<" 打开失败了\n";rn rn st.clear();rn st_save.clear();rn string stemp;rn while (getline(inFile, stemp))rn st.push_back(stemp);rn for (vector::iterator it = st.begin(); it != st.end(); it++)rn rn stemp = *it;rn size_t At_pace = stemp.find_first_of ('@'); //找到@的位置rn if (! (At_pace == string::npos) )rn rn size_t first_quotation = stemp.find_last_of ('"',At_pace); //搜索@前一个引号的位置rn size_t last_quotation = stemp.find_first_of ('"',At_pace); //搜索@前一个引号的位置rn size_t st_lengtn = last_quotation - first_quotation - 1; //取得Email Address的长度rn char st_email[st_lengtn];rn for (size_t i = 0; i < st_lengtn; ++i)rn rn st_email[i] = stemp[first_quotation+1+i];rn rn cout<::iterator it = st_save.begin(); it != st.end(); ++it)rn rn cout<<*it<
出现了这样的错误 Cannot find bean org.apache.struts.taglib.html.BEAN in any scope
代码如下,怎么出错了;rn而且struts包也在工程内rn欢迎大家指点。rnrn<%@ page contentType="text/html; charset=GBK" %>rnrn<%@ taglib uri="/WEB-INF/struts-bean.tld" prefix="bean" %>rn<%@ taglib uri="/WEB-INF/struts-html.tld" prefix="html" %>rn<%@ taglib uri="/WEB-INF/struts-logic.tld" prefix="logic" %>rnrnrn rnjsp1rnrnrnrnrnrnrnrnrn
ubuntu下QT出现cannot find -lGL错误的解决办法
在ubuntu中进行qt构建时出现cannot find -lGL错误, sudo apt-get install libqt4-dev 即可解决 若是进行qt5编程出现此种情况,可尝试输入 sudo apt-get install libglu1-mesa-dev -y 解决。
linux下运行make,出现错误cannot find -lcurl
错误如下rnrn/usr/bin/ld: cannot find -lcurlrncollect2: ld returned 1 exit statusrnmake: *** [bin/mod_billing.so] Error 1rnrn这是一个服务器的源代码rn我把Makefile文件如下rn源代码我传云盘上rn链接:http://pan.baidu.com/s/1bnkAyNt 密码:c7curnrn.PHONY: all clean cleanall res thirdlibrn #-Wpointer-arith -WinlinernCFLAGS=-g -Wall -Wno-deprecated -WerrorrnSHARED=-fPIC -sharedrnrnbin_dir=binrnmod_dir=modrn#mod_src=$(wildcard $(mod_dir)/*.c)rn#mod_so=$(patsubst %.c,%.so,$(notdir $(mod_src)))rnrnLDFLAGS=-Wl,-rpath,. -Lbinrnrnbase_src=\rn base/freeid.h \rn base/hashid.h \rn base/stringtable.h \rn base/args.c \rn base/args.h \rn base/gen_uuid.c \rn base/pack.c \rn base/unpack.c \rn base/uuid.h \rn base/util.c \rn base/util.hrnrnmod_so=\rn $(bin_dir)/mod_echo.so \rn $(bin_dir)/mod_gate.so \rn $(bin_dir)/mod_cmds.so \rn $(bin_dir)/mod_cmdctl.so \rn $(bin_dir)/mod_keepalivec.so \rn $(bin_dir)/mod_keepalived.sornrnall_t=\rn $(bin_dir)/libbase.so \rn $(bin_dir)/libtinyxml.so \rn $(mod_so) \rn $(bin_dir)/mod_robotcli.so \rn $(bin_dir)/mod_billing.so \rn $(bin_dir)/mod_db.so \rn $(bin_dir)/mod_game.sornrnall: $(all_t)rn rnrelease: CFLAGS += -O2 -fno-strict-aliasingrnrelease: allrnrn$(bin_dir)/libbase.so: $(base_src)rn @rm -f $@rn gcc $(CFLAGS) $(SHARED) -o $@ $^ -DHAVE_STDLIB_H -DHAVE_UNISTD_H -DHAVE_GETRLIMITrnrn$(mod_so): $(bin_dir)/%.so: $(mod_dir)/%.crn @rm -f $@rn gcc $(CFLAGS) $(SHARED) -o $@ $< -Iinclude/libshaco -Inet -Ibase -Imsgrnrn$(bin_dir)/mod_test.so: $(mod_dir)/mod_test.cpprn @rm -f $@rn gcc $(CFLAGS) $(SHARED) -o $@ $^ -Iinclude/libshaco -Inet -Ibase -Imsg -Iworldrnrn$(bin_dir)/mod_billing.so: $(mod_dir)/mod_billing.cpprn @rm -f $@rn g++ $(CFLAGS) $(SHARED) -o $@ $^ -Iinclude/libshaco -Inet -Ibase -Imod -Imsg -Imsg/Message -I3rd/curl $(LDFLAGS) -lcurlrnrn$(bin_dir)/mod_db.so: $(mod_dir)/mod_db.cpp \rn mod_db/db.h \rn mod_db/db_game.cpp \rn mod_db/db_log.cpp \rn mod_db/db_server_note.cpp \rn mod_db/CMysql.cpp \rn mod_db/CMysql.h \rn mod_db/GlobalUtilityFunction.cpp \rn mod_db/GlobalUtilityFunction.hrn @rm -f $@rn g++ $(CFLAGS) $(SHARED) -o $@ $^ -Iinclude/libshaco -Inet -Ibase -Imod -Imsg -Imsg/Message -Imod_db -I3rd/mysql -I3rd/mysql/mysql++ -I3rd $(LDFLAGS) -lmysqlpprnrnGAME_INC_PATH :=\rn -Iinclude/libshaco -Inet -Ibase -Itplt -Imod -Imsg -Imsg/Message -Imod_game -I3rd -I3rd/tinyXml -Imsg/iconv -Idatadefine -IpersistrnrnOBJS = $(patsubst mod_game/%.cpp,mod_game/%.o,$(wildcard mod_game/*.cpp))rn$(OBJS): mod_game/%.o: mod_game/%.cpprn g++ -o $@ -c $(CFLAGS) -fPIC $(GAME_INC_PATH) $< rnrn$(mod_dir)/mod_game.o: $(mod_dir)/mod_game.cpprn g++ -o $@ -c $(CFLAGS) -fPIC $(GAME_INC_PATH) $< rnrnpersist/mysqlc.o: persist/mysqlc.c persist/mysqlc.h rn g++ -o $@ -c $(CFLAGS) -fPIC $(GAME_INC_PATH) $< rnrn$(bin_dir)/mod_game.so: $(OBJS) $(mod_dir)/mod_game.o persist/mysqlc.orn @rm -rf $@rn g++ $(CFLAGS) $(SHARED) -o $@ $^ $(GAME_INC_PATH) $(LDFLAGS) -liconv -ltplt -ltinyxml -lbase -lmysqlclientrnrn#$(bin_dir)/mod_game.so :$(mod_dir)/mod_game.cpp \rn #mod_game/game_tplt.cpp \rn #mod_game/game_tplt.h \rn #mod_game/game_cmdctl.cpp \rn #mod_game/game_cmdctl.h \rn #mod_game/UserMgr.cpp \rn #mod_game/handle_db.cpp \rn #mod_game/handle_gate.cpp \rn #mod_game/UserMgr.h \rn #mod_game/GameLineMgr.cpp \rn #mod_game/TowerMgr.cpp \rn #mod_game/TeamMgr.cpp \rn #mod_game/SweepMgr.cpp \rn #mod_game/RankMgr.cpp \rn #mod_game/User.cpp \rn #mod_game/SkillMgr.cpp \rn #mod_game/Role_MsgSender.cpp \rn #mod_game/Role_GCAskHandler.cpp \rn #mod_game/Scene.h \rn #mod_game/Scene.cpp \rn #mod_game/FuncOpenMgr.cpp \rn #mod_game/WorldBossActivitySingleton.cpp \rn #mod_game/Role.cpp \rn #mod_game/Team.cpp \rn #mod_game/WorldBossActivity.cpp \rn #mod_game/ActivityBase.cpp \rn #mod_game/GMCmd.cpp \rn #mod_game/Role.h \rn #mod_game/User.h \rn #mod_game/GuildNetMsg.cpp \rn #mod_game/game_api.h \rn #mod_game/game_api.cpp \rn #mod_game/game.h \rn #mod_game/handle_billing.cpp \rn #mod_game/TeamMgr.h \rn #mod_game/ActivityMgr.cpp \rn #mod_game/role_cache.h \rn #mod_game/RankMgr.h \rn #mod_game/role_cache.cpp \rn #mod_game/handle_db.h \rn #mod_game/GuildMgr.h \rn #mod_game/FriendListMgr.cpp \rn #mod_game/ArenaMgr.cpp \rn #mod_game/GlobalUtilityFunction.h \rn #mod_game/GlobalUtilityFunction.cpp \rn #mod_game/GuildMemberMgr.cpp \rn #mod_game/XuanShang.cpp \rn #mod_game/WorldBoss.cpp \rn #mod_game/WingMgr.cpp \rn #mod_game/VIPMgr.cpp \rn #mod_game/TemplateMgr.cpp \rn #mod_game/TeamMember.cpp \rn #mod_game/TaskMgr.cpp \rn #mod_game/StateMachine.cpp \rn #mod_game/State.cpp \rn #mod_game/SceneMgr.cpp \rn #mod_game/PetManager.cpp \rn #mod_game/NPC.cpp \rn #mod_game/MonsterStateMachine.cpp \rn #mod_game/MonsterState.cpp \rn #mod_game/MonsterMgr.cpp \rn #mod_game/Monster.cpp \rn #mod_game/MedalMgr.cpp \rn #mod_game/ItemMgr.cpp \rn #mod_game/GuildMgr.cpp \rn #mod_game/GemMgr.cpp \rn #mod_game/FightReferee.cpp \rn #mod_game/FightMgr.cpp \rn #mod_game/EquipMgr.cpp \rn #mod_game/handle_billing.h \rn #mod_game/handle_gate.h \rn #mod_game/ActivityMgr.h \rn #mod_game/ActivityBase.h \rn #mod_game/FightMgr.h \rn #mod_game/MedalMgr.h \rn #mod_game/MonsterState.h \rn #mod_game/TowerMgr.h \rn #mod_game/ArenaMgr.h \rn #mod_game/EquipMgr.h \rn #mod_game/FightReferee.h \rn #mod_game/GMCmd.h \rn #mod_game/ItemMgr.h \rn #mod_game/Monster.h \rn #mod_game/MonsterMgr.h \rn #mod_game/StateMachine.h \rn #mod_game/SweepMgr.h \rn #mod_game/TaskMgr.h \rn #mod_game/TeamMember.h \rn #mod_game/TemplateMgr.h \rn #mod_game/WingMgr.h \rn #mod_game/WorldBossActivity.h \rn #mod_game/WorldBossActivitySingleton.h \rn #mod_game/WorldBoss.h \rn #mod_game/FriendListMgr.h \rn #mod_game/GameLineMgr.h \rn #mod_game/GemMgr.h \rn #mod_game/MonsterStateMachine.h \rn #mod_game/PetManager.h \rn #mod_game/SceneMgr.h \rn #mod_game/SkillMgr.h \rn #mod_game/Team.h \rn #mod_game/VIPMgr.h \rn #mod_game/XuanShang.h \rn #mod_game/FuncOpenMgr.h \rn #mod_game/NPC.h \rn #mod_game/State.h \rn #mod_game/CharsetConverter.cpp \rn #mod_game/CharsetConverter.hrn #@rm -f $@rn #g++ $(CFLAGS) $(SHARED) -o $@ $^ -Iinclude/libshaco -Inet -Ibase -Itplt -Imod -Imsg -Imsg/Message -Imod_game -I3rd -I3rd/tinyXml -Imsg/iconv $(LDFLAGS) -liconv -ltplt -ltinyxmlrnrn$(bin_dir)/mod_robotcli.so: $(mod_dir)/mod_robotcli.cpprn g++ $(CFLAGS) $(SHARED) -o $@ $^ -Iinclude/libshaco -Inet -Ibase -Imod -Imsg -Imsg/Messagernrn$(bin_dir)/libtinyxml.so: \rn 3rd/tinyXml/tinystr.h \rn 3rd/tinyXml/tinyxml.h \rn 3rd/tinyXml/tinystr.cpp \rn 3rd/tinyXml/tinyxml.cpp \rn 3rd/tinyXml/tinyxmlerror.cpp \rn 3rd/tinyXml/tinyxmlparser.cpprn @rm -f $@ rn g++ $(CFLAGS) $(SHARED) -o $@ $^ -Imsgrnrnt: main/test.c persist/mysqlc.c persist/mysqlc.hrn gcc $(CFLAGS) -o $@ $^ -Iinclude/libshaco -Imsg -Inet -Ibase -Ielog -Ipersist -I3rd $(LDFLAGS) -lrt -lbase -lshaco -lnet -llua -lmysqlclientrnrn#robot: main/robot.c cnet/cnet.c cnet/cnet.h net.sorn #gcc $(CFLAGS) -o $@ $^ -Icnet -Inet -Ibase -Imsg -Wl,-rpath,. net.sornrn# resrnres:rn @rm -rf $(HOME)/.shaco/excelrn @mkdir -pv $(HOME)/.shaco/excelrn @mkdir -pv ./resrn @rm -rf ./res/tblrn @mkdir -pv ./res/tblrn @rm -rf ./res/tpltrn @mkdir -pv ./res/tpltrn @mkdir -pv ./datadefinern @rm -rf ./datadefine/tplt_struct.hrn @rm -rf $(HOME)/.shaco/excel/*rn @svn export $(SHACO_SVN_RES)/02.项目数值 $(HOME)/.shaco/excel/02.项目数值 --forcern @svn export $(SHACO_SVN_RES)/工具 $(HOME)/.shaco/excel/tool --forcern @PWD_PATH=`pwd`rn @cd $(HOME)/.shaco/excel/tool && python CreateXmlFromExcel.pyrn @du -ah $(HOME)/.shaco/excel/02.项目数值 |grep xlsx$$ | awk 'print "cp -f " $$2 " $(HOME)/.shaco/excel"'|bashrn# @rm -rf $(HOME)/.shaco/excel/tmprn# @svn export $(SHACO_SVN_RES)/工具/ServerExcelFiles $(HOME)/.shaco/excel --forcern# @svn export $(SHACO_SVN_RES)/工具/Database.xml $(HOME)/.shaco/excel/excelmake_server.xml --forcern @cp $(HOME)/.shaco/excel/tool/Database.xml $(HOME)/.shaco/excel/excelmake_server.xml rn @cd $(PWD_PATH)rn @cd tool && \rn python convert_excel.py \rn $(HOME)/.shaco/excel/excelmake_server.xml \rn $(HOME)/.shaco/excel tbl=../res/tbl:c=../res/tplt && \rn python concat.py ../res/tplt ../datadefine/tplt_struct.h && \rn rm -rf ../res/tpltrnrn# thirdlibrnthirdlib:rn @__=`pwd` && cd third && $(MAKE) dist DIST_PATH=$$__/thirdlibrnrn# for clientrnclient: cnet.dll tplt.dllrnrnclient_bin=\rn cnet.dll \rn cnet.lib \rn tplt.dll \rn tplt.lib \rn tplt.defrnrncnet_src=\rn cnet/cnet.c \rn cnet/cnet.hrnrncnet.dll: $(net_src) $(cnet_src)rn gcc $(CFLAGS) -shared -o $@ $^ -Inet -Imsg -lws2_32 \rn -Wl,--output-def,cnet.def,--out-implib,cnet.librn LIB /MACHINE:IX86 /DEF:cnet.defrnrntplt.dll: $(tplt_src)rn gcc $(CFLAGS) -shared -o $@ $^ -Itplt \rn -Wl,--output-def,tplt.def,--out-implib,tplt.librn LIB /MACHINE:IX86 /DEF:tplt.defrnrntestclient: main/testclient.c $(tplt_src) datadefine/tplt_struct.hrn gcc $(CFLAGS) -o $@ $^ -Itplt -Idatadefinernrnclient_dir=D:/wa-client/trunkrninstall_dir=$(client_dir)/driller/proj.win32/Debug.win32rninstall_dir_rel=$(client_dir)/driller/proj.win32/Release.win32rnsource_dir=$(client_dir)/driller/Classesrntool_dir=$(client_dir)/toolrninstall:rn cp $(client_bin) $(install_dir)rn cp $(client_bin) $(install_dir_rel)rn cp -r net $(source_dir) rn cp -r cnet $(source_dir)rn cp -r main/robot.c $(source_dir)/cnetrn mkdir -pv .mod_roomrn for file in `ls mod_room`; do iconv -f utf-8 -t gbk mod_room/$$file > .mod_room/$$file; done rn cp -r .mod_room/* $(source_dir)/maprn rm -rf .mod_roomrn #cp -r msg $(source_dir)rn mkdir -pv .msgrn for file in `ls msg`; do iconv -f utf-8 -t gbk msg/$$file > .msg/$$file; done rn cp -r .msg/* $(source_dir)/messagern rm -rf .msgrn cp -r tplt $(source_dir)rn cp -r tool/concat.py tool/convert_excel.py tool/excelto $(tool_dir)rnrn# cleanrnclean:rn rm -f $(all_t) mod_game/*.ornrncleanall: cleanrn rm -rf cscope.* tagsrn rm -rf resrn rm -rf datadefinern find . -name "*.pyc" | xargs -i rm -f rnrn
Struts in Action 中调试出现的错误: Cannot find ActionMappings or ActionFormBeans
在Struts in Action 的第一章中,调试第一个程序,我找不到相应的一些东西,我下载了源代码,然后把一些class文件COPY到了WEB-INF中,然后按照提示的输入:http://localhost:8000/register/register.jsp rn出现的错误如下:javax.servlet.ServletException: Cannot find ActionMappings or ActionFormBeans collectionrn org.apache.jasper.runtime.PageContextImpl.doHandlePageException(PageContextImpl.java:825)rn org.apache.jasper.runtime.PageContextImpl.handlePageException(PageContextImpl.java:758)rn org.apache.jsp.register_jsp._jspService(register_jsp.java:75)rn org.apache.jasper.runtime.HttpJspBase.service(HttpJspBase.java:94)rn javax.servlet.http.HttpServlet.service(HttpServlet.java:802)rn org.apache.jasper.servlet.JspServletWrapper.service(JspServletWrapper.java:324)rn org.apache.jasper.servlet.JspServlet.serviceJspFile(JspServlet.java:292)rn org.apache.jasper.servlet.JspServlet.service(JspServlet.java:236)rn javax.servlet.http.HttpServlet.service(HttpServlet.java:802)rn我不知道怎么样去修改了,请大家帮忙,我是一个新学的,谢谢 !
相关热词 c# 去空格去转义符 c#用户登录窗体代码 c# 流 c# linux 可视化 c# mvc 返回图片 c# 像素空间 c# 日期 最后一天 c#字典序排序 c# 截屏取色 c#中的哪些属于托管机制