Makefile:48: recipe for target 'htpasswd' failed make[2]: *** [htpasswd] Error 1

我在安装apache2...时输入make语句时,出现上述错误,环境ubuntu16.04
哪位高手帮一下忙

1个回答

Csdn user default icon
上传中...
上传图片
插入图片
抄袭、复制答案,以达到刷声望分或其他目的的行为,在CSDN问答是严格禁止的,一经发现立刻封号。是时候展现真正的技术了!
其他相关推荐
编译ss5时出错Makefile:32: recipe for target 'ss5' failed
没什么c币奖励。。。 系统:Fedora23x64 gcc环境安装好了 执行./configure时没报错(我看来) ``` checking for gcc... gcc checking for C compiler default output file name... a.out checking whether the C compiler works... yes checking whether we are cross compiling... no checking for suffix of executables... checking for suffix of object files... o checking whether we are using the GNU C compiler... yes checking whether gcc accepts -g... yes checking for gcc option to accept ISO C89... none needed checking for a BSD-compatible install... /usr/bin/install -c checking for main in -ldl... yes checking for main in -lldap... yes checking for main in -lpam... yes checking for main in -lpam_misc... yes checking for main in -lpthread... yes checking for main in -lssl... yes checking how to run the C preprocessor... gcc -E checking for grep that handles long lines and -e... /usr/bin/grep checking for egrep... /usr/bin/grep -E checking for ANSI C header files... yes checking for sys/wait.h that is POSIX.1 compatible... yes checking for sys/types.h... yes checking for sys/stat.h... yes checking for stdlib.h... yes checking for string.h... yes checking for memory.h... yes checking for strings.h... yes checking for inttypes.h... yes checking for stdint.h... yes checking for unistd.h... yes checking arpa/inet.h usability... yes checking arpa/inet.h presence... yes checking for arpa/inet.h... yes checking fcntl.h usability... yes checking fcntl.h presence... yes checking for fcntl.h... yes checking netdb.h usability... yes checking netdb.h presence... yes checking for netdb.h... yes checking netinet/in.h usability... yes checking netinet/in.h presence... yes checking for netinet/in.h... yes checking for stdlib.h... (cached) yes checking for string.h... (cached) yes checking sys/ioctl.h usability... yes checking sys/ioctl.h presence... yes checking for sys/ioctl.h... yes checking sys/socket.h usability... yes checking sys/socket.h presence... yes checking for sys/socket.h... yes checking sys/time.h usability... yes checking sys/time.h presence... yes checking for sys/time.h... yes checking syslog.h usability... yes checking syslog.h presence... yes checking for syslog.h... yes checking for unistd.h... (cached) yes checking security/pam_misc.h usability... yes checking security/pam_misc.h presence... yes checking for security/pam_misc.h... yes checking security/pam_appl.h usability... yes checking security/pam_appl.h presence... yes checking for security/pam_appl.h... yes checking for an ANSI C-conforming const... yes checking for inline... inline checking for pid_t... yes checking whether time.h and sys/time.h may both be included... yes checking vfork.h usability... no checking vfork.h presence... no checking for vfork.h... no checking for fork... yes checking for vfork... yes checking for working fork... yes checking for working vfork... (cached) yes checking whether gcc needs -traditional... no checking for stdlib.h... (cached) yes checking for GNU libc compatible realloc... yes checking sys/select.h usability... yes checking sys/select.h presence... yes checking for sys/select.h... yes checking for sys/socket.h... (cached) yes checking types of arguments for select... int,fd_set *,struct timeval * checking for strftime... yes checking for bzero... yes checking for gethostbyname... yes checking for gettimeofday... yes checking for inet_ntoa... yes checking for memset... yes checking for select... yes checking for socket... yes checking for strdup... yes checking for strtol... yes configure: creating ./config.status config.status: creating Makefile config.status: creating modules/Makefile config.status: creating modules/mod_authen/Makefile config.status: creating modules/mod_author/Makefile config.status: creating modules/mod_balance/Makefile config.status: creating modules/mod_bandwidth/Makefile config.status: creating modules/mod_dump/Makefile config.status: creating modules/mod_filter/Makefile config.status: creating modules/mod_log/Makefile config.status: creating modules/mod_proxy/Makefile config.status: creating modules/mod_socks4/Makefile config.status: creating modules/mod_socks5/Makefile config.status: creating modules/mod_statistics/Makefile config.status: creating common/Makefile config.status: creating src/Makefile config.status: creating include/config.h config.status: include/config.h is unchanged ``` 但是make就报错了 ``` collect2: error: ld returned 1 exit status Makefile:32: recipe for target 'ss5' failed make[1]: *** [ss5] Error 1 make[1]: Leaving directory '/root/ss5-3.8.9/src' Makefile:31: recipe for target 'src' failed make: *** [src] Error 2 ``` 不知道我们是,求da'l
紧急求助!!ubuntu16.04 caffe make clean报错!!
我的系统ubuntu16.04,昨天make 了一下没马上清,今天开机在caffe根目录下水make clean 发现报错 rm:无法删除 ".build_release" : 不允许操作 makefile:660:recipe for target "clean" failed make:[clean] error 1 (ignored) rm:无法删除 "build ": 不允许操作 makefile:660:recipe for target "clean" failed make:[clean] error 1 (ignored) rm:无法删除 "distribute": 不允许操作 makefile:660:recipe for target "clean" failed make:[clean] error 1 (ignored) 我什么文件都没改呀!以前一直正常。 跪求各位大侠赐教!! 请问“输出目录”或“输出文件夹”在哪个位置,本人小白请楼下大侠指点,多谢!
为什么在ubuntu中eclipse编译c程序时makefile文件报错"recipe for target failed"
第一次给ubuntu装eclipse for c/c++。也装了CDT,建立空项目编译时还会有这个报错
在ubuntu下用make安装软件出错
第一次在ubuntu18.04用源代码安装软件,make的时候总是出错,我执行前面的 命令名问题,但是到执行make的时候,总是出错,因为是个小白,所以不知道知道是什么原因. ``` $] cd sumo-0.32.0 $] ./configure $] make collect2: error: ld returned 1 exit status Makefile:461: recipe for target 'marouter' failed make[3]: *** [marouter] Error 1 make[3]: 离开目录“/home/as/sumo-0.32.0/src/marouter” Makefile:689: recipe for target 'all-recursive' failed make[2]: *** [all-recursive] Error 1 make[2]: 离开目录“/home/as/sumo-0.32.0/src” Makefile:530: recipe for target 'all' failed make[1]: *** [all] Error 2 make[1]: 离开目录“/home/as/sumo-0.32.0/src” Makefile:406: recipe for target 'all-recursive' failed make: *** [all-recursive] Error 1 ```
关于qt5.6.0编译源码桌面版出现的问题
使用来自官网的qt-everywhere-opensource-src-5.6.0.tar.gz 第一步。/configure 第二部 make 出现啦 Project ERROR: Unknown module(s) in QT: quick Makefile:47: recipe for target 'sub-textureandlight-make_first' failed make[4]: *** [sub-textureandlight-make_first] Error 3 make[4]: Leaving directory '/home/jay/qt-x11/qtcanvas3d/examples/canvas3d/canvas3d' Makefile:42: recipe for target 'sub-canvas3d-make_first' failed make[3]: *** [sub-canvas3d-make_first] Error 2 make[3]: Leaving directory '/home/jay/qt-x11/qtcanvas3d/examples/canvas3d' Makefile:42: recipe for target 'sub-canvas3d-make_first' failed make[2]: *** [sub-canvas3d-make_first] Error 2 make[2]: Leaving directory '/home/jay/qt-x11/qtcanvas3d/examples' Makefile:69: recipe for target 'sub-examples-make_first' failed make[1]: *** [sub-examples-make_first] Error 2 make[1]: Leaving directory '/home/jay/qt-x11/qtcanvas3d' Makefile:349: recipe for target 'module-qtcanvas3d-make_first' failed make: *** [module-qtcanvas3d-make_first] Error 2 如何解决
服务器无root权限配置caffe安装snappy时make出错
根据教程https://blog.csdn.net/jiajinrang93/article/details/80337513,安装snappy进行make时报错,cmake版本为3.5.1.请问这要怎样解决?? ``` CMakeFiles/snappy_unittest.dir/snappy_unittest.cc.o:(.rodata._ZTIN6snappy31Snappy_ReadPastEndOfBuffer_TestE[_ZTIN6snappy31Snappy_ReadPastEndOfBuffer_TestE]+0x10): more undefined references to `typeinfo for testing::Test' follow collect2: error: ld returned 1 exit status CMakeFiles/snappy_unittest.dir/build.make:122: recipe for target 'snappy_unittest' failed make[2]: *** [snappy_unittest] Error 1 CMakeFiles/Makefile2:104: recipe for target 'CMakeFiles/snappy_unittest.dir/all' failed make[1]: *** [CMakeFiles/snappy_unittest.dir/all] Error 2 Makefile:138: recipe for target 'all' failed make: *** [all] Error 2 ```
在ubuntu上编译openjdk,出现以下错误,前后搜了两天,实在无法解决。
make[5]: *** [linux_amd64_compiler2/debug] Error 2 make[5]: Leaving directory '/home/zhang5788/jvm/openjdk/build/linux-amd64-debug/hotspot/outputdir' Makefile:191: recipe for target 'generic_build2' failed make[4]: *** [generic_build2] Error 2 make[4]: Leaving directory '/home/zhang5788/jvm/openjdk/hotspot/make' Makefile:151: recipe for target 'jvmg' failed make[3]: *** [jvmg] Error 2 make[3]: Leaving directory '/home/zhang5788/jvm/openjdk/hotspot/make' make/hotspot-rules.gmk:111: recipe for target 'hotspot-build' failed make[2]: *** [hotspot-build] Error 2 make[2]: Leaving directory '/home/zhang5788/jvm/openjdk' Makefile:262: recipe for target 'generic_debug_build' failed make[1]: *** [generic_debug_build] Error 2 make[1]: Leaving directory '/home/zhang5788/jvm/openjdk' Makefile:272: recipe for target 'build_debug_image' failed make: *** [build_debug_image] Error 2 [1]+ Done make sanity 环境是 ubuntu 16.04 openjdk7 oracle jdk 1.7jdk1.7.0_79
内核编译执行make menuconfig时出现的问题
一开始的问题是这样的 HOSTCC scripts/basic/fixdep * * Unable to find the ncurses package. * Install ncurses (ncurses-devel or libncurses-dev * depending on your distribution). * scripts/kconfig/Makefile:208: recipe for target 'scripts/kconfig/mconf-cfg' failed make[1]: *** [scripts/kconfig/mconf-cfg] Error 1 Makefile:552: recipe for target 'menuconfig' failed make: *** [menuconfig] Error 2 后来在百度上找到的办法是缺少ncurses的库,需要输入apt-get install libncurses5-de安装缺缺少失的库。然后问题变成了 root@ubuntu:/home/electronic/kernel/linux-5.1.10# make menuconfig UPD scripts/kconfig/mconf-cfg HOSTCC scripts/kconfig/mconf.o HOSTCC scripts/kconfig/lxdialog/checklist.o HOSTCC scripts/kconfig/lxdialog/inputbox.o HOSTCC scripts/kconfig/lxdialog/menubox.o HOSTCC scripts/kconfig/lxdialog/textbox.o HOSTCC scripts/kconfig/lxdialog/util.o HOSTCC scripts/kconfig/lxdialog/yesno.o HOSTCC scripts/kconfig/confdata.o HOSTCC scripts/kconfig/expr.o LEX scripts/kconfig/lexer.lex.c /bin/sh: 1: flex: not found scripts/Makefile.lib:194: recipe for target 'scripts/kconfig/lexer.lex.c' failed make[1]: *** [scripts/kconfig/lexer.lex.c] Error 127 Makefile:552: recipe for target 'menuconfig' failed make: *** [menuconfig] Error 2 然后再百度的解决方法是apt-get install bison -y,问题又是这样 LEX scripts/kconfig/lexer.lex.c /bin/sh: 1: flex: not found scripts/Makefile.lib:194: recipe for target 'scripts/kconfig/lexer.lex.c' failed make[1]: *** [scripts/kconfig/lexer.lex.c] Error 127 Makefile:552: recipe for target 'menuconfig' failed make: *** [menuconfig] Error 2 之后也没有其他的解决方法。 作为一个初学linux的大学生,搞不懂,看着头疼。求大佬指点
ubuntu下 qt5.4 源码编译问题
从官网下载了qt-everywhere-opensource-src-5.6.2压缩包 解压后 执行./configure 成功后 执行make 出现以下错误 Project ERROR: Unknown module(s) in QT: dbus Project ERROR: Unknown module(s) in QT: quick Makefile:47: recipe for target 'sub-textureandlight-make_first' failed make[3]: *** [sub-textureandlight-make_first] Error 3 make[3]: Leaving directory '/home/jay/qt-x11/qtcanvas3d/examples/canvas3d' Makefile:42: recipe for target 'sub-canvas3d-make_first' failed make[2]: *** [sub-canvas3d-make_first] Error 2 make[2]: Leaving directory '/home/jay/qt-x11/qtcanvas3d/examples' Makefile:69: recipe for target 'sub-examples-make_first' failed make[1]: *** [sub-examples-make_first] Error 2 make[1]: Leaving directory '/home/jay/qt-x11/qtcanvas3d' Makefile:349: recipe for target 'module-qtcanvas3d-make_first' failed make: *** [module-qtcanvas3d-make_first] Error 2 如何解决这个问题
rtems编译出错recipe for 'libcrypt_a-crypt.o' failed
windows:64bit vmware上安装fedora21,64位 参考csdn各种大神们的成功经验,安装好ARM的交叉编译工具,又通过git://git.rtems.org/rtems.git得到最新的源码,编译时突然出现以下问题,请教各位高手该如何解决? Making all in libcrypt gmake[5]: Entering directory '/root/rtemsPro/rtemsSRC/rtems/buildcsb337/arm-rtems4.11/c/csb337/cpukit/libcrypt' arm-rtems4.11-gcc --pipe -DHAVE_CONFIG_H -I.. -I../../cpukit/../../../csb337/lib/include -mcpu=arm920 -O2 -g -Wall -Wmissing-prototypes -Wimplicit-function-declaration -Wstrict-prototypes -Wnested-externs -MT libcrypt_a-crypt.o -MD -MP -MF .deps/libcrypt_a-crypt.Tpo -c -o libcrypt_a-crypt.o `test -f 'crypt.c' || echo '../../../../../../c/src/../../cpukit/libcrypt/'`crypt.c In file included from ../../../../../../c/src/../../cpukit/libcrypt/crypt.c:32:0: ../../cpukit/../../../csb337/lib/include/crypt.h:70:55: error: expected ')' before 'int' void _crypt_b64_from_24bit(uint8_t, uint8_t, uint8_t, int, int *, char **); ^ Makefile:427: recipe for target 'libcrypt_a-crypt.o' failed gmake[5]: *** [libcrypt_a-crypt.o] Error 1 gmake[5]: Leaving directory '/root/rtemsPro/rtemsSRC/rtems/buildcsb337/arm-rtems4.11/c/csb337/cpukit/libcrypt' Makefile:964: recipe for target 'all-recursive' failed gmake[4]: *** [all-recursive] Error 1 gmake[4]: Leaving directory '/root/rtemsPro/rtemsSRC/rtems/buildcsb337/arm-rtems4.11/c/csb337/cpukit' Makefile:691: recipe for target 'all' failed gmake[3]: *** [all] Error 2 gmake[3]: Leaving directory '/root/rtemsPro/rtemsSRC/rtems/buildcsb337/arm-rtems4.11/c/csb337/cpukit' Makefile:487: recipe for target 'all-recursive' failed gmake[2]: *** [all-recursive] Error 1 gmake[2]: Leaving directory '/root/rtemsPro/rtemsSRC/rtems/buildcsb337/arm-rtems4.11/c/csb337' Makefile:348: recipe for target 'all-recursive' failed gmake[1]: *** [all-recursive] Error 1 gmake[1]: Leaving directory '/root/rtemsPro/rtemsSRC/rtems/buildcsb337/arm-rtems4.11/c' Makefile:472: recipe for target 'all-recursive' failed make: *** [all-recursive] Error 1 [root@localhost buildcsb337]#
编译内核出现kernel/timeconst.pl line 373
我是用的fedora 23 64位系统 编译内核linux-2.6.38 出现如下错误: Can't use 'defined(@array)' (Maybe you should just omit the defined()?) at kernel/timeconst.pl line 373. /opt/ARM/mini6410/linux/linux-2.6.38/kernel/Makefile:140: recipe for target 'kernel/timeconst.h' failed make[1]: *** [kernel/timeconst.h] Error 255 Makefile:916: recipe for target 'kernel' failed make: *** [kernel] Error 2 请教如何解决?
windows环境下codeblocks17.12 用cmake配置opencv3.4.7出现如下错误
试了好多次了,参考了不少博主的文章编译,还是有错 ``` F:/mingw64/bin/../lib/gcc/x86_64-w64-mingw32/7.3.0/../../../../x86_64-w64-mingw32/bin/ld.exe: i386 architecture of input file `CMakeFiles\opencv_core.dir/objects.a(vs_version.rc.obj)' is incompatible with i386:x86-64 output collect2.exe: error: ld returned 1 exit status modules\core\CMakeFiles\opencv_core.dir\build.make:1843: recipe for target 'bin/libopencv_core340.dll' failed mingw32-make[2]: *** [bin/libopencv_core340.dll] Error 1 CMakeFiles\Makefile2:1686: recipe for target 'modules/core/CMakeFiles/opencv_core.dir/all' failed mingw32-make[1]: *** [modules/core/CMakeFiles/opencv_core.dir/all] Error 2 Makefile:161: recipe for target 'all' failed mingw32-make: *** [all] Error 2 ```
linux内核编译时出错 不知道怎么弄
scripts/kconfig/conf -s arch/mips/Kconfig CHK include/linux/version.h CHK include/linux/utsrelease.h SYMLINK include/asm -> include/asm-mips CALL scripts/checksyscalls.sh CHK include/linux/compile.h /opt/linux-2.6.32/scripts/gen_initramfs_list.sh: Cannot open '/mnt/ramdisk.tiny4/' /opt/linux-2.6.32/usr/Makefile:64: recipe for target 'usr/initramfs_data.cpio.gz' failed make[1]: *** [usr/initramfs_data.cpio.gz] Error 1 Makefile:878: recipe for target 'usr' failed make: *** [usr] Error 2
虚拟机Linux系统下编译esp8266程序出错
错误信息提示如下: make[1]: xt-xcc: Command not found ../../Makefile:321: recipe for target '.output/eagle/debug/obj/user_main.o' failed make[1]: *** [.output/eagle/debug/obj/user_main.o] Error 127 make[1]: Leaving directory '/mnt/hgfs/share/gokit-soc-esp8266/app/user' ../Makefile:307: recipe for target '.subdirs' failed make: *** [.subdirs] Error 2 程序用的是机智云官方程序,求教
linux内核编译时出错 求大佬指导
root@yu-virtual-machine:/opt/linux-2.6.32# make scripts/kconfig/conf -s arch/mips/Kconfig CHK include/linux/version.h CHK include/linux/utsrelease.h SYMLINK include/asm -> include/asm-mips CALL scripts/checksyscalls.sh CHK include/linux/compile.h GEN usr/initramfs_data.cpio AS usr/initramfs_data.o LD usr/built-in.o CC drivers/mtd/nand/nand_base.o drivers/mtd/nand/nand_base.c: In function 'nand_scan_tail': drivers/mtd/nand/nand_base.c:2821: error: implicit declaration of function 'pr_warn' scripts/Makefile.build:229: recipe for target 'drivers/mtd/nand/nand_base.o' failed make[3]: *** [drivers/mtd/nand/nand_base.o] Error 1 scripts/Makefile.build:365: recipe for target 'drivers/mtd/nand' failed make[2]: *** [drivers/mtd/nand] Error 2 scripts/Makefile.build:365: recipe for target 'drivers/mtd' failed make[1]: *** [drivers/mtd] Error 2 Makefile:878: recipe for target 'drivers' failed make: *** [drivers] Error 2 求大佬指导
linux C++ cmake编译通过,链接的时候出错
今天跑一个老师给的代码,安装了shark、boost和opencv,编译该通过了,但是链接的时候报错,错误如下: /usr/bin/ld: CMakeFiles/test.dir/classifier.cc.o: undefined reference to symbol 'cblas_dgemm' /usr/lib/atlas-base/atlas/libblas.so.3: error adding symbols: DSO missing from command line collect2: error: ld returned 1 exit status src/CMakeFiles/test.dir/build.make:302: recipe for target 'src/test' failed make[2]: *** [src/test] Error 1 CMakeFiles/Makefile2:85: recipe for target 'src/CMakeFiles/test.dir/all' failed make[1]: *** [src/CMakeFiles/test.dir/all] Error 2 Makefile:83: recipe for target 'all' failed make: *** [all] Error 2 百度谷歌了好久实在不知道怎么解决,请问有木有大神指导怎么解决= =
linphone交叉编译问题
编译linphone时报错: ...... videodec.c: In function ‘skip_rfc2429_header’: videodec.c:192:7: warning: variable ‘gob_num’ set but not used [-Wunused-but-set-variable] int gob_num; ^ CC pixconv.lo CC sizeconv.lo CC nowebcam.lo CC h264dec.lo CC jpegwriter.lo CC videoout.lo CC msvideo.lo CC rfc3984.lo CC mire.lo CC extdisplay.lo CC layouts.lo CC videostream.lo CXXLD libmediastreamer.la /usr/bin/ld: .libs/mscommon.o: Relocations in generic ELF (EM: 40) /usr/bin/ld: .libs/mscommon.o: Relocations in generic ELF (EM: 40) /usr/bin/ld: .libs/mscommon.o: Relocations in generic ELF (EM: 40) /usr/bin/ld: .libs/mscommon.o: Relocations in generic ELF (EM: 40) /usr/bin/ld: .libs/mscommon.o: Relocations in generic ELF (EM: 40) /usr/bin/ld: .libs/mscommon.o: Relocations in generic ELF (EM: 40) /usr/bin/ld: .libs/mscommon.o: Relocations in generic ELF (EM: 40) .libs/mscommon.o: error adding symbols: File in wrong format collect2: error: ld returned 1 exit status Makefile:555: recipe for target 'libmediastreamer.la' failed make[5]: *** [libmediastreamer.la] Error 1 make[5]: Leaving directory '/home/linphone_install4/sources/linphone-3.4.3/mediastreamer2/src' Makefile:489: recipe for target 'all' failed make[4]: *** [all] Error 2 make[4]: Leaving directory '/home/linphone_install4/sources/linphone-3.4.3/mediastreamer2/src' Makefile:422: recipe for target 'all-recursive' failed make[3]: *** [all-recursive] Error 1 make[3]: Leaving directory '/home/linphone_install4/sources/linphone-3.4.3/mediastreamer2' Makefile:327: recipe for target 'all' failed make[2]: *** [all] Error 2 make[2]: Leaving directory '/home/linphone_install4/sources/linphone-3.4.3/mediastreamer2' Makefile:440: recipe for target 'all-recursive' failed make[1]: *** [all-recursive] Error 1 make[1]: Leaving directory '/home/linphone_install4/sources/linphone-3.4.3' Makefile:365: recipe for target 'all' failed make: *** [all] Error 2 root@ubuntu:/home/linphone_install4/sources/linphone-3.4.3# 这是什么原因导致的呢?还请不吝赐教!非常感谢!
quickfix-1.13.3linux下编译问题
/bin/bash ../libtool --tag=CXX --mode=link g++ -g -O2 -Wall -ansi -Wpointer-arith -Wwrite-strings -I/usr/include/libxml2 -L../UnitTest++ -lUnitTest++ -o at at.o C++/libquickfix.la -lpthread -lxml2 libtool: link: g++ -g -O2 -Wall -ansi -Wpointer-arith -Wwrite-strings -I/usr/include/libxml2 -o .libs/at at.o -L../UnitTest++ -lUnitTest++ C++/.libs/libquickfix.so -lpthread -lxml2 at.o: In function boost::thread_exception::thread_exception(int, char const*)': /usr/include/boost/thread/exceptions.hpp:51: undefined reference to boost::system::system_category()' at.o: In function __static_initialization_and_destruction_0': /usr/include/boost/system/error_code.hpp:221: undefined reference to boost::system::generic_category()' /usr/include/boost/system/error_code.hpp:222: undefined reference to boost::system::generic_category()' /usr/include/boost/system/error_code.hpp:223: undefined reference to boost::system::system_category()' collect2: error: ld returned 1 exit status Makefile:440: recipe for target 'at' failed make[3]: *** [at] Error 1 make[3]: Leaving directory '/home/ktgs/quickfix-1.13.3/src' Makefile:495: recipe for target 'all-recursive' failed make[2]: *** [all-recursive] Error 1 make[2]: Leaving directory '/home/ktgs/quickfix-1.13.3/src' Makefile:484: recipe for target 'all-recursive' failed make[1]: *** [all-recursive] Error 1 make[1]: Leaving directory '/home/ktgs/quickfix-1.13.3' Makefile:393: recipe for target 'all' failed 哪位大神可以帮忙一下
ACE在ubuntu上的编译错误
ACE/TAO-5.6.9 gcc version 5.4.0 Ubuntu 16.04.2 执行以下命令时: $ tar xjvf ACE-5.6.9.tar.bz2 $ cd ACE_wrappers $ mkdir build $ cd build $ ../configure --prefix=/usr/local $ make 出现错误: ../../ace/Dev_Poll_Reactor.cpp: In member function 'int ACE_Dev_Poll_Reactor::dispatch_io_event(ACE_Dev_Poll_Reactor::Token_Guard&)': ../../ace/Dev_Poll_Reactor.cpp:1216:41: error: cannot bind packed field 'pfds->epoll_event::events' to '__uint32_t& {aka unsigned int&}' __uint32_t &revents = pfds->events; ^ Makefile:3306: recipe for target 'libACE_la-Dev_Poll_Reactor.lo' failed make[3]: *** [libACE_la-Dev_Poll_Reactor.lo] Error 1 make[3]: Leaving directory '/opt/ACE_wrappers/build/ace' Makefile:5192: recipe for target 'all-recursive' failed make[2]: *** [all-recursive] Error 1 make[2]: Leaving directory '/opt/ACE_wrappers/build/ace' Makefile:2506: recipe for target 'all' failed make[1]: *** [all] Error 2 make[1]: Leaving directory '/opt/ACE_wrappers/build/ace' Makefile:444: recipe for target 'all-recursive' failed make: *** [all-recursive] Error 1 怎么解决?
相见恨晚的超实用网站
搞学习 知乎:www.zhihu.com 简答题:http://www.jiandati.com/ 网易公开课:https://open.163.com/ted/ 网易云课堂:https://study.163.com/ 中国大学MOOC:www.icourse163.org 网易云课堂:study.163.com 哔哩哔哩弹幕网:www.bilibili.com 我要自学网:www.51zxw
爬虫福利二 之 妹子图网MM批量下载
爬虫福利一:27报网MM批量下载    点击 看了本文,相信大家对爬虫一定会产生强烈的兴趣,激励自己去学习爬虫,在这里提前祝:大家学有所成! 目标网站:妹子图网 环境:Python3.x 相关第三方模块:requests、beautifulsoup4 Re:各位在测试时只需要将代码里的变量 path 指定为你当前系统要保存的路径,使用 python xxx.py 或IDE运行即可。
字节跳动视频编解码面经
引言 本文主要是记录一下面试字节跳动的经历。 三四月份投了字节跳动的实习(图形图像岗位),然后hr打电话过来问了一下会不会opengl,c++,shador,当时只会一点c++,其他两个都不会,也就直接被拒了。 七月初内推了字节跳动的提前批,因为内推没有具体的岗位,hr又打电话问要不要考虑一下图形图像岗,我说实习投过这个岗位不合适,不会opengl和shador,然后hr就说秋招更看重基础。我当时
开源一个功能完整的SpringBoot项目框架
福利来了,给大家带来一个福利。 最近想了解一下有关Spring Boot的开源项目,看了很多开源的框架,大多是一些demo或者是一个未成形的项目,基本功能都不完整,尤其是用户权限和菜单方面几乎没有完整的。 想到我之前做的框架,里面通用模块有:用户模块,权限模块,菜单模块,功能模块也齐全了,每一个功能都是完整的。 打算把这个框架分享出来,供大家使用和学习。 为什么用框架? 框架可以学习整体
小白如何学习java?
在博主认为,对于入门级学习java的最佳学习方法莫过于视频+博客+书籍+总结,前三者博主将淋漓尽致地挥毫于这篇博客文章中,至于总结在于个人,实际上越到后面你会发现学习的最好方式就是阅读参考官方文档其次就是国内的书籍,博客次之,这又是一个层次了,这里暂时不提后面再谈。博主将为各位入门java保驾护航,各位只管冲鸭!!!上天是公平的,只要不辜负时间,时间自然不会辜负你。 何谓学习?博主所理解的学习,它
程序员必须掌握的核心算法有哪些?
由于我之前一直强调数据结构以及算法学习的重要性,所以就有一些读者经常问我,数据结构与算法应该要学习到哪个程度呢?,说实话,这个问题我不知道要怎么回答你,主要取决于你想学习到哪些程度,不过针对这个问题,我稍微总结一下我学过的算法知识点,以及我觉得值得学习的算法。这些算法与数据结构的学习大多数是零散的,并没有一本把他们全部覆盖的书籍。下面是我觉得值得学习的一些算法以及数据结构,当然,我也会整理一些看过
比特币原理详解
一、什么是比特币 比特币是一种电子货币,是一种基于密码学的货币,在2008年11月1日由中本聪发表比特币白皮书,文中提出了一种去中心化的电子记账系统,我们平时的电子现金是银行来记账,因为银行的背后是国家信用。去中心化电子记账系统是参与者共同记账。比特币可以防止主权危机、信用风险。其好处不多做赘述,这一层面介绍的文章很多,本文主要从更深层的技术原理角度进行介绍。 二、问题引入  假设现有4个人
【C++】C++11的std::array的详细剖析
当学习C++的时候,数组是最基本的结构之一,通常通过以下的方式来定义: int a[5]; int *b = new int[5]; 上面一句是在栈上定义了一个长度为5的数组,下面一句是在堆上定义了一个长度为5的数组,并用一个指针指向它。 在C++11中,引入了一种新的数组定义方式std::array。 本文实例源码github地址:https://github.com/yngzMiao/yng
Python 基础(一):入门必备知识
目录1 标识符2 关键字3 引号4 编码5 输入输出6 缩进7 多行8 注释9 数据类型10 运算符10.1 常用运算符10.2 运算符优先级 1 标识符 标识符是编程时使用的名字,用于给变量、函数、语句块等命名,Python 中标识符由字母、数字、下划线组成,不能以数字开头,区分大小写。 以下划线开头的标识符有特殊含义,单下划线开头的标识符,如:_xxx ,表示不能直接访问的类属性,需通过类提供
程序员接私活怎样防止做完了不给钱?
首先跟大家说明一点,我们做 IT 类的外包开发,是非标品开发,所以很有可能在开发过程中会有这样那样的需求修改,而这种需求修改很容易造成扯皮,进而影响到费用支付,甚至出现做完了项目收不到钱的情况。 那么,怎么保证自己的薪酬安全呢? 我们在开工前,一定要做好一些证据方面的准备(也就是“讨薪”的理论依据),这其中最重要的就是需求文档和验收标准。一定要让需求方提供这两个文档资料作为开发的基础。之后开发
Python十大装B语法
Python 是一种代表简单思想的语言,其语法相对简单,很容易上手。不过,如果就此小视 Python 语法的精妙和深邃,那就大错特错了。本文精心筛选了最能展现 Python 语法之精妙的十个知识点,并附上详细的实例代码。如能在实战中融会贯通、灵活使用,必将使代码更为精炼、高效,同时也会极大提升代码B格,使之看上去更老练,读起来更优雅。 1. for - else 什么?不是 if 和 else 才
数据库优化 - SQL优化
前面一篇文章从实例的角度进行数据库优化,通过配置一些参数让数据库性能达到最优。但是一些“不好”的SQL也会导致数据库查询变慢,影响业务流程。本文从SQL角度进行数据库优化,提升SQL运行效率。 判断问题SQL 判断SQL是否有问题时可以通过两个表象进行判断: 系统级别表象 CPU消耗严重 IO等待严重 页面响应时间过长
2019年11月中国大陆编程语言排行榜
2019年11月2日,我统计了某招聘网站,获得有效程序员招聘数据9万条。针对招聘信息,提取编程语言关键字,并统计如下: 编程语言比例 rank pl_ percentage 1 java 33.62% 2 c/c++ 16.42% 3 c_sharp 12.82% 4 javascript 12.31% 5 python 7.93% 6 go 7.25% 7
写了很久,这是一份最适合/贴切普通大众/科班/非科班的『学习路线』
说实话,对于学习路线这种文章我一般是不写的,大家看我的文章也知道,我是很少写建议别人怎么样怎么样的文章,更多的是,写自己的真实经历,然后供大家去参考,这样子,我内心也比较踏实,也不怕误导他人。 但是,最近好多人问我学习路线,而且很多大一大二的,说自己很迷茫,看到我那篇 普普通通,我的三年大学 之后很受激励,觉得自己也能行,(是的,别太浪,你一定能行)希望我能给他个学习路线,说
腾讯算法面试题:64匹马8个跑道需要多少轮才能选出最快的四匹?
昨天,有网友私信我,说去阿里面试,彻底的被打击到了。问了为什么网上大量使用ThreadLocal的源码都会加上private static?他被难住了,因为他从来都没有考虑过这个问题。无独有偶,今天笔者又发现有网友吐槽了一道腾讯的面试题,我们一起来看看。 腾讯算法面试题:64匹马8个跑道需要多少轮才能选出最快的四匹? 在互联网职场论坛,一名程序员发帖求助到。二面腾讯,其中一个算法题:64匹
面试官:你连RESTful都不知道我怎么敢要你?
面试官:了解RESTful吗? 我:听说过。 面试官:那什么是RESTful? 我:就是用起来很规范,挺好的 面试官:是RESTful挺好的,还是自我感觉挺好的 我:都挺好的。 面试官:… 把门关上。 我:… 要干嘛?先关上再说。 面试官:我说出去把门关上。 我:what ?,夺门而去 文章目录01 前言02 RESTful的来源03 RESTful6大原则1. C-S架构2. 无状态3.统一的接
为啥国人偏爱Mybatis,而老外喜欢Hibernate/JPA呢?
关于SQL和ORM的争论,永远都不会终止,我也一直在思考这个问题。昨天又跟群里的小伙伴进行了一番讨论,感触还是有一些,于是就有了今天这篇文。 声明:本文不会下关于Mybatis和JPA两个持久层框架哪个更好这样的结论。只是摆事实,讲道理,所以,请各位看官勿喷。 一、事件起因 关于Mybatis和JPA孰优孰劣的问题,争论已经很多年了。一直也没有结论,毕竟每个人的喜好和习惯是大不相同的。我也看
SQL-小白最佳入门sql查询一
一 说明 如果是初学者,建议去网上寻找安装Mysql的文章安装,以及使用navicat连接数据库,以后的示例基本是使用mysql数据库管理系统; 二 准备前提 需要建立一张学生表,列分别是id,名称,年龄,学生信息;本示例中文章篇幅原因SQL注释略; 建表语句: CREATE TABLE `student` ( `id` int(11) NOT NULL AUTO_INCREMENT, `
项目中的if else太多了,该怎么重构?
介绍 最近跟着公司的大佬开发了一款IM系统,类似QQ和微信哈,就是聊天软件。我们有一部分业务逻辑是这样的 if (msgType = "文本") { // dosomething } else if(msgType = "图片") { // doshomething } else if(msgType = "视频") { // doshomething } else { // dosho
致 Python 初学者
文章目录1. 前言2. 明确学习目标,不急于求成,不好高骛远3. 在开始学习 Python 之前,你需要做一些准备2.1 Python 的各种发行版2.2 安装 Python2.3 选择一款趁手的开发工具3. 习惯使用IDLE,这是学习python最好的方式4. 严格遵从编码规范5. 代码的运行、调试5. 模块管理5.1 同时安装了py2/py35.2 使用Anaconda,或者通过IDE来安装模
“狗屁不通文章生成器”登顶GitHub热榜,分分钟写出万字形式主义大作
一、垃圾文字生成器介绍 最近在浏览GitHub的时候,发现了这样一个骨骼清奇的雷人项目,而且热度还特别高。 项目中文名:狗屁不通文章生成器 项目英文名:BullshitGenerator 根据作者的介绍,他是偶尔需要一些中文文字用于GUI开发时测试文本渲染,因此开发了这个废话生成器。但由于生成的废话实在是太过富于哲理,所以最近已经被小伙伴们给玩坏了。 他的文风可能是这样的: 你发现,...
程序员:我终于知道post和get的区别
是一个老生常谈的话题,然而随着不断的学习,对于以前的认识有很多误区,所以还是需要不断地总结的,学而时习之,不亦说乎
羞,Java 字符串拼接竟然有这么多姿势
二哥,我今年大二,看你分享的《阿里巴巴 Java 开发手册》上有一段内容说:“循环体内,拼接字符串最好使用 StringBuilder 的 append 方法,而不是 + 号操作符。”到底为什么啊,我平常一直就用的‘+’号操作符啊!二哥有空的时候能否写一篇文章分析一下呢? 就在昨天,一位叫小菜的读者微信我说了上面这段话。 我当时看到这条微信的第一感觉是:小菜你也太菜了吧,这都不知道为啥啊!我估
"狗屁不通文章生成器"登顶GitHub热榜,分分钟写出万字形式主义大作
GitHub 被誉为全球最大的同性交友网站,……,陪伴我们已经走过 10+ 年时间,它托管了大量的软件代码,同时也承载了程序员无尽的欢乐。 万字申请,废话报告,魔幻形式主义大作怎么写?兄dei,狗屁不通文章生成器了解一下。这个富有灵魂的项目名吸引了众人的目光。项目仅仅诞生一周,便冲上了GitHub趋势榜榜首(Js中文网 -前端进阶资源教程)、是榜首哦
推荐几款比较实用的工具,网站
1.盘百度PanDownload   这个云盘工具是免费的,可以进行资源搜索,提速(偶尔会抽风......) 不要去某站买付费的......   PanDownload下载地址   2.BeJSON 这是一款拥有各种在线工具的网站,推荐它的主要原因是网站简洁,功能齐全,广告相比其他广告好太多了     bejson网站   3.二维码美化 这个网站的二维码美化很好看,网站界面
《程序人生》系列-这个程序员只用了20行代码就拿了冠军
你知道的越多,你不知道的越多 点赞再看,养成习惯GitHub上已经开源https://github.com/JavaFamily,有一线大厂面试点脑图,欢迎Star和完善 前言 这一期不算《吊打面试官》系列的,所有没前言我直接开始。 絮叨 本来应该是没有这期的,看过我上期的小伙伴应该是知道的嘛,双十一比较忙嘛,要值班又要去帮忙拍摄年会的视频素材,还得搞个程序员一天的Vlog,还要写BU...
程序员把地府后台管理系统做出来了,还有3.0版本!12月7号最新消息:已在开发中有github地址
第一幕:缘起 听说阎王爷要做个生死簿后台管理系统,我们派去了一个程序员…… 996程序员做的梦: 第一场:团队招募 为了应对地府管理危机,阎王打算找“人”开发一套地府后台管理系统,于是就在地府总经办群中发了项目需求。 话说还是中国电信的信号好,地府都是满格,哈哈!!! 经常会有外行朋友问:看某网站做的不错,功能也简单,你帮忙做一下? 而这次,面对这样的需求,这个程序员...
网易云6亿用户音乐推荐算法
网易云音乐是音乐爱好者的集聚地,云音乐推荐系统致力于通过 AI 算法的落地,实现用户千人千面的个性化推荐,为用户带来不一样的听歌体验。 本次分享重点介绍 AI 算法在音乐推荐中的应用实践,以及在算法落地过程中遇到的挑战和解决方案。 将从如下两个部分展开: AI算法在音乐推荐中的应用 音乐场景下的 AI 思考 从 2013 年 4 月正式上线至今,网易云音乐平台持续提供着:乐屏社区、UGC...
8年经验面试官详解 Java 面试秘诀
作者 |胡书敏 责编 | 刘静 出品 | CSDN(ID:CSDNnews) 本人目前在一家知名外企担任架构师,而且最近八年来,在多家外企和互联网公司担任Java技术面试官,前后累计面试了有两三百位候选人。在本文里,就将结合本人的面试经验,针对Java初学者、Java初级开发和Java开发,给出若干准备简历和准备面试的建议。 Java程序员准备和投递简历的实...
面试官如何考察你的思维方式?
1.两种思维方式在求职面试中,经常会考察这种问题:北京有多少量特斯拉汽车?某胡同口的煎饼摊一年能卖出多少个煎饼?深圳有多少个产品经理?一辆公交车里能装下多少个乒乓球?一个正常成年人有多少根头发?这类估算问题,被称为费米问题,是以科学家费米命名的。为什么面试会问这种问题呢?这类问题能把两类人清楚地区分出来。一类是具有文科思维的人,擅长赞叹和模糊想象,它主要依靠的是人的第一反应和直觉,比如小孩...
相关热词 c#处理浮点数 c# 生成字母数字随机数 c# 动态曲线 控件 c# oracle 开发 c#选择字体大小的控件 c# usb 批量传输 c#10进制转8进制 c#转base64 c# 科学计算 c#下拉列表获取串口
立即提问